maven-notifications mailing list archives: December 2007

Site index · List index
Message list1 · 2 · Next »Thread · Author · Date
Contin...@maven.zones.apache.org [continuum] BUILD FAILURE: Continuum API Sat, 01 Dec, 08:42
Contin...@maven.zones.apache.org [continuum] BUILD SUCCESSFUL: Maven Assembly Plugin Sat, 01 Dec, 08:48
Contin...@maven.zones.apache.org [continuum] BUILD FAILURE: Maven Jar Plugin Sat, 01 Dec, 09:24
Contin...@maven.zones.apache.org [continuum] BUILD FAILURE: Maven PMD Plugin Sat, 01 Dec, 09:30
Contin...@maven.zones.apache.org [continuum] BUILD FAILURE: Maven Assembly Plugin Sat, 01 Dec, 13:50
Contin...@maven.zones.apache.org [continuum] BUILD FAILURE: Maven Jar Plugin Sat, 01 Dec, 14:17
Contin...@maven.zones.apache.org [continuum] BUILD FAILURE: Maven PMD Plugin Sat, 01 Dec, 14:21
Contin...@maven.zones.apache.org [continuum] BUILD FAILURE: Maven Remote Resources Plugin Sat, 01 Dec, 14:38
Contin...@maven.zones.apache.org [continuum] BUILD SUCCESSFUL: Maven Jar Plugin Mon, 03 Dec, 09:52
Contin...@maven.zones.apache.org [continuum] BUILD FAILURE: Maven Assembly Plugin Mon, 03 Dec, 13:13
Contin...@maven.zones.apache.org [continuum] BUILD FAILURE: Maven PMD Plugin Mon, 03 Dec, 13:39
Contin...@maven.zones.apache.org [continuum] BUILD FAILURE: Maven Remote Resources Plugin Mon, 03 Dec, 13:51
Contin...@maven.zones.apache.org [continuum] BUILD FAILURE: Integration Test Executor Tue, 04 Dec, 10:07
Contin...@maven.zones.apache.org [continuum] BUILD FAILURE: Maven Assembly Plugin Tue, 04 Dec, 13:23
Contin...@maven.zones.apache.org [continuum] BUILD FAILURE: Maven PMD Plugin Tue, 04 Dec, 13:48
Contin...@maven.zones.apache.org [continuum] BUILD FAILURE: Maven Remote Resources Plugin Tue, 04 Dec, 14:02
Contin...@maven.zones.apache.org [continuum] BUILD FAILURE: Integration Test Executor Tue, 04 Dec, 18:50
Contin...@maven.zones.apache.org [continuum] BUILD FAILURE: Integration Test Executor Tue, 04 Dec, 22:48
Contin...@maven.zones.apache.org [continuum] BUILD FAILURE: Integration Test Executor Wed, 05 Dec, 01:24
Contin...@maven.zones.apache.org [continuum] BUILD FAILURE: Maven Assembly Plugin Wed, 05 Dec, 02:06
Contin...@maven.zones.apache.org [continuum] BUILD FAILURE: Maven PMD Plugin Wed, 05 Dec, 02:35
Contin...@maven.zones.apache.org [continuum] BUILD FAILURE: Maven Remote Resources Plugin Wed, 05 Dec, 02:43
Contin...@maven.zones.apache.org [continuum] BUILD FAILURE: Integration Test Executor Wed, 05 Dec, 03:44
Contin...@maven.zones.apache.org [continuum] BUILD FAILURE: Maven Surefire Plugin Wed, 05 Dec, 10:38
Contin...@maven.zones.apache.org [continuum] BUILD FAILURE: Integration Test Executor Sat, 08 Dec, 14:31
Contin...@maven.zones.apache.org [continuum] BUILD SUCCESSFUL: Maven Remote Resources Plugin Sat, 08 Dec, 14:56
Contin...@maven.zones.apache.org [continuum] BUILD SUCCESSFUL: Maven Surefire Plugin Sat, 08 Dec, 15:02
Contin...@maven.zones.apache.org [continuum] BUILD FAILURE: SureFire Providers Sat, 08 Dec, 17:29
Contin...@maven.zones.apache.org [continuum] BUILD FAILURE: SureFire JUnit Runner Sat, 08 Dec, 17:29
Contin...@maven.zones.apache.org [continuum] BUILD FAILURE: SureFire JUnit4 Runner Sat, 08 Dec, 17:30
Contin...@maven.zones.apache.org [continuum] BUILD FAILURE: SureFire TestNG Runner Sat, 08 Dec, 17:30
Contin...@maven.zones.apache.org [continuum] BUILD SUCCESSFUL: SureFire Providers Sat, 08 Dec, 18:56
Contin...@maven.zones.apache.org [continuum] BUILD SUCCESSFUL: SureFire JUnit Runner Sat, 08 Dec, 18:56
Contin...@maven.zones.apache.org [continuum] BUILD SUCCESSFUL: SureFire JUnit4 Runner Sat, 08 Dec, 18:57
Contin...@maven.zones.apache.org [continuum] BUILD SUCCESSFUL: SureFire TestNG Runner Sat, 08 Dec, 18:57
Contin...@maven.zones.apache.org [continuum] BUILD FAILURE: Maven Assembly Plugin Sat, 08 Dec, 19:08
Contin...@maven.zones.apache.org [continuum] BUILD FAILURE: Archiva Web :: Application Wed, 12 Dec, 21:23
Contin...@maven.zones.apache.org [continuum] BUILD FAILURE: Integration Test Executor Wed, 12 Dec, 21:52
Contin...@maven.zones.apache.org [continuum] BUILD FAILURE: Maven Archiver Wed, 12 Dec, 21:55
Contin...@maven.zones.apache.org [continuum] BUILD FAILURE: SureFire API Wed, 12 Dec, 22:26
Contin...@maven.zones.apache.org [continuum] BUILD FAILURE: SureFire Booter Wed, 12 Dec, 22:27
Contin...@maven.zones.apache.org [continuum] BUILD SUCCESSFUL: Archiva Web :: Application Wed, 12 Dec, 22:46
Contin...@maven.zones.apache.org [continuum] BUILD FAILURE: Archiva Base :: Configuration Thu, 13 Dec, 21:09
Contin...@maven.zones.apache.org [continuum] BUILD FAILURE: Integration Test Executor Thu, 13 Dec, 21:41
Contin...@maven.zones.apache.org [continuum] BUILD FAILURE: SureFire API Thu, 13 Dec, 23:44
Contin...@maven.zones.apache.org [continuum] BUILD FAILURE: SureFire Booter Thu, 13 Dec, 23:44
Contin...@maven.zones.apache.org [continuum] BUILD SUCCESSFUL: Maven Archiver Thu, 13 Dec, 23:52
Contin...@maven.zones.apache.org [continuum] BUILD FAILURE: Maven Shared File Management API Thu, 13 Dec, 23:55
Contin...@maven.zones.apache.org [continuum] BUILD FAILURE: Integration Test Executor Fri, 14 Dec, 01:31
Contin...@maven.zones.apache.org [continuum] BUILD FAILURE: Archiva Base :: Configuration Fri, 14 Dec, 01:51
Contin...@maven.zones.apache.org [continuum] BUILD FAILURE: Maven Assembly Plugin Fri, 14 Dec, 02:10
Contin...@maven.zones.apache.org [continuum] BUILD FAILURE: Maven PMD Plugin Fri, 14 Dec, 02:35
Contin...@maven.zones.apache.org [continuum] BUILD FAILURE: Continuum API Fri, 14 Dec, 02:53
Contin...@maven.zones.apache.org [continuum] BUILD SUCCESSFUL: Archiva Base :: Configuration Fri, 14 Dec, 07:13
Contin...@maven.zones.apache.org [continuum] BUILD SUCCESSFUL: Continuum API Fri, 14 Dec, 07:31
Contin...@maven.zones.apache.org [continuum] BUILD FAILURE: Integration Test Executor Sat, 15 Dec, 16:35
Contin...@maven.zones.apache.org [continuum] BUILD FAILURE: SureFire Booter Sat, 15 Dec, 18:43
Contin...@maven.zones.apache.org [continuum] BUILD FAILURE: Maven Surefire Plugin Sat, 15 Dec, 18:44
Contin...@maven.zones.apache.org [continuum] BUILD SUCCESSFUL: SureFire API Sat, 15 Dec, 18:45
Contin...@maven.zones.apache.org [continuum] BUILD SUCCESSFUL: SureFire Booter Sat, 15 Dec, 18:45
Contin...@maven.zones.apache.org [continuum] BUILD FAILURE: SureFire JUnit Runner Sat, 15 Dec, 18:48
Contin...@maven.zones.apache.org [continuum] BUILD FAILURE: SureFire JUnit4 Runner Sat, 15 Dec, 18:48
Contin...@maven.zones.apache.org [continuum] BUILD FAILURE: SureFire TestNG Runner Sat, 15 Dec, 18:49
Contin...@maven.zones.apache.org [continuum] BUILD FAILURE: Maven Assembly Plugin Sat, 15 Dec, 19:07
Contin...@maven.zones.apache.org [continuum] BUILD FAILURE: Maven PMD Plugin Sat, 15 Dec, 19:31
Contin...@maven.zones.apache.org [continuum] BUILD FAILURE: Integration Test Executor Sun, 16 Dec, 18:30
Contin...@maven.zones.apache.org [continuum] BUILD FAILURE: Maven Assembly Plugin Sun, 16 Dec, 19:10
Contin...@maven.zones.apache.org [continuum] BUILD FAILURE: Maven PMD Plugin Sun, 16 Dec, 19:32
Contin...@maven.zones.apache.org [continuum] BUILD SUCCESSFUL: Maven Embedder Sun, 16 Dec, 21:26
Contin...@maven.zones.apache.org [continuum] BUILD FAILURE: Enforcer Rules Mon, 17 Dec, 22:10
Contin...@maven.zones.apache.org [continuum] BUILD FAILURE: Integration Test Executor Mon, 17 Dec, 22:48
Contin...@maven.zones.apache.org [continuum] BUILD FAILURE: Integration Test Executor Tue, 18 Dec, 21:35
Contin...@maven.zones.apache.org [continuum] BUILD ERROR: maven-dotnet-parent Fri, 21 Dec, 20:42
Contin...@maven.zones.apache.org [continuum] BUILD ERROR: maven-dotnet-plugins Fri, 21 Dec, 20:42
Contin...@maven.zones.apache.org [continuum] BUILD ERROR: maven-dotnet-components Fri, 21 Dec, 20:43
Contin...@maven.zones.apache.org [continuum] BUILD ERROR: maven-dotnet-core Fri, 21 Dec, 20:43
Contin...@maven.zones.apache.org [continuum] BUILD ERROR: maven-dotnet-compiler Fri, 21 Dec, 20:43
Contin...@maven.zones.apache.org [continuum] BUILD ERROR: maven-dotnet-assembler Fri, 21 Dec, 20:43
Contin...@maven.zones.apache.org [continuum] BUILD ERROR: maven-dotnet-extensions Fri, 21 Dec, 20:43
Contin...@maven.zones.apache.org [continuum] BUILD ERROR: maven-compiler-plugin Fri, 21 Dec, 20:43
Contin...@maven.zones.apache.org [continuum] BUILD SUCCESSFUL: NMaven Fri, 21 Dec, 20:53
Contin...@maven.zones.apache.org [continuum] BUILD SUCCESSFUL: maven-dotnet-plugins Fri, 21 Dec, 20:53
Contin...@maven.zones.apache.org [continuum] BUILD SUCCESSFUL: maven-dotnet-components Fri, 21 Dec, 20:54
Contin...@maven.zones.apache.org [continuum] BUILD SUCCESSFUL: maven-dotnet-core Fri, 21 Dec, 20:54
Contin...@maven.zones.apache.org [continuum] BUILD SUCCESSFUL: maven-dotnet-compiler Fri, 21 Dec, 20:54
Contin...@maven.zones.apache.org [continuum] BUILD SUCCESSFUL: maven-dotnet-assembler Fri, 21 Dec, 20:55
Contin...@maven.zones.apache.org [continuum] BUILD FAILURE: maven-compiler-plugin Fri, 21 Dec, 22:42
Contin...@maven.zones.apache.org [continuum] BUILD SUCCESSFUL: maven-dotnet-extensions Fri, 21 Dec, 22:42
Contin...@maven.zones.apache.org [continuum] BUILD SUCCESSFUL: maven-compiler-plugin Fri, 21 Dec, 22:53
Contin...@maven.zones.apache.org [continuum] BUILD FAILURE: Archiva Web :: Application Fri, 21 Dec, 23:18
Contin...@maven.zones.apache.org [continuum] BUILD FAILURE: Maven Archiver Fri, 21 Dec, 23:25
Contin...@maven.zones.apache.org [continuum] BUILD FAILURE: Maven Checkstyle Plugin Fri, 21 Dec, 23:27
Contin...@maven.zones.apache.org [continuum] BUILD FAILURE: Maven Remote Resources Plugin Fri, 21 Dec, 23:36
Contin...@maven.zones.apache.org [continuum] BUILD FAILURE: Maven War Plugin Fri, 21 Dec, 23:43
Contin...@maven.zones.apache.org [continuum] BUILD ERROR: Archiva Sat, 22 Dec, 02:07
Contin...@maven.zones.apache.org [continuum] BUILD ERROR: Archiva Sat, 22 Dec, 04:48
Contin...@maven.zones.apache.org [continuum] BUILD ERROR: Archiva Sat, 22 Dec, 05:35
Contin...@maven.zones.apache.org [continuum] BUILD ERROR: Archiva Sat, 22 Dec, 06:19
Contin...@maven.zones.apache.org [continuum] BUILD ERROR: Archiva Sat, 22 Dec, 16:10
Contin...@maven.zones.apache.org [continuum] BUILD SUCCESSFUL: Maven Archiver Sat, 22 Dec, 17:19
Message list1 · 2 · Next »Thread · Author · Date
Box list
Jul 2014313
Jun 2014341
May 2014161
Apr 2014146
Mar 2014336
Feb 2014308
Jan 2014189
Dec 2013319
Nov 2013274
Oct 2013167
Sep 2013486
Aug 2013263
Jul 2013726
Jun 2013722
May 2013378
Apr 2013313
Mar 2013467
Feb 2013520
Jan 20131437
Dec 20121778
Nov 2012775
Oct 20121224
Sep 2012791
Aug 2012362
Jul 2012232
Jun 2012149
May 2012189
Apr 2012115
Mar 201257
Feb 2012155
Jan 2012170
Dec 2011244
Nov 2011187
Oct 2011139
Sep 2011190
Aug 2011276
Jul 201194
Jun 20114
Apr 201162
Mar 201176
Feb 201154
Jan 201185
Dec 201079
Nov 201061
Oct 201058
Sep 20101
Aug 201057
Jul 201037
Jun 201020
May 201075
Apr 201053
Mar 201012
Feb 201030
Jan 201071
Dec 2009104
Nov 200919
Oct 200931
Sep 2009193
Aug 2009268
Jul 2009193
Jun 2009147
May 200975
Apr 200979
Mar 2009134
Feb 2009657
Jan 200983
Dec 2008349
Nov 2008288
Oct 2008986
Sep 2008842
Aug 2008707
Jul 2008887
Jun 2008167
May 200821
Apr 2008231
Mar 2008438
Feb 2008317
Jan 2008205
Dec 2007185
Nov 2007532
Oct 2007439
Sep 2007699
Aug 20071294
Jul 2007351
Jun 20072211
May 2007273
Apr 2007262
Mar 2007534
Feb 20071648
Jan 20072359
Dec 2006575
Nov 2006357
Oct 2006642
Sep 2006660
Aug 20061662
Jul 20061320
Jun 2006473
May 20064700
Apr 20061113
Mar 20061048