maven-notifications mailing list archives

Site index · List index
Message view « Date » · « Thread »
Top « Date » · « Thread »
From "Continuum@maven.zones.apache.org" <contin...@maven.zones.apache.org>
Subject [continuum] BUILD FAILURE: Maven Remote Resources Plugin
Date Sat, 01 Dec 2007 14:38:44 GMT
Online report : http://maven.zones.apache.org/continuum/buildResult.action?buildId=38304&projectId=382

Build statistics:
  State: Failed
  Previous State: Failed
  Started at: Sat 1 Dec 2007 14:38:28 +0000
  Finished at: Sat 1 Dec 2007 14:38:43 +0000
  Total time: 14s
  Build Trigger: Schedule
  Build Number: 59
  Exit code: 1
  Building machine hostname: maven.zones.apache.org
  Operating system : SunOS(unknown)
  Java Home version : 
          java version "1.4.2_09"
          Java(TM) 2 Runtime Environment, Standard Edition (build 1.4.2_09-b05)
          Java HotSpot(TM) Client VM (build 1.4.2_09-b05, mixed mode)
        
  Builder version :
          Maven version: 2.0.7
          Java version: 1.4.2_09
          OS name: "sunos" version: "5.10" arch: "x86"
    
****************************************************************************
SCM Changes:
****************************************************************************
No files changed

****************************************************************************
Dependencies Changes:
****************************************************************************
No dependencies changed


****************************************************************************
Build Defintion:
****************************************************************************
POM filename: pom.xml
Goals: clean install   
Arguments: --batch-mode --non-recursive -P integration-tests
Build Fresh: true
Always Build: true
Default Build Definition: false
Schedule: Integration Test Run
Profile Name: JDK 1.4.2
Description: 


****************************************************************************
Test Summary:
****************************************************************************
Tests: 0
Failures: 0
Total time: 0

****************************************************************************
Output:
****************************************************************************
[INFO] Scanning for projects...
[INFO] ----------------------------------------------------------------------------
[INFO] Building Maven Remote Resources Plugin
[INFO]    task-segment: [clean, install]
[INFO] ----------------------------------------------------------------------------
[INFO] [clean:clean]
[INFO] [modello:xpp3-writer {execution: remote-resources}]
[INFO] outputDirectory: /export/home/build/data/continuum/checkouts/382/target/generated-sources/modello
[INFO] Generating current version: 1.0.0
[INFO] [modello:java {execution: remote-resources}]
[INFO] outputDirectory: /export/home/build/data/continuum/checkouts/382/target/generated-sources/modello
[INFO] Generating current version: 1.0.0
[INFO] [modello:xpp3-reader {execution: remote-resources}]
[INFO] outputDirectory: /export/home/build/data/continuum/checkouts/382/target/generated-sources/modello
[INFO] Generating current version: 1.0.0
[INFO] [modello:xpp3-writer {execution: supplemental-models}]
[INFO] outputDirectory: /export/home/build/data/continuum/checkouts/382/target/generated-sources/modello
[INFO] Generating current version: 1.0.0
[INFO] [modello:java {execution: supplemental-models}]
[INFO] outputDirectory: /export/home/build/data/continuum/checkouts/382/target/generated-sources/modello
[INFO] Generating current version: 1.0.0
[INFO] [modello:xpp3-reader {execution: supplemental-models}]
[INFO] outputDirectory: /export/home/build/data/continuum/checkouts/382/target/generated-sources/modello
[INFO] Generating current version: 1.0.0
[INFO] [plugin:descriptor]
[INFO] Using 2 extractors.
[INFO] Applying extractor for language: java
[INFO] Extractor for language: java found 2 mojo descriptors.
[INFO] Applying extractor for language: bsh
[INFO] Extractor for language: bsh found 0 mojo descriptors.
[INFO] Setting property: classpath.resource.loader.class => 'org.codehaus.plexus.velocity.ContextClassLoaderResourceLoader'.
[INFO] Setting property: velocimacro.messages.on => 'false'.
[INFO] Setting property: resource.loader => 'classpath'.
[INFO] Setting property: resource.manager.logwhenfound => 'false'.
[INFO] [remote-resources:process {execution: default}]
[INFO] [resources:resources]
[INFO] Using default encoding to copy filtered resources.
[INFO] Copying 1 resource
[INFO] Copying 2 resources
[INFO] [compiler:compile]
[INFO] Compiling 10 source files to /export/home/build/data/continuum/checkouts/382/target/classes
[INFO] ------------------------------------------------------------------------
[ERROR] BUILD FAILURE
[INFO] ------------------------------------------------------------------------
[INFO] Compilation failure
/export/home/build/data/continuum/checkouts/382/src/main/java/org/apache/maven/plugin/resources/remote/RemoteResourcesClassLoader.java:[56,23]
getResources(java.lang.String) in org.apache.maven.plugin.resources.remote.RemoteResourcesClassLoader
cannot override getResources(java.lang.String) in java.lang.ClassLoader; overridden method
is final



/export/home/build/data/continuum/checkouts/382/src/main/java/org/apache/maven/plugin/resources/remote/RemoteResourcesClassLoader.java:[56,23]
getResources(java.lang.String) in org.apache.maven.plugin.resources.remote.RemoteResourcesClassLoader
cannot override getResources(java.lang.String) in java.lang.ClassLoader; overridden method
is final


[INFO] ------------------------------------------------------------------------
[INFO] For more information, run Maven with the -e switch
[INFO] ------------------------------------------------------------------------
[INFO] Total time: 12 seconds
[INFO] Finished at: Sat Dec 01 14:38:42 GMT+00:00 2007
[INFO] Final Memory: 21M/45M
[INFO] ------------------------------------------------------------------------

****************************************************************************



Mime
View raw message