maven-notifications mailing list archives

Site index · List index
Message view « Date » · « Thread »
Top « Date » · « Thread »
From "Continuum@maven.zones.apache.org" <contin...@maven.zones.apache.org>
Subject [continuum] BUILD FAILURE: Archiva Web :: Application
Date Wed, 12 Dec 2007 21:23:18 GMT
Online report : http://maven.zones.apache.org/continuum/buildResult.action?buildId=38698&projectId=296

Build statistics:
  State: Failed
  Previous State: Ok
  Started at: Wed 12 Dec 2007 21:20:36 +0000
  Finished at: Wed 12 Dec 2007 21:23:12 +0000
  Total time: 2m 36s
  Build Trigger: Schedule
  Build Number: 198
  Exit code: 1
  Building machine hostname: maven.zones.apache.org
  Operating system : SunOS(unknown)
  Java Home version : 
          java version "1.5.0_13"
          Java(TM) 2 Runtime Environment, Standard Edition (build 1.5.0_13-b05)
          Java HotSpot(TM) Server VM (build 1.5.0_13-b05, mixed mode)
        
  Builder version :
          Maven version: 2.0.7
          Java version: 1.5.0_13
          OS name: "sunos" version: "5.10" arch: "x86"
    
****************************************************************************
SCM Changes:
****************************************************************************
No files changed

****************************************************************************
Dependencies Changes:
****************************************************************************
org.apache.maven.archiva:archiva-report-manager:1.1-SNAPSHOT

org.apache.maven.archiva:archiva-scheduled:1.1-SNAPSHOT

org.apache.maven.archiva:archiva-indexer:1.1-SNAPSHOT

org.apache.maven.archiva:archiva-proxy:1.1-SNAPSHOT

org.apache.maven.archiva:archiva-database:1.1-SNAPSHOT

org.apache.maven.archiva:archiva-repository-layer:1.1-SNAPSHOT

org.apache.maven.archiva:archiva-security:1.1-SNAPSHOT

org.apache.maven.archiva:archiva-core-consumers:1.1-SNAPSHOT

org.apache.maven.archiva:archiva-database-consumers:1.1-SNAPSHOT

org.apache.maven.archiva:archiva-lucene-consumers:1.1-SNAPSHOT

org.apache.maven.archiva:archiva-signature-consumers:1.1-SNAPSHOT

org.apache.maven.archiva:archiva-applet:1.1-SNAPSHOT

org.apache.maven.archiva:archiva-web:1.1-SNAPSHOT


****************************************************************************
Build Defintion:
****************************************************************************
POM filename: pom.xml
Goals: clean install   
Arguments: --batch-mode --non-recursive
Build Fresh: false
Always Build: false
Default Build Definition: true
Schedule: DEFAULT_SCHEDULE
Description: 


****************************************************************************
Test Summary:
****************************************************************************
Tests: 2067
Failures: 1
Total time: 112109

****************************************************************************
Output:
****************************************************************************
[INFO] Scanning for projects...
[INFO] ----------------------------------------------------------------------------
[INFO] Building Archiva Web :: Application
[INFO]    task-segment: [clean, install]
[INFO] ----------------------------------------------------------------------------
[INFO] [clean:clean]
[INFO] Deleting directory /export/home/build/data/continuum/checkouts/296/target
[INFO] Deleting directory /export/home/build/data/continuum/checkouts/296/target/classes
[INFO] Deleting directory /export/home/build/data/continuum/checkouts/296/target/test-classes
[INFO] Deleting directory /export/home/build/data/continuum/checkouts/296/target/site
[INFO] Deleting file-set: /export/home/build/data/continuum/checkouts/296/src/main/webapp (included: [META-INF, images/redback, template/redback, WEB-INF/classes, WEB-INF/lib, WEB-INF/database, WEB-INF/logs, redback, css/redback, WEB-INF/jsp/redback, WEB-INF/template/redback, WEB-INF/logs, WEB-INF/temp, WEB-INF/jasperreports], excluded: [])
[INFO] [plexus:descriptor {execution: generate}]
[INFO] snapshot org.apache.maven.archiva:archiva-scheduled:1.1-SNAPSHOT: checking for updates from apache.snapshots
[INFO] snapshot org.apache.maven.archiva:archiva-proxy:1.1-SNAPSHOT: checking for updates from apache.snapshots
[INFO] snapshot org.apache.maven.archiva:archiva-security:1.1-SNAPSHOT: checking for updates from apache.snapshots
[INFO] snapshot org.apache.maven.archiva:archiva-lucene-consumers:1.1-SNAPSHOT: checking for updates from apache.snapshots
[INFO] snapshot org.apache.maven.archiva:archiva-signature-consumers:1.1-SNAPSHOT: checking for updates from apache.snapshots
[INFO] snapshot org.apache.maven.archiva:archiva-applet:1.1-SNAPSHOT: checking for updates from apache.snapshots
[INFO] Setting property: classpath.resource.loader.class => 'org.codehaus.plexus.velocity.ContextClassLoaderResourceLoader'.
[INFO] Setting property: velocimacro.messages.on => 'false'.
[INFO] Setting property: resource.loader => 'classpath'.
[INFO] Setting property: resource.manager.logwhenfound => 'false'.
[INFO] [remote-resources:process {execution: default}]
[INFO] [antrun:run {execution: default}]
[INFO] Executing tasks
     [copy] Copying 2 files to /export/home/build/data/continuum/checkouts/296/target/appserver-base
[INFO] Executed tasks
[INFO] [resources:resources]
[INFO] Using default encoding to copy filtered resources.
[INFO] Copying 26 resources
[INFO] Copying 1 resource
[INFO] Copying 2 resources
[INFO] [dependency:copy {execution: copy}]
[INFO] Configured Artifact: org.apache.maven.archiva:archiva-applet:null:1.1-SNAPSHOT:jar
[INFO] archiva-applet-1.1-SNAPSHOT.jar already exists.
[INFO] [compiler:compile]
[INFO] Compiling 63 source files to /export/home/build/data/continuum/checkouts/296/target/classes
[INFO] [war:inplace {execution: default}]
[INFO] Generating webapp in source directory... /export/home/build/data/continuum/checkouts/296/src/main/webapp
[INFO] Exploding webapp...
[INFO] Assembling webapp archiva-webapp in /export/home/build/data/continuum/checkouts/296/src/main/webapp
[INFO] Expanding: /export/home/build/.m2/repository/org/codehaus/plexus/redback/redback-xwork-content/1.0-alpha-4/redback-xwork-content-1.0-alpha-4.war into /export/home/build/data/continuum/checkouts/296/target/war/work/redback-xwork-content-1.0-alpha-4
[INFO] Overlaying 1 war(s).
[INFO] [resources:testResources]
[INFO] Using default encoding to copy filtered resources.
[INFO] Copying 12 resources
[INFO] Copying 2 resources
[INFO] [compiler:testCompile]
[INFO] Compiling 39 source files to /export/home/build/data/continuum/checkouts/296/target/test-classes
[INFO] [surefire:test]
[INFO] Surefire report directory: /export/home/build/data/continuum/checkouts/296/target/surefire-reports

-------------------------------------------------------
 T E S T S
-------------------------------------------------------
Running org.apache.maven.archiva.web.repository.RepositoryServletNoProxyMetadataTest
 WARN|main|    0|ConfigurationFactory           - No configuration found. Configuring ehcache from ehcache-failsafe.xml  found in the classpath: jar:file:/export/home/build/.m2/repository/net/sf/ehcache/ehcache/1.3.0/ehcache-1.3.0.jar!/ehcache-failsafe.xml
Rhino classes (js.jar) not found - Javascript disabled
 INFO|main| 2648|AuditLog                       - internal guest 127.0.0.1 "/commons-lang/commons-lang/2.1/maven-metadata.xml" "Modify File (proxied)"
There was no such logger 'org.codehaus.plexus.redback.xwork.filter.authentication.HttpAuthenticator:basic' 19116636.
 INFO|main| 2712|Cache:url-failures-cache       - Disposing cache: [ name = url-failures-cache status = STATUS_ALIVE eternal = false overflowToDisk = false maxElementsInMemory = 1000 maxElementsOnDisk = 0 memoryStoreEvictionPolicy = LRU timeToLiveSeconds = 1800 timeToIdleSeconds = 2700 diskPersistent = false diskExpiryThreadIntervalSeconds = 600 cacheEventListeners:  hitCount = 0 memoryStoreHitCount = 0 diskStoreHitCount = 0 missCountNotFound = 0 missCountExpired = 0 ]
 WARN|main| 2712|PlexusContainer                - Component manager not found for returned component. Ignored. component=org.apache.maven.archiva.web.repository.ProxiedDavServer@6db724
 INFO|main| 3420|AuditLog                       - internal guest 127.0.0.1 "/commons-lang/commons-lang/maven-metadata.xml" "Modify File (proxied)"
 INFO|main| 3446|Cache:url-failures-cache       - Disposing cache: [ name = url-failures-cache status = STATUS_ALIVE eternal = false overflowToDisk = false maxElementsInMemory = 1000 maxElementsOnDisk = 0 memoryStoreEvictionPolicy = LRU timeToLiveSeconds = 1800 timeToIdleSeconds = 2700 diskPersistent = false diskExpiryThreadIntervalSeconds = 600 cacheEventListeners:  hitCount = 0 memoryStoreHitCount = 0 diskStoreHitCount = 0 missCountNotFound = 0 missCountExpired = 0 ]
There was no such logger 'org.codehaus.plexus.redback.xwork.filter.authentication.HttpAuthenticator:basic' 12482247.
 WARN|main| 3446|PlexusContainer                - Component manager not found for returned component. Ignored. component=org.apache.maven.archiva.web.repository.ProxiedDavServer@18a9fc8
 INFO|main| 4419|AuditLog                       - internal guest 127.0.0.1 "/org/apache/maven/plugins/maven-assembly-plugin/2.2-beta-2-SNAPSHOT/maven-metadata.xml" "Modify File (proxied)"
 INFO|main| 4422|Cache:url-failures-cache       - Disposing cache: [ name = url-failures-cache status = STATUS_ALIVE eternal = false overflowToDisk = false maxElementsInMemory = 1000 maxElementsOnDisk = 0 memoryStoreEvictionPolicy = LRU timeToLiveSeconds = 1800 timeToIdleSeconds = 2700 diskPersistent = false diskExpiryThreadIntervalSeconds = 600 cacheEventListeners:  hitCount = 0 memoryStoreHitCount = 0 diskStoreHitCount = 0 missCountNotFound = 0 missCountExpired = 0 ]
There was no such logger 'org.codehaus.plexus.redback.xwork.filter.authentication.HttpAuthenticator:basic' 15580729.
 WARN|main| 4422|PlexusContainer                - Component manager not found for returned component. Ignored. component=org.apache.maven.archiva.web.repository.ProxiedDavServer@14b6b02
Tests run: 3, Failures: 0, Errors: 0, Skipped: 0, Time elapsed: 6.514 sec
Running org.apache.maven.archiva.web.repository.ArchivaMimeTypeLoaderTest
Tests run: 1, Failures: 0, Errors: 0, Skipped: 0, Time elapsed: 0.197 sec
Running org.apache.maven.archiva.web.repository.RepositoryServletProxiedPluginSnapshotPolicyTest
 INFO|main| 4857|log                            - Logging to org.slf4j.impl.Log4jLoggerAdapter(org.mortbay.log) via org.mortbay.log.Slf4jLog
 INFO|main| 4903|log                            - jetty-6.1.5
 INFO|main| 4970|log                            - Started SocketConnector@0.0.0.0:41585
Remote HTTP Server started on http://localhost:41585/snapshots
 INFO|main| 6341|Cache:url-failures-cache       - Disposing cache: [ name = url-failures-cache status = STATUS_ALIVE eternal = false overflowToDisk = false maxElementsInMemory = 1000 maxElementsOnDisk = 0 memoryStoreEvictionPolicy = LRU timeToLiveSeconds = 1800 timeToIdleSeconds = 2700 diskPersistent = false diskExpiryThreadIntervalSeconds = 600 cacheEventListeners:  hitCount = 0 memoryStoreHitCount = 0 diskStoreHitCount = 0 missCountNotFound = 0 missCountExpired = 0 ]
 WARN|main| 6342|PlexusContainer                - Component manager not found for returned component. Ignored. component=org.apache.maven.archiva.web.repository.ProxiedDavServer@f81402
There was no such logger 'org.codehaus.plexus.redback.xwork.filter.authentication.HttpAuthenticator:basic' 29796765.
 INFO|main| 6707|log                            - jetty-6.1.5
 INFO|main| 6708|log                            - Started SocketConnector@0.0.0.0:41588
Remote HTTP Server started on http://localhost:-1/snapshots
There was no such logger 'org.apache.maven.archiva.configuration.ArchivaConfiguration:default' 15268037.
 INFO|main| 6821|Cache:url-failures-cache       - Disposing cache: [ name = url-failures-cache status = STATUS_ALIVE eternal = false overflowToDisk = false maxElementsInMemory = 1000 maxElementsOnDisk = 0 memoryStoreEvictionPolicy = LRU timeToLiveSeconds = 1800 timeToIdleSeconds = 2700 diskPersistent = false diskExpiryThreadIntervalSeconds = 600 cacheEventListeners:  hitCount = 0 memoryStoreHitCount = 0 diskStoreHitCount = 0 missCountNotFound = 0 missCountExpired = 0 ]
 INFO|main| 7000|log                            - jetty-6.1.5
 INFO|main| 7001|log                            - Started SocketConnector@0.0.0.0:41590
Remote HTTP Server started on http://localhost:41590/snapshots
 INFO|main| 8542|AuditLog                       - internal guest 127.0.0.1 "org/apache/archiva/archivatest-maven-plugin/4.0-alpha-1-SNAPSHOT/archivatest-maven-plugin-4.0-alpha-1-20070822.033400-42.jar" "Modify File (proxied)"
 INFO|main| 8671|Cache:url-failures-cache       - Disposing cache: [ name = url-failures-cache status = STATUS_ALIVE eternal = false overflowToDisk = false maxElementsInMemory = 1000 maxElementsOnDisk = 0 memoryStoreEvictionPolicy = LRU timeToLiveSeconds = 1800 timeToIdleSeconds = 2700 diskPersistent = false diskExpiryThreadIntervalSeconds = 600 cacheEventListeners:  hitCount = 0 memoryStoreHitCount = 0 diskStoreHitCount = 0 missCountNotFound = 0 missCountExpired = 0 ]
 WARN|main| 8672|PlexusContainer                - Component manager not found for returned component. Ignored. component=org.apache.maven.archiva.web.repository.ProxiedDavServer@a51027
There was no such logger 'org.codehaus.plexus.redback.xwork.filter.authentication.HttpAuthenticator:basic' 5493711.
 INFO|main| 9136|log                            - jetty-6.1.5
 INFO|main| 9137|log                            - Started SocketConnector@0.0.0.0:41597
Remote HTTP Server started on http://localhost:41597/snapshots
 INFO|main|10193|RepositoryProxyConnectors:default - Transfer not attempted on http://localhost:41597/snapshots/org/apache/archiva/archivatest-maven-plugin/4.0-alpha-1-SNAPSHOT/archivatest-maven-plugin-4.0-alpha-1-20070822.033400-42.jar : NO to update snapshots, policy is DAILY, local file exist, and has been updated within the last day.: using already present local file.
 INFO|main|10198|AuditLog                       - internal guest 127.0.0.1 "org/apache/archiva/archivatest-maven-plugin/4.0-alpha-1-SNAPSHOT/archivatest-maven-plugin-4.0-alpha-1-20070822.033400-42.jar" "Modify File (proxied)"
 INFO|main|10491|Cache:url-failures-cache       - Disposing cache: [ name = url-failures-cache status = STATUS_ALIVE eternal = false overflowToDisk = false maxElementsInMemory = 1000 maxElementsOnDisk = 0 memoryStoreEvictionPolicy = LRU timeToLiveSeconds = 1800 timeToIdleSeconds = 2700 diskPersistent = false diskExpiryThreadIntervalSeconds = 600 cacheEventListeners:  hitCount = 0 memoryStoreHitCount = 0 diskStoreHitCount = 0 missCountNotFound = 0 missCountExpired = 0 ]
There was no such logger 'org.codehaus.plexus.redback.xwork.filter.authentication.HttpAuthenticator:basic' 19833309.
 WARN|main|10491|PlexusContainer                - Component manager not found for returned component. Ignored. component=org.apache.maven.archiva.web.repository.ProxiedDavServer@1b2380e
 INFO|main|10606|log                            - jetty-6.1.5
 INFO|main|10607|log                            - Started SocketConnector@0.0.0.0:41601
Remote HTTP Server started on http://localhost:41601/snapshots
 INFO|main|11689|AuditLog                       - internal guest 127.0.0.1 "org/apache/archiva/archivatest-maven-plugin/4.0-alpha-1-SNAPSHOT/archivatest-maven-plugin-4.0-alpha-1-20070822.033400-42.jar" "Modify File (proxied)"
 INFO|main|11811|Cache:url-failures-cache       - Disposing cache: [ name = url-failures-cache status = STATUS_ALIVE eternal = false overflowToDisk = false maxElementsInMemory = 1000 maxElementsOnDisk = 0 memoryStoreEvictionPolicy = LRU timeToLiveSeconds = 1800 timeToIdleSeconds = 2700 diskPersistent = false diskExpiryThreadIntervalSeconds = 600 cacheEventListeners:  hitCount = 0 memoryStoreHitCount = 0 diskStoreHitCount = 0 missCountNotFound = 0 missCountExpired = 0 ]
There was no such logger 'org.codehaus.plexus.redback.xwork.filter.authentication.HttpAuthenticator:basic' 22758546.
 WARN|main|11879|PlexusContainer                - Component manager not found for returned component. Ignored. component=org.apache.maven.archiva.web.repository.ProxiedDavServer@1d2b8e
 INFO|main|12020|log                            - jetty-6.1.5
 INFO|main|12021|log                            - Started SocketConnector@0.0.0.0:41607
Remote HTTP Server started on http://localhost:41607/snapshots
 INFO|main|13167|AuditLog                       - internal guest 127.0.0.1 "org/apache/archiva/archivatest-maven-plugin/4.0-alpha-1-SNAPSHOT/archivatest-maven-plugin-4.0-alpha-1-20070822.033400-42.jar" "Modify File (proxied)"
 INFO|main|13302|Cache:url-failures-cache       - Disposing cache: [ name = url-failures-cache status = STATUS_ALIVE eternal = false overflowToDisk = false maxElementsInMemory = 1000 maxElementsOnDisk = 0 memoryStoreEvictionPolicy = LRU timeToLiveSeconds = 1800 timeToIdleSeconds = 2700 diskPersistent = false diskExpiryThreadIntervalSeconds = 600 cacheEventListeners:  hitCount = 0 memoryStoreHitCount = 0 diskStoreHitCount = 0 missCountNotFound = 0 missCountExpired = 0 ]
There was no such logger 'org.codehaus.plexus.redback.xwork.filter.authentication.HttpAuthenticator:basic' 15955724.
 WARN|main|13303|PlexusContainer                - Component manager not found for returned component. Ignored. component=org.apache.maven.archiva.web.repository.ProxiedDavServer@392814
 INFO|main|13582|log                            - jetty-6.1.5
 INFO|main|13583|log                            - Started SocketConnector@0.0.0.0:41614
Remote HTTP Server started on http://localhost:41614/snapshots
 INFO|main|14542|RepositoryProxyConnectors:default - Transfer not attempted on http://localhost:41614/snapshots/org/apache/archiva/archivatest-maven-plugin/4.0-alpha-1-SNAPSHOT/archivatest-maven-plugin-4.0-alpha-1-20070822.033400-42.pom : NO to update, snapshots policy set to NEVER.
 INFO|main|14543|RepositoryProxyConnectors:default - Transfer not attempted on http://localhost:41614/snapshots/org/apache/archiva/archivatest-maven-plugin/4.0-alpha-1-SNAPSHOT/archivatest-maven-plugin-4.0-alpha-1-20070822.033400-42.jar : NO to update, snapshots policy set to NEVER.: using already present local file.
 INFO|main|14546|AuditLog                       - internal guest 127.0.0.1 "org/apache/archiva/archivatest-maven-plugin/4.0-alpha-1-SNAPSHOT/archivatest-maven-plugin-4.0-alpha-1-20070822.033400-42.jar" "Modify File (proxied)"
 INFO|main|14841|Cache:url-failures-cache       - Disposing cache: [ name = url-failures-cache status = STATUS_ALIVE eternal = false overflowToDisk = false maxElementsInMemory = 1000 maxElementsOnDisk = 0 memoryStoreEvictionPolicy = LRU timeToLiveSeconds = 1800 timeToIdleSeconds = 2700 diskPersistent = false diskExpiryThreadIntervalSeconds = 600 cacheEventListeners:  hitCount = 0 memoryStoreHitCount = 0 diskStoreHitCount = 0 missCountNotFound = 0 missCountExpired = 0 ]
There was no such logger 'org.codehaus.plexus.redback.xwork.filter.authentication.HttpAuthenticator:basic' 16939205.
 WARN|main|14841|PlexusContainer                - Component manager not found for returned component. Ignored. component=org.apache.maven.archiva.web.repository.ProxiedDavServer@cd51ad
 INFO|main|15404|log                            - jetty-6.1.5
 INFO|main|15405|log                            - Started SocketConnector@0.0.0.0:41621
Remote HTTP Server started on http://localhost:41621/snapshots
 INFO|main|16453|RepositoryProxyConnectors:default - Transfer not attempted on http://localhost:41621/snapshots/org/apache/archiva/archivatest-maven-plugin/4.0-alpha-1-SNAPSHOT/archivatest-maven-plugin-4.0-alpha-1-20070822.033400-42.pom : NO to update, snapshots policy set to NEVER.
 INFO|main|16454|RepositoryProxyConnectors:default - Transfer not attempted on http://localhost:41621/snapshots/org/apache/archiva/archivatest-maven-plugin/4.0-alpha-1-SNAPSHOT/archivatest-maven-plugin-4.0-alpha-1-20070822.033400-42.jar : NO to update, snapshots policy set to NEVER.
 INFO|main|16600|Cache:url-failures-cache       - Disposing cache: [ name = url-failures-cache status = STATUS_ALIVE eternal = false overflowToDisk = false maxElementsInMemory = 1000 maxElementsOnDisk = 0 memoryStoreEvictionPolicy = LRU timeToLiveSeconds = 1800 timeToIdleSeconds = 2700 diskPersistent = false diskExpiryThreadIntervalSeconds = 600 cacheEventListeners:  hitCount = 0 memoryStoreHitCount = 0 diskStoreHitCount = 0 missCountNotFound = 0 missCountExpired = 0 ]
There was no such logger 'org.codehaus.plexus.redback.xwork.filter.authentication.HttpAuthenticator:basic' 20531483.
 WARN|main|16601|PlexusContainer                - Component manager not found for returned component. Ignored. component=org.apache.maven.archiva.web.repository.ProxiedDavServer@1561437
 INFO|main|16755|log                            - jetty-6.1.5
 INFO|main|16756|log                            - Started SocketConnector@0.0.0.0:41626
Remote HTTP Server started on http://localhost:41626/snapshots
 INFO|main|18032|RepositoryProxyConnectors:default - Transfer not attempted on http://localhost:41626/snapshots/org/apache/archiva/archivatest-maven-plugin/4.0-alpha-1-SNAPSHOT/archivatest-maven-plugin-4.0-alpha-1-20070822.033400-42.pom : NO to update, snapshots policy set to NEVER.
 INFO|main|18033|RepositoryProxyConnectors:default - Transfer not attempted on http://localhost:41626/snapshots/org/apache/archiva/archivatest-maven-plugin/4.0-alpha-1-SNAPSHOT/archivatest-maven-plugin-4.0-alpha-1-20070822.033400-42.jar : NO to update, snapshots policy set to NEVER.: using already present local file.
 INFO|main|18035|AuditLog                       - internal guest 127.0.0.1 "org/apache/archiva/archivatest-maven-plugin/4.0-alpha-1-SNAPSHOT/archivatest-maven-plugin-4.0-alpha-1-20070822.033400-42.jar" "Modify File (proxied)"
 INFO|main|18038|Cache:url-failures-cache       - Disposing cache: [ name = url-failures-cache status = STATUS_ALIVE eternal = false overflowToDisk = false maxElementsInMemory = 1000 maxElementsOnDisk = 0 memoryStoreEvictionPolicy = LRU timeToLiveSeconds = 1800 timeToIdleSeconds = 2700 diskPersistent = false diskExpiryThreadIntervalSeconds = 600 cacheEventListeners:  hitCount = 0 memoryStoreHitCount = 0 diskStoreHitCount = 0 missCountNotFound = 0 missCountExpired = 0 ]
There was no such logger 'org.codehaus.plexus.redback.xwork.filter.authentication.HttpAuthenticator:basic' 28516313.
 WARN|main|18039|PlexusContainer                - Component manager not found for returned component. Ignored. component=org.apache.maven.archiva.web.repository.ProxiedDavServer@1fecaeb
 INFO|main|18180|log                            - jetty-6.1.5
 INFO|main|18181|log                            - Started SocketConnector@0.0.0.0:41628
Remote HTTP Server started on http://localhost:41628/snapshots
 INFO|main|19102|RepositoryProxyConnectors:default - Transfer not attempted on http://localhost:41628/snapshots/org/apache/archiva/archivatest-maven-plugin/4.0-alpha-1-SNAPSHOT/archivatest-maven-plugin-4.0-alpha-1-20070822.033400-42.jar : NO to update snapshots, policy is HOURLY, local file exist, and has been updated within the last hour.: using already present local file.
 INFO|main|19105|AuditLog                       - internal guest 127.0.0.1 "org/apache/archiva/archivatest-maven-plugin/4.0-alpha-1-SNAPSHOT/archivatest-maven-plugin-4.0-alpha-1-20070822.033400-42.jar" "Modify File (proxied)"
 INFO|main|19210|Cache:url-failures-cache       - Disposing cache: [ name = url-failures-cache status = STATUS_ALIVE eternal = false overflowToDisk = false maxElementsInMemory = 1000 maxElementsOnDisk = 0 memoryStoreEvictionPolicy = LRU timeToLiveSeconds = 1800 timeToIdleSeconds = 2700 diskPersistent = false diskExpiryThreadIntervalSeconds = 600 cacheEventListeners:  hitCount = 0 memoryStoreHitCount = 0 diskStoreHitCount = 0 missCountNotFound = 0 missCountExpired = 0 ]
There was no such logger 'org.codehaus.plexus.redback.xwork.filter.authentication.HttpAuthenticator:basic' 5854240.
 WARN|main|19211|PlexusContainer                - Component manager not found for returned component. Ignored. component=org.apache.maven.archiva.web.repository.ProxiedDavServer@10948cf
 INFO|main|19315|log                            - jetty-6.1.5
 INFO|main|19316|log                            - Started SocketConnector@0.0.0.0:41631
Remote HTTP Server started on http://localhost:41631/snapshots
 INFO|main|20427|AuditLog                       - internal guest 127.0.0.1 "org/apache/archiva/archivatest-maven-plugin/4.0-alpha-1-SNAPSHOT/archivatest-maven-plugin-4.0-alpha-1-20070822.033400-42.jar" "Modify File (proxied)"
 INFO|main|20451|Cache:url-failures-cache       - Disposing cache: [ name = url-failures-cache status = STATUS_ALIVE eternal = false overflowToDisk = false maxElementsInMemory = 1000 maxElementsOnDisk = 0 memoryStoreEvictionPolicy = LRU timeToLiveSeconds = 1800 timeToIdleSeconds = 2700 diskPersistent = false diskExpiryThreadIntervalSeconds = 600 cacheEventListeners:  hitCount = 0 memoryStoreHitCount = 0 diskStoreHitCount = 0 missCountNotFound = 0 missCountExpired = 0 ]
There was no such logger 'org.codehaus.plexus.redback.xwork.filter.authentication.HttpAuthenticator:basic' 16619546.
 WARN|main|20456|PlexusContainer                - Component manager not found for returned component. Ignored. component=org.apache.maven.archiva.web.repository.ProxiedDavServer@10a0d51
 INFO|main|21211|log                            - jetty-6.1.5
 INFO|main|21212|log                            - Started SocketConnector@0.0.0.0:41635
Remote HTTP Server started on http://localhost:41635/snapshots
 INFO|main|22096|AuditLog                       - internal guest 127.0.0.1 "org/apache/archiva/archivatest-maven-plugin/4.0-alpha-1-SNAPSHOT/archivatest-maven-plugin-4.0-alpha-1-20070822.033400-42.jar" "Modify File (proxied)"
 INFO|main|22205|Cache:url-failures-cache       - Disposing cache: [ name = url-failures-cache status = STATUS_ALIVE eternal = false overflowToDisk = false maxElementsInMemory = 1000 maxElementsOnDisk = 0 memoryStoreEvictionPolicy = LRU timeToLiveSeconds = 1800 timeToIdleSeconds = 2700 diskPersistent = false diskExpiryThreadIntervalSeconds = 600 cacheEventListeners:  hitCount = 0 memoryStoreHitCount = 0 diskStoreHitCount = 0 missCountNotFound = 0 missCountExpired = 0 ]
There was no such logger 'org.codehaus.plexus.redback.xwork.filter.authentication.HttpAuthenticator:basic' 31541880.
 WARN|main|22206|PlexusContainer                - Component manager not found for returned component. Ignored. component=org.apache.maven.archiva.web.repository.ProxiedDavServer@1a544a5
 INFO|main|22332|log                            - jetty-6.1.5
 INFO|main|22333|log                            - Started SocketConnector@0.0.0.0:41643
Remote HTTP Server started on http://localhost:41643/snapshots
 INFO|main|23447|RepositoryProxyConnectors:default - Transfer not attempted on http://localhost:41643/snapshots/org/apache/archiva/archivatest-maven-plugin/4.0-alpha-1-SNAPSHOT/archivatest-maven-plugin-4.0-alpha-1-20070822.033400-42.jar : NO to update snapshots, policy is ONCE, and local file exist.: using already present local file.
 INFO|main|23457|AuditLog                       - internal guest 127.0.0.1 "org/apache/archiva/archivatest-maven-plugin/4.0-alpha-1-SNAPSHOT/archivatest-maven-plugin-4.0-alpha-1-20070822.033400-42.jar" "Modify File (proxied)"
 INFO|main|23570|Cache:url-failures-cache       - Disposing cache: [ name = url-failures-cache status = STATUS_ALIVE eternal = false overflowToDisk = false maxElementsInMemory = 1000 maxElementsOnDisk = 0 memoryStoreEvictionPolicy = LRU timeToLiveSeconds = 1800 timeToIdleSeconds = 2700 diskPersistent = false diskExpiryThreadIntervalSeconds = 600 cacheEventListeners:  hitCount = 0 memoryStoreHitCount = 0 diskStoreHitCount = 0 missCountNotFound = 0 missCountExpired = 0 ]
There was no such logger 'org.codehaus.plexus.redback.xwork.filter.authentication.HttpAuthenticator:basic' 33431078.
 WARN|main|23571|PlexusContainer                - Component manager not found for returned component. Ignored. component=org.apache.maven.archiva.web.repository.ProxiedDavServer@1d41116
 INFO|main|23722|log                            - jetty-6.1.5
 INFO|main|23723|log                            - Started SocketConnector@0.0.0.0:41645
Remote HTTP Server started on http://localhost:41645/snapshots
 INFO|main|24814|AuditLog                       - internal guest 127.0.0.1 "org/apache/archiva/archivatest-maven-plugin/4.0-alpha-1-SNAPSHOT/archivatest-maven-plugin-4.0-alpha-1-20070822.033400-42.jar" "Modify File (proxied)"
 INFO|main|24919|Cache:url-failures-cache       - Disposing cache: [ name = url-failures-cache status = STATUS_ALIVE eternal = false overflowToDisk = false maxElementsInMemory = 1000 maxElementsOnDisk = 0 memoryStoreEvictionPolicy = LRU timeToLiveSeconds = 1800 timeToIdleSeconds = 2700 diskPersistent = false diskExpiryThreadIntervalSeconds = 600 cacheEventListeners:  hitCount = 0 memoryStoreHitCount = 0 diskStoreHitCount = 0 missCountNotFound = 0 missCountExpired = 0 ]
There was no such logger 'org.codehaus.plexus.redback.xwork.filter.authentication.HttpAuthenticator:basic' 26120125.
 WARN|main|24920|PlexusContainer                - Component manager not found for returned component. Ignored. component=org.apache.maven.archiva.web.repository.ProxiedDavServer@70856b
 INFO|main|25333|log                            - jetty-6.1.5
 INFO|main|25335|log                            - Started SocketConnector@0.0.0.0:41649
Remote HTTP Server started on http://localhost:41649/snapshots
 INFO|main|26196|AuditLog                       - internal guest 127.0.0.1 "org/apache/archiva/archivatest-maven-plugin/4.0-alpha-1-SNAPSHOT/archivatest-maven-plugin-4.0-alpha-1-20070822.033400-42.jar" "Modify File (proxied)"
 INFO|main|26200|Cache:url-failures-cache       - Disposing cache: [ name = url-failures-cache status = STATUS_ALIVE eternal = false overflowToDisk = false maxElementsInMemory = 1000 maxElementsOnDisk = 0 memoryStoreEvictionPolicy = LRU timeToLiveSeconds = 1800 timeToIdleSeconds = 2700 diskPersistent = false diskExpiryThreadIntervalSeconds = 600 cacheEventListeners:  hitCount = 0 memoryStoreHitCount = 0 diskStoreHitCount = 0 missCountNotFound = 0 missCountExpired = 0 ]
There was no such logger 'org.codehaus.plexus.redback.xwork.filter.authentication.HttpAuthenticator:basic' 26414138.
 WARN|main|26200|PlexusContainer                - Component manager not found for returned component. Ignored. component=org.apache.maven.archiva.web.repository.ProxiedDavServer@7e05c4
Tests run: 15, Failures: 1, Errors: 0, Skipped: 0, Time elapsed: 21.569 sec <<< FAILURE!
Running org.apache.maven.archiva.web.action.admin.repositories.EditManagedRepositoryActionTest
Tests run: 3, Failures: 0, Errors: 0, Skipped: 0, Time elapsed: 0.549 sec
Running org.apache.maven.archiva.web.action.admin.connectors.proxy.AddProxyConnectorActionTest
 INFO|main|26836|Cache:url-failures-cache       - Disposing cache: [ name = url-failures-cache status = STATUS_ALIVE eternal = false overflowToDisk = false maxElementsInMemory = 1000 maxElementsOnDisk = 0 memoryStoreEvictionPolicy = LRU timeToLiveSeconds = 1800 timeToIdleSeconds = 2700 diskPersistent = false diskExpiryThreadIntervalSeconds = 600 cacheEventListeners:  hitCount = 0 memoryStoreHitCount = 0 diskStoreHitCount = 0 missCountNotFound = 0 missCountExpired = 0 ]
 INFO|main|26904|Cache:url-failures-cache       - Disposing cache: [ name = url-failures-cache status = STATUS_ALIVE eternal = false overflowToDisk = false maxElementsInMemory = 1000 maxElementsOnDisk = 0 memoryStoreEvictionPolicy = LRU timeToLiveSeconds = 1800 timeToIdleSeconds = 2700 diskPersistent = false diskExpiryThreadIntervalSeconds = 600 cacheEventListeners:  hitCount = 0 memoryStoreHitCount = 0 diskStoreHitCount = 0 missCountNotFound = 0 missCountExpired = 0 ]
 INFO|main|26972|Cache:url-failures-cache       - Disposing cache: [ name = url-failures-cache status = STATUS_ALIVE eternal = false overflowToDisk = false maxElementsInMemory = 1000 maxElementsOnDisk = 0 memoryStoreEvictionPolicy = LRU timeToLiveSeconds = 1800 timeToIdleSeconds = 2700 diskPersistent = false diskExpiryThreadIntervalSeconds = 600 cacheEventListeners:  hitCount = 0 memoryStoreHitCount = 0 diskStoreHitCount = 0 missCountNotFound = 0 missCountExpired = 0 ]
 INFO|main|27441|Cache:url-failures-cache       - Disposing cache: [ name = url-failures-cache status = STATUS_ALIVE eternal = false overflowToDisk = false maxElementsInMemory = 1000 maxElementsOnDisk = 0 memoryStoreEvictionPolicy = LRU timeToLiveSeconds = 1800 timeToIdleSeconds = 2700 diskPersistent = false diskExpiryThreadIntervalSeconds = 600 cacheEventListeners:  hitCount = 0 memoryStoreHitCount = 0 diskStoreHitCount = 0 missCountNotFound = 0 missCountExpired = 0 ]
 INFO|main|27518|Cache:url-failures-cache       - Disposing cache: [ name = url-failures-cache status = STATUS_ALIVE eternal = false overflowToDisk = false maxElementsInMemory = 1000 maxElementsOnDisk = 0 memoryStoreEvictionPolicy = LRU timeToLiveSeconds = 1800 timeToIdleSeconds = 2700 diskPersistent = false diskExpiryThreadIntervalSeconds = 600 cacheEventListeners:  hitCount = 0 memoryStoreHitCount = 0 diskStoreHitCount = 0 missCountNotFound = 0 missCountExpired = 0 ]
 INFO|main|27600|Cache:url-failures-cache       - Disposing cache: [ name = url-failures-cache status = STATUS_ALIVE eternal = false overflowToDisk = false maxElementsInMemory = 1000 maxElementsOnDisk = 0 memoryStoreEvictionPolicy = LRU timeToLiveSeconds = 1800 timeToIdleSeconds = 2700 diskPersistent = false diskExpiryThreadIntervalSeconds = 600 cacheEventListeners:  hitCount = 0 memoryStoreHitCount = 0 diskStoreHitCount = 0 missCountNotFound = 0 missCountExpired = 0 ]
 INFO|main|27669|Cache:url-failures-cache       - Disposing cache: [ name = url-failures-cache status = STATUS_ALIVE eternal = false overflowToDisk = false maxElementsInMemory = 1000 maxElementsOnDisk = 0 memoryStoreEvictionPolicy = LRU timeToLiveSeconds = 1800 timeToIdleSeconds = 2700 diskPersistent = false diskExpiryThreadIntervalSeconds = 600 cacheEventListeners:  hitCount = 0 memoryStoreHitCount = 0 diskStoreHitCount = 0 missCountNotFound = 0 missCountExpired = 0 ]
 INFO|main|28084|Cache:url-failures-cache       - Disposing cache: [ name = url-failures-cache status = STATUS_ALIVE eternal = false overflowToDisk = false maxElementsInMemory = 1000 maxElementsOnDisk = 0 memoryStoreEvictionPolicy = LRU timeToLiveSeconds = 1800 timeToIdleSeconds = 2700 diskPersistent = false diskExpiryThreadIntervalSeconds = 600 cacheEventListeners:  hitCount = 0 memoryStoreHitCount = 0 diskStoreHitCount = 0 missCountNotFound = 0 missCountExpired = 0 ]
 INFO|main|28156|Cache:url-failures-cache       - Disposing cache: [ name = url-failures-cache status = STATUS_ALIVE eternal = false overflowToDisk = false maxElementsInMemory = 1000 maxElementsOnDisk = 0 memoryStoreEvictionPolicy = LRU timeToLiveSeconds = 1800 timeToIdleSeconds = 2700 diskPersistent = false diskExpiryThreadIntervalSeconds = 600 cacheEventListeners:  hitCount = 0 memoryStoreHitCount = 0 diskStoreHitCount = 0 missCountNotFound = 0 missCountExpired = 0 ]
Tests run: 9, Failures: 0, Errors: 0, Skipped: 0, Time elapsed: 1.396 sec
Running org.apache.maven.archiva.web.action.admin.repositories.DeleteManagedRepositoryActionTest
 INFO|main|28731|Action:deleteManagedRepositoryAction - Removing artifact org.apache.maven.archiva:test-artifact:jar:1.0 from the database.
 INFO|main|28822|Action:deleteManagedRepositoryAction - Removing artifact org.apache.maven.archiva:test-artifact:jar:1.0 from the database.
 INFO|main|28891|Action:deleteManagedRepositoryAction - Removing artifact org.apache.maven.archiva:test-artifact:jar:1.0 from the database.
Tests run: 6, Failures: 0, Errors: 0, Skipped: 0, Time elapsed: 0.793 sec
Running org.apache.maven.archiva.web.startup.BannerTest
Tests run: 3, Failures: 0, Errors: 0, Skipped: 0, Time elapsed: 0.007 sec
Running org.apache.maven.archiva.web.action.admin.connectors.proxy.DeleteProxyConnectorActionTest
[INFO] Disposing cache: [ name = url-failures-cache status = STATUS_ALIVE eternal = false overflowToDisk = false maxElementsInMemory = 1000 maxElementsOnDisk = 0 memoryStoreEvictionPolicy = LRU timeToLiveSeconds = 1800 timeToIdleSeconds = 2700 diskPersistent = true diskExpiryThreadIntervalSeconds = 600 cacheEventListeners:  hitCount = 0 memoryStoreHitCount = 0 diskStoreHitCount = 0 missCountNotFound = 0 missCountExpired = 0 ]
[INFO] Disposing cache: [ name = url-failures-cache status = STATUS_ALIVE eternal = false overflowToDisk = false maxElementsInMemory = 1000 maxElementsOnDisk = 0 memoryStoreEvictionPolicy = LRU timeToLiveSeconds = 1800 timeToIdleSeconds = 2700 diskPersistent = true diskExpiryThreadIntervalSeconds = 600 cacheEventListeners:  hitCount = 0 memoryStoreHitCount = 0 diskStoreHitCount = 0 missCountNotFound = 0 missCountExpired = 0 ]
[INFO] Disposing cache: [ name = url-failures-cache status = STATUS_ALIVE eternal = false overflowToDisk = false maxElementsInMemory = 1000 maxElementsOnDisk = 0 memoryStoreEvictionPolicy = LRU timeToLiveSeconds = 1800 timeToIdleSeconds = 2700 diskPersistent = true diskExpiryThreadIntervalSeconds = 600 cacheEventListeners:  hitCount = 0 memoryStoreHitCount = 0 diskStoreHitCount = 0 missCountNotFound = 0 missCountExpired = 0 ]
[INFO] Disposing cache: [ name = url-failures-cache status = STATUS_ALIVE eternal = false overflowToDisk = false maxElementsInMemory = 1000 maxElementsOnDisk = 0 memoryStoreEvictionPolicy = LRU timeToLiveSeconds = 1800 timeToIdleSeconds = 2700 diskPersistent = true diskExpiryThreadIntervalSeconds = 600 cacheEventListeners:  hitCount = 0 memoryStoreHitCount = 0 diskStoreHitCount = 0 missCountNotFound = 0 missCountExpired = 0 ]
[INFO] Disposing cache: [ name = url-failures-cache status = STATUS_ALIVE eternal = false overflowToDisk = false maxElementsInMemory = 1000 maxElementsOnDisk = 0 memoryStoreEvictionPolicy = LRU timeToLiveSeconds = 1800 timeToIdleSeconds = 2700 diskPersistent = true diskExpiryThreadIntervalSeconds = 600 cacheEventListeners:  hitCount = 0 memoryStoreHitCount = 0 diskStoreHitCount = 0 missCountNotFound = 0 missCountExpired = 0 ]
Tests run: 5, Failures: 0, Errors: 0, Skipped: 0, Time elapsed: 0.502 sec
Running org.apache.maven.archiva.web.action.admin.repositories.DeleteRemoteRepositoryActionTest
[INFO] Disposing cache: [ name = url-failures-cache status = STATUS_ALIVE eternal = false overflowToDisk = false maxElementsInMemory = 1000 maxElementsOnDisk = 0 memoryStoreEvictionPolicy = LRU timeToLiveSeconds = 1800 timeToIdleSeconds = 2700 diskPersistent = true diskExpiryThreadIntervalSeconds = 600 cacheEventListeners:  hitCount = 0 memoryStoreHitCount = 0 diskStoreHitCount = 0 missCountNotFound = 0 missCountExpired = 0 ]
[INFO] Disposing cache: [ name = url-failures-cache status = STATUS_ALIVE eternal = false overflowToDisk = false maxElementsInMemory = 1000 maxElementsOnDisk = 0 memoryStoreEvictionPolicy = LRU timeToLiveSeconds = 1800 timeToIdleSeconds = 2700 diskPersistent = true diskExpiryThreadIntervalSeconds = 600 cacheEventListeners:  hitCount = 0 memoryStoreHitCount = 0 diskStoreHitCount = 0 missCountNotFound = 0 missCountExpired = 0 ]
[INFO] Disposing cache: [ name = url-failures-cache status = STATUS_ALIVE eternal = false overflowToDisk = false maxElementsInMemory = 1000 maxElementsOnDisk = 0 memoryStoreEvictionPolicy = LRU timeToLiveSeconds = 1800 timeToIdleSeconds = 2700 diskPersistent = true diskExpiryThreadIntervalSeconds = 600 cacheEventListeners:  hitCount = 0 memoryStoreHitCount = 0 diskStoreHitCount = 0 missCountNotFound = 0 missCountExpired = 0 ]
Tests run: 3, Failures: 0, Errors: 0, Skipped: 0, Time elapsed: 0.384 sec
Running org.apache.maven.archiva.web.action.admin.connectors.proxy.EditProxyConnectorActionTest
 INFO|main|29955|Cache:url-failures-cache       - Disposing cache: [ name = url-failures-cache status = STATUS_ALIVE eternal = false overflowToDisk = false maxElementsInMemory = 1000 maxElementsOnDisk = 0 memoryStoreEvictionPolicy = LRU timeToLiveSeconds = 1800 timeToIdleSeconds = 2700 diskPersistent = false diskExpiryThreadIntervalSeconds = 600 cacheEventListeners:  hitCount = 0 memoryStoreHitCount = 0 diskStoreHitCount = 0 missCountNotFound = 0 missCountExpired = 0 ]
 INFO|main|30066|Cache:url-failures-cache       - Disposing cache: [ name = url-failures-cache status = STATUS_ALIVE eternal = false overflowToDisk = false maxElementsInMemory = 1000 maxElementsOnDisk = 0 memoryStoreEvictionPolicy = LRU timeToLiveSeconds = 1800 timeToIdleSeconds = 2700 diskPersistent = false diskExpiryThreadIntervalSeconds = 600 cacheEventListeners:  hitCount = 0 memoryStoreHitCount = 0 diskStoreHitCount = 0 missCountNotFound = 0 missCountExpired = 0 ]
 INFO|main|30138|Cache:url-failures-cache       - Disposing cache: [ name = url-failures-cache status = STATUS_ALIVE eternal = false overflowToDisk = false maxElementsInMemory = 1000 maxElementsOnDisk = 0 memoryStoreEvictionPolicy = LRU timeToLiveSeconds = 1800 timeToIdleSeconds = 2700 diskPersistent = false diskExpiryThreadIntervalSeconds = 600 cacheEventListeners:  hitCount = 0 memoryStoreHitCount = 0 diskStoreHitCount = 0 missCountNotFound = 0 missCountExpired = 0 ]
 INFO|main|30332|Cache:url-failures-cache       - Disposing cache: [ name = url-failures-cache status = STATUS_ALIVE eternal = false overflowToDisk = false maxElementsInMemory = 1000 maxElementsOnDisk = 0 memoryStoreEvictionPolicy = LRU timeToLiveSeconds = 1800 timeToIdleSeconds = 2700 diskPersistent = false diskExpiryThreadIntervalSeconds = 600 cacheEventListeners:  hitCount = 0 memoryStoreHitCount = 0 diskStoreHitCount = 0 missCountNotFound = 0 missCountExpired = 0 ]
 INFO|main|30420|Cache:url-failures-cache       - Disposing cache: [ name = url-failures-cache status = STATUS_ALIVE eternal = false overflowToDisk = false maxElementsInMemory = 1000 maxElementsOnDisk = 0 memoryStoreEvictionPolicy = LRU timeToLiveSeconds = 1800 timeToIdleSeconds = 2700 diskPersistent = false diskExpiryThreadIntervalSeconds = 600 cacheEventListeners:  hitCount = 0 memoryStoreHitCount = 0 diskStoreHitCount = 0 missCountNotFound = 0 missCountExpired = 0 ]
 INFO|main|30489|Cache:url-failures-cache       - Disposing cache: [ name = url-failures-cache status = STATUS_ALIVE eternal = false overflowToDisk = false maxElementsInMemory = 1000 maxElementsOnDisk = 0 memoryStoreEvictionPolicy = LRU timeToLiveSeconds = 1800 timeToIdleSeconds = 2700 diskPersistent = false diskExpiryThreadIntervalSeconds = 600 cacheEventListeners:  hitCount = 0 memoryStoreHitCount = 0 diskStoreHitCount = 0 missCountNotFound = 0 missCountExpired = 0 ]
 INFO|main|30710|Cache:url-failures-cache       - Disposing cache: [ name = url-failures-cache status = STATUS_ALIVE eternal = false overflowToDisk = false maxElementsInMemory = 1000 maxElementsOnDisk = 0 memoryStoreEvictionPolicy = LRU timeToLiveSeconds = 1800 timeToIdleSeconds = 2700 diskPersistent = false diskExpiryThreadIntervalSeconds = 600 cacheEventListeners:  hitCount = 0 memoryStoreHitCount = 0 diskStoreHitCount = 0 missCountNotFound = 0 missCountExpired = 0 ]
 INFO|main|30777|Cache:url-failures-cache       - Disposing cache: [ name = url-failures-cache status = STATUS_ALIVE eternal = false overflowToDisk = false maxElementsInMemory = 1000 maxElementsOnDisk = 0 memoryStoreEvictionPolicy = LRU timeToLiveSeconds = 1800 timeToIdleSeconds = 2700 diskPersistent = false diskExpiryThreadIntervalSeconds = 600 cacheEventListeners:  hitCount = 0 memoryStoreHitCount = 0 diskStoreHitCount = 0 missCountNotFound = 0 missCountExpired = 0 ]
 INFO|main|30849|Cache:url-failures-cache       - Disposing cache: [ name = url-failures-cache status = STATUS_ALIVE eternal = false overflowToDisk = false maxElementsInMemory = 1000 maxElementsOnDisk = 0 memoryStoreEvictionPolicy = LRU timeToLiveSeconds = 1800 timeToIdleSeconds = 2700 diskPersistent = false diskExpiryThreadIntervalSeconds = 600 cacheEventListeners:  hitCount = 0 memoryStoreHitCount = 0 diskStoreHitCount = 0 missCountNotFound = 0 missCountExpired = 0 ]
Tests run: 9, Failures: 0, Errors: 0, Skipped: 0, Time elapsed: 0.969 sec
Running org.apache.maven.archiva.web.action.admin.repositories.AddRemoteRepositoryActionTest
[INFO] Disposing cache: [ name = url-failures-cache status = STATUS_ALIVE eternal = false overflowToDisk = false maxElementsInMemory = 1000 maxElementsOnDisk = 0 memoryStoreEvictionPolicy = LRU timeToLiveSeconds = 1800 timeToIdleSeconds = 2700 diskPersistent = true diskExpiryThreadIntervalSeconds = 600 cacheEventListeners:  hitCount = 0 memoryStoreHitCount = 0 diskStoreHitCount = 0 missCountNotFound = 0 missCountExpired = 0 ]
[INFO] Disposing cache: [ name = url-failures-cache status = STATUS_ALIVE eternal = false overflowToDisk = false maxElementsInMemory = 1000 maxElementsOnDisk = 0 memoryStoreEvictionPolicy = LRU timeToLiveSeconds = 1800 timeToIdleSeconds = 2700 diskPersistent = true diskExpiryThreadIntervalSeconds = 600 cacheEventListeners:  hitCount = 0 memoryStoreHitCount = 0 diskStoreHitCount = 0 missCountNotFound = 0 missCountExpired = 0 ]
[INFO] Disposing cache: [ name = url-failures-cache status = STATUS_ALIVE eternal = false overflowToDisk = false maxElementsInMemory = 1000 maxElementsOnDisk = 0 memoryStoreEvictionPolicy = LRU timeToLiveSeconds = 1800 timeToIdleSeconds = 2700 diskPersistent = true diskExpiryThreadIntervalSeconds = 600 cacheEventListeners:  hitCount = 0 memoryStoreHitCount = 0 diskStoreHitCount = 0 missCountNotFound = 0 missCountExpired = 0 ]
Tests run: 3, Failures: 0, Errors: 0, Skipped: 0, Time elapsed: 0.619 sec
Running org.apache.maven.archiva.web.action.admin.repositories.AddManagedRepositoryActionTest
Tests run: 3, Failures: 0, Errors: 0, Skipped: 0, Time elapsed: 0.257 sec
Running org.apache.maven.archiva.web.repository.RepositoryServletSecurityTest
There was no such logger 'org.apache.maven.archiva.configuration.ArchivaConfiguration:default' 26156792.
 INFO|main|32102|Cache:url-failures-cache       - Disposing cache: [ name = url-failures-cache status = STATUS_ALIVE eternal = false overflowToDisk = false maxElementsInMemory = 1000 maxElementsOnDisk = 0 memoryStoreEvictionPolicy = LRU timeToLiveSeconds = 1800 timeToIdleSeconds = 2700 diskPersistent = false diskExpiryThreadIntervalSeconds = 600 cacheEventListeners:  hitCount = 0 memoryStoreHitCount = 0 diskStoreHitCount = 0 missCountNotFound = 0 missCountExpired = 0 ]
There was no such logger 'org.apache.maven.archiva.configuration.ArchivaConfiguration:default' 27332482.
 INFO|main|32204|Cache:url-failures-cache       - Disposing cache: [ name = url-failures-cache status = STATUS_ALIVE eternal = false overflowToDisk = false maxElementsInMemory = 1000 maxElementsOnDisk = 0 memoryStoreEvictionPolicy = LRU timeToLiveSeconds = 1800 timeToIdleSeconds = 2700 diskPersistent = false diskExpiryThreadIntervalSeconds = 600 cacheEventListeners:  hitCount = 0 memoryStoreHitCount = 0 diskStoreHitCount = 0 missCountNotFound = 0 missCountExpired = 0 ]
Tests run: 2, Failures: 0, Errors: 0, Skipped: 0, Time elapsed: 0.471 sec
Running org.apache.maven.archiva.web.repository.RepositoryServletProxiedMetadataRemoteOnlyTest
 INFO|main|32313|log                            - jetty-6.1.5
 INFO|main|32315|log                            - Started SocketConnector@0.0.0.0:41655
Remote HTTP Server started on http://localhost:41655/snapshots
 INFO|main|33373|log                            - jetty-6.1.5
 INFO|main|33374|log                            - Started SocketConnector@0.0.0.0:41659
Remote HTTP Server started on http://localhost:41659/private-snapshots
 INFO|main|34500|AuditLog                       - internal guest 127.0.0.1 "/org/apache/archiva/archivatest-maven-plugin/4.0-alpha-1-SNAPSHOT/maven-metadata.xml" "Modify File (proxied)"
 INFO|main|34748|Cache:url-failures-cache       - Disposing cache: [ name = url-failures-cache status = STATUS_ALIVE eternal = false overflowToDisk = false maxElementsInMemory = 1000 maxElementsOnDisk = 0 memoryStoreEvictionPolicy = LRU timeToLiveSeconds = 1800 timeToIdleSeconds = 2700 diskPersistent = false diskExpiryThreadIntervalSeconds = 600 cacheEventListeners:  hitCount = 0 memoryStoreHitCount = 0 diskStoreHitCount = 0 missCountNotFound = 0 missCountExpired = 0 ]
There was no such logger 'org.codehaus.plexus.redback.xwork.filter.authentication.HttpAuthenticator:basic' 26576367.
 WARN|main|34749|PlexusContainer                - Component manager not found for returned component. Ignored. component=org.apache.maven.archiva.web.repository.ProxiedDavServer@1ba204d
 INFO|main|34884|log                            - jetty-6.1.5
 INFO|main|34885|log                            - Started SocketConnector@0.0.0.0:41662
Remote HTTP Server started on http://localhost:41662/snapshots
 INFO|main|35732|log                            - jetty-6.1.5
 INFO|main|35733|log                            - Started SocketConnector@0.0.0.0:41664
Remote HTTP Server started on http://localhost:41664/private-snapshots
 INFO|main|36647|AuditLog                       - internal guest 127.0.0.1 "/org/apache/maven/plugins/maven-assembly-plugin/2.2-beta-2-SNAPSHOT/maven-metadata.xml" "Modify File (proxied)"
 INFO|main|36878|Cache:url-failures-cache       - Disposing cache: [ name = url-failures-cache status = STATUS_ALIVE eternal = false overflowToDisk = false maxElementsInMemory = 1000 maxElementsOnDisk = 0 memoryStoreEvictionPolicy = LRU timeToLiveSeconds = 1800 timeToIdleSeconds = 2700 diskPersistent = false diskExpiryThreadIntervalSeconds = 600 cacheEventListeners:  hitCount = 0 memoryStoreHitCount = 0 diskStoreHitCount = 0 missCountNotFound = 0 missCountExpired = 0 ]
There was no such logger 'org.codehaus.plexus.redback.xwork.filter.authentication.HttpAuthenticator:basic' 22759428.
 WARN|main|36879|PlexusContainer                - Component manager not found for returned component. Ignored. component=org.apache.maven.archiva.web.repository.ProxiedDavServer@13503e5
 INFO|main|36970|log                            - jetty-6.1.5
 INFO|main|36972|log                            - Started SocketConnector@0.0.0.0:41667
Remote HTTP Server started on http://localhost:41667/snapshots
 INFO|main|37853|log                            - jetty-6.1.5
 INFO|main|37854|log                            - Started SocketConnector@0.0.0.0:41669
Remote HTTP Server started on http://localhost:41669/private-snapshots
 INFO|main|38807|AuditLog                       - internal guest 127.0.0.1 "/org/apache/archiva/archivatest-maven-plugin/4.0-alpha-2/maven-metadata.xml" "Modify File (proxied)"
 INFO|main|39028|Cache:url-failures-cache       - Disposing cache: [ name = url-failures-cache status = STATUS_ALIVE eternal = false overflowToDisk = false maxElementsInMemory = 1000 maxElementsOnDisk = 0 memoryStoreEvictionPolicy = LRU timeToLiveSeconds = 1800 timeToIdleSeconds = 2700 diskPersistent = false diskExpiryThreadIntervalSeconds = 600 cacheEventListeners:  hitCount = 0 memoryStoreHitCount = 0 diskStoreHitCount = 0 missCountNotFound = 0 missCountExpired = 0 ]
There was no such logger 'org.codehaus.plexus.redback.xwork.filter.authentication.HttpAuthenticator:basic' 23337303.
 WARN|main|39028|PlexusContainer                - Component manager not found for returned component. Ignored. component=org.apache.maven.archiva.web.repository.ProxiedDavServer@1879eb8
 INFO|main|39117|log                            - jetty-6.1.5
 INFO|main|39118|log                            - Started SocketConnector@0.0.0.0:41674
Remote HTTP Server started on http://localhost:41674/snapshots
 INFO|main|40072|log                            - jetty-6.1.5
 INFO|main|40073|log                            - Started SocketConnector@0.0.0.0:41676
Remote HTTP Server started on http://localhost:41676/private-snapshots
 INFO|main|41106|AuditLog                       - internal guest 127.0.0.1 "/org/apache/archiva/archivatest-maven-plugin/maven-metadata.xml" "Modify File (proxied)"
 INFO|main|41358|Cache:url-failures-cache       - Disposing cache: [ name = url-failures-cache status = STATUS_ALIVE eternal = false overflowToDisk = false maxElementsInMemory = 1000 maxElementsOnDisk = 0 memoryStoreEvictionPolicy = LRU timeToLiveSeconds = 1800 timeToIdleSeconds = 2700 diskPersistent = false diskExpiryThreadIntervalSeconds = 600 cacheEventListeners:  hitCount = 0 memoryStoreHitCount = 0 diskStoreHitCount = 0 missCountNotFound = 0 missCountExpired = 0 ]
There was no such logger 'org.codehaus.plexus.redback.xwork.filter.authentication.HttpAuthenticator:basic' 16850719.
 WARN|main|41358|PlexusContainer                - Component manager not found for returned component. Ignored. component=org.apache.maven.archiva.web.repository.ProxiedDavServer@1af31b8
Tests run: 4, Failures: 0, Errors: 0, Skipped: 0, Time elapsed: 9.146 sec
Running org.apache.maven.archiva.web.repository.RepositoryServletProxiedTimestampedSnapshotPolicyTest
 INFO|main|41445|log                            - jetty-6.1.5
 INFO|main|41446|log                            - Started SocketConnector@0.0.0.0:41679
Remote HTTP Server started on http://localhost:41679/snapshots
 INFO|main|42478|Cache:url-failures-cache       - Disposing cache: [ name = url-failures-cache status = STATUS_ALIVE eternal = false overflowToDisk = false maxElementsInMemory = 1000 maxElementsOnDisk = 0 memoryStoreEvictionPolicy = LRU timeToLiveSeconds = 1800 timeToIdleSeconds = 2700 diskPersistent = false diskExpiryThreadIntervalSeconds = 600 cacheEventListeners:  hitCount = 0 memoryStoreHitCount = 0 diskStoreHitCount = 0 missCountNotFound = 0 missCountExpired = 0 ]
There was no such logger 'org.codehaus.plexus.redback.xwork.filter.authentication.HttpAuthenticator:basic' 10061327.
 WARN|main|42478|PlexusContainer                - Component manager not found for returned component. Ignored. component=org.apache.maven.archiva.web.repository.ProxiedDavServer@bccf9a
 INFO|main|42568|log                            - jetty-6.1.5
 INFO|main|42569|log                            - Started SocketConnector@0.0.0.0:41683
Remote HTTP Server started on http://localhost:41683/snapshots
 INFO|main|43601|AuditLog                       - internal guest 127.0.0.1 "org/apache/archiva/test/3.0-SNAPSHOT/test-3.0-20070822.033400-42.jar" "Modify File (proxied)"
 INFO|main|43708|Cache:url-failures-cache       - Disposing cache: [ name = url-failures-cache status = STATUS_ALIVE eternal = false overflowToDisk = false maxElementsInMemory = 1000 maxElementsOnDisk = 0 memoryStoreEvictionPolicy = LRU timeToLiveSeconds = 1800 timeToIdleSeconds = 2700 diskPersistent = false diskExpiryThreadIntervalSeconds = 600 cacheEventListeners:  hitCount = 0 memoryStoreHitCount = 0 diskStoreHitCount = 0 missCountNotFound = 0 missCountExpired = 0 ]
There was no such logger 'org.codehaus.plexus.redback.xwork.filter.authentication.HttpAuthenticator:basic' 11178479.
 WARN|main|43709|PlexusContainer                - Component manager not found for returned component. Ignored. component=org.apache.maven.archiva.web.repository.ProxiedDavServer@178f2b
 INFO|main|44536|log                            - jetty-6.1.5
 INFO|main|44887|log                            - Started SocketConnector@0.0.0.0:41690
Remote HTTP Server started on http://localhost:41690/snapshots
 INFO|main|45886|AuditLog                       - internal guest 127.0.0.1 "org/apache/archiva/test/3.0-SNAPSHOT/test-3.0-20070822.033400-42.jar" "Modify File (proxied)"
 INFO|main|45890|Cache:url-failures-cache       - Disposing cache: [ name = url-failures-cache status = STATUS_ALIVE eternal = false overflowToDisk = false maxElementsInMemory = 1000 maxElementsOnDisk = 0 memoryStoreEvictionPolicy = LRU timeToLiveSeconds = 1800 timeToIdleSeconds = 2700 diskPersistent = false diskExpiryThreadIntervalSeconds = 600 cacheEventListeners:  hitCount = 0 memoryStoreHitCount = 0 diskStoreHitCount = 0 missCountNotFound = 0 missCountExpired = 0 ]
There was no such logger 'org.codehaus.plexus.redback.xwork.filter.authentication.HttpAuthenticator:basic' 22529983.
 WARN|main|45890|PlexusContainer                - Component manager not found for returned component. Ignored. component=org.apache.maven.archiva.web.repository.ProxiedDavServer@10ec447
 INFO|main|45983|log                            - jetty-6.1.5
 INFO|main|45986|log                            - Started SocketConnector@0.0.0.0:41694
Remote HTTP Server started on http://localhost:41694/snapshots
 INFO|main|46890|RepositoryProxyConnectors:default - Transfer not attempted on http://localhost:41694/snapshots/org/apache/archiva/test/3.0-SNAPSHOT/test-3.0-20070822.033400-42.jar : NO to update snapshots, policy is DAILY, local file exist, and has been updated within the last day.: using already present local file.
 INFO|main|46891|AuditLog                       - internal guest 127.0.0.1 "org/apache/archiva/test/3.0-SNAPSHOT/test-3.0-20070822.033400-42.jar" "Modify File (proxied)"
 INFO|main|46997|Cache:url-failures-cache       - Disposing cache: [ name = url-failures-cache status = STATUS_ALIVE eternal = false overflowToDisk = false maxElementsInMemory = 1000 maxElementsOnDisk = 0 memoryStoreEvictionPolicy = LRU timeToLiveSeconds = 1800 timeToIdleSeconds = 2700 diskPersistent = false diskExpiryThreadIntervalSeconds = 600 cacheEventListeners:  hitCount = 0 memoryStoreHitCount = 0 diskStoreHitCount = 0 missCountNotFound = 0 missCountExpired = 0 ]
There was no such logger 'org.codehaus.plexus.redback.xwork.filter.authentication.HttpAuthenticator:basic' 4809601.
 WARN|main|46998|PlexusContainer                - Component manager not found for returned component. Ignored. component=org.apache.maven.archiva.web.repository.ProxiedDavServer@ece7a6
 INFO|main|47098|log                            - jetty-6.1.5
 INFO|main|47099|log                            - Started SocketConnector@0.0.0.0:41696
Remote HTTP Server started on http://localhost:41696/snapshots
 INFO|main|48002|AuditLog                       - internal guest 127.0.0.1 "org/apache/archiva/test/3.0-SNAPSHOT/test-3.0-20070822.033400-42.jar" "Modify File (proxied)"
 INFO|main|48107|Cache:url-failures-cache       - Disposing cache: [ name = url-failures-cache status = STATUS_ALIVE eternal = false overflowToDisk = false maxElementsInMemory = 1000 maxElementsOnDisk = 0 memoryStoreEvictionPolicy = LRU timeToLiveSeconds = 1800 timeToIdleSeconds = 2700 diskPersistent = false diskExpiryThreadIntervalSeconds = 600 cacheEventListeners:  hitCount = 0 memoryStoreHitCount = 0 diskStoreHitCount = 0 missCountNotFound = 0 missCountExpired = 0 ]
There was no such logger 'org.codehaus.plexus.redback.xwork.filter.authentication.HttpAuthenticator:basic' 10401072.
 WARN|main|48107|PlexusContainer                - Component manager not found for returned component. Ignored. component=org.apache.maven.archiva.web.repository.ProxiedDavServer@8fdcd1
 INFO|main|48194|log                            - jetty-6.1.5
 INFO|main|48195|log                            - Started SocketConnector@0.0.0.0:41701
Remote HTTP Server started on http://localhost:41701/snapshots
 INFO|main|49136|AuditLog                       - internal guest 127.0.0.1 "org/apache/archiva/test/3.0-SNAPSHOT/test-3.0-20070822.033400-42.jar" "Modify File (proxied)"
 INFO|main|49247|Cache:url-failures-cache       - Disposing cache: [ name = url-failures-cache status = STATUS_ALIVE eternal = false overflowToDisk = false maxElementsInMemory = 1000 maxElementsOnDisk = 0 memoryStoreEvictionPolicy = LRU timeToLiveSeconds = 1800 timeToIdleSeconds = 2700 diskPersistent = false diskExpiryThreadIntervalSeconds = 600 cacheEventListeners:  hitCount = 0 memoryStoreHitCount = 0 diskStoreHitCount = 0 missCountNotFound = 0 missCountExpired = 0 ]
There was no such logger 'org.codehaus.plexus.redback.xwork.filter.authentication.HttpAuthenticator:basic' 10961567.
 WARN|main|49247|PlexusContainer                - Component manager not found for returned component. Ignored. component=org.apache.maven.archiva.web.repository.ProxiedDavServer@ca3147
 INFO|main|49628|log                            - jetty-6.1.5
 INFO|main|49629|log                            - Started SocketConnector@0.0.0.0:41706
Remote HTTP Server started on http://localhost:41706/snapshots
 INFO|main|50538|RepositoryProxyConnectors:default - Transfer not attempted on http://localhost:41706/snapshots/org/apache/archiva/test/3.0-SNAPSHOT/test-3.0-20070822.033400-42.pom : NO to update, snapshots policy set to NEVER.
 INFO|main|50539|RepositoryProxyConnectors:default - Transfer not attempted on http://localhost:41706/snapshots/org/apache/archiva/test/3.0-SNAPSHOT/test-3.0-20070822.033400-42.jar : NO to update, snapshots policy set to NEVER.: using already present local file.
 INFO|main|50540|AuditLog                       - internal guest 127.0.0.1 "org/apache/archiva/test/3.0-SNAPSHOT/test-3.0-20070822.033400-42.jar" "Modify File (proxied)"
 INFO|main|50647|Cache:url-failures-cache       - Disposing cache: [ name = url-failures-cache status = STATUS_ALIVE eternal = false overflowToDisk = false maxElementsInMemory = 1000 maxElementsOnDisk = 0 memoryStoreEvictionPolicy = LRU timeToLiveSeconds = 1800 timeToIdleSeconds = 2700 diskPersistent = false diskExpiryThreadIntervalSeconds = 600 cacheEventListeners:  hitCount = 0 memoryStoreHitCount = 0 diskStoreHitCount = 0 missCountNotFound = 0 missCountExpired = 0 ]
There was no such logger 'org.codehaus.plexus.redback.xwork.filter.authentication.HttpAuthenticator:basic' 18156392.
 WARN|main|50647|PlexusContainer                - Component manager not found for returned component. Ignored. component=org.apache.maven.archiva.web.repository.ProxiedDavServer@d71256
 INFO|main|50752|log                            - jetty-6.1.5
 INFO|main|50753|log                            - Started SocketConnector@0.0.0.0:41708
Remote HTTP Server started on http://localhost:41708/snapshots
 INFO|main|52101|RepositoryProxyConnectors:default - Transfer not attempted on http://localhost:41708/snapshots/org/apache/archiva/test/3.0-SNAPSHOT/test-3.0-20070822.033400-42.pom : NO to update, snapshots policy set to NEVER.
 INFO|main|52101|RepositoryProxyConnectors:default - Transfer not attempted on http://localhost:41708/snapshots/org/apache/archiva/test/3.0-SNAPSHOT/test-3.0-20070822.033400-42.jar : NO to update, snapshots policy set to NEVER.
 INFO|main|52217|Cache:url-failures-cache       - Disposing cache: [ name = url-failures-cache status = STATUS_ALIVE eternal = false overflowToDisk = false maxElementsInMemory = 1000 maxElementsOnDisk = 0 memoryStoreEvictionPolicy = LRU timeToLiveSeconds = 1800 timeToIdleSeconds = 2700 diskPersistent = false diskExpiryThreadIntervalSeconds = 600 cacheEventListeners:  hitCount = 0 memoryStoreHitCount = 0 diskStoreHitCount = 0 missCountNotFound = 0 missCountExpired = 0 ]
There was no such logger 'org.codehaus.plexus.redback.xwork.filter.authentication.HttpAuthenticator:basic' 14891863.
 WARN|main|52217|PlexusContainer                - Component manager not found for returned component. Ignored. component=org.apache.maven.archiva.web.repository.ProxiedDavServer@3087bd
 INFO|main|52356|log                            - jetty-6.1.5
 INFO|main|52357|log                            - Started SocketConnector@0.0.0.0:41716
Remote HTTP Server started on http://localhost:41716/snapshots
 INFO|main|53392|RepositoryProxyConnectors:default - Transfer not attempted on http://localhost:41716/snapshots/org/apache/archiva/test/3.0-SNAPSHOT/test-3.0-20070822.033400-42.pom : NO to update, snapshots policy set to NEVER.
 INFO|main|53393|RepositoryProxyConnectors:default - Transfer not attempted on http://localhost:41716/snapshots/org/apache/archiva/test/3.0-SNAPSHOT/test-3.0-20070822.033400-42.jar : NO to update, snapshots policy set to NEVER.: using already present local file.
 INFO|main|53394|AuditLog                       - internal guest 127.0.0.1 "org/apache/archiva/test/3.0-SNAPSHOT/test-3.0-20070822.033400-42.jar" "Modify File (proxied)"
 INFO|main|53506|Cache:url-failures-cache       - Disposing cache: [ name = url-failures-cache status = STATUS_ALIVE eternal = false overflowToDisk = false maxElementsInMemory = 1000 maxElementsOnDisk = 0 memoryStoreEvictionPolicy = LRU timeToLiveSeconds = 1800 timeToIdleSeconds = 2700 diskPersistent = false diskExpiryThreadIntervalSeconds = 600 cacheEventListeners:  hitCount = 0 memoryStoreHitCount = 0 diskStoreHitCount = 0 missCountNotFound = 0 missCountExpired = 0 ]
There was no such logger 'org.codehaus.plexus.redback.xwork.filter.authentication.HttpAuthenticator:basic' 29106149.
 WARN|main|53507|PlexusContainer                - Component manager not found for returned component. Ignored. component=org.apache.maven.archiva.web.repository.ProxiedDavServer@15ab10b
 INFO|main|53930|log                            - jetty-6.1.5
 INFO|main|53931|log                            - Started SocketConnector@0.0.0.0:41718
Remote HTTP Server started on http://localhost:41718/snapshots
 INFO|main|54987|RepositoryProxyConnectors:default - Transfer not attempted on http://localhost:41718/snapshots/org/apache/archiva/test/3.0-SNAPSHOT/test-3.0-20070822.033400-42.jar : NO to update snapshots, policy is HOURLY, local file exist, and has been updated within the last hour.: using already present local file.
 INFO|main|54988|AuditLog                       - internal guest 127.0.0.1 "org/apache/archiva/test/3.0-SNAPSHOT/test-3.0-20070822.033400-42.jar" "Modify File (proxied)"
 INFO|main|54995|Cache:url-failures-cache       - Disposing cache: [ name = url-failures-cache status = STATUS_ALIVE eternal = false overflowToDisk = false maxElementsInMemory = 1000 maxElementsOnDisk = 0 memoryStoreEvictionPolicy = LRU timeToLiveSeconds = 1800 timeToIdleSeconds = 2700 diskPersistent = false diskExpiryThreadIntervalSeconds = 600 cacheEventListeners:  hitCount = 0 memoryStoreHitCount = 0 diskStoreHitCount = 0 missCountNotFound = 0 missCountExpired = 0 ]
There was no such logger 'org.codehaus.plexus.redback.xwork.filter.authentication.HttpAuthenticator:basic' 7298031.
 WARN|main|54996|PlexusContainer                - Component manager not found for returned component. Ignored. component=org.apache.maven.archiva.web.repository.ProxiedDavServer@1c669dc
 INFO|main|55083|log                            - jetty-6.1.5
 INFO|main|55085|log                            - Started SocketConnector@0.0.0.0:41724
Remote HTTP Server started on http://localhost:41724/snapshots
 INFO|main|56114|AuditLog                       - internal guest 127.0.0.1 "org/apache/archiva/test/3.0-SNAPSHOT/test-3.0-20070822.033400-42.jar" "Modify File (proxied)"
 INFO|main|56226|Cache:url-failures-cache       - Disposing cache: [ name = url-failures-cache status = STATUS_ALIVE eternal = false overflowToDisk = false maxElementsInMemory = 1000 maxElementsOnDisk = 0 memoryStoreEvictionPolicy = LRU timeToLiveSeconds = 1800 timeToIdleSeconds = 2700 diskPersistent = false diskExpiryThreadIntervalSeconds = 600 cacheEventListeners:  hitCount = 0 memoryStoreHitCount = 0 diskStoreHitCount = 0 missCountNotFound = 0 missCountExpired = 0 ]
There was no such logger 'org.codehaus.plexus.redback.xwork.filter.authentication.HttpAuthenticator:basic' 22537571.
 WARN|main|56227|PlexusContainer                - Component manager not found for returned component. Ignored. component=org.apache.maven.archiva.web.repository.ProxiedDavServer@1d08c1b
 INFO|main|56448|log                            - jetty-6.1.5
 INFO|main|56450|log                            - Started SocketConnector@0.0.0.0:41729
Remote HTTP Server started on http://localhost:41729/snapshots
 INFO|main|57400|AuditLog                       - internal guest 127.0.0.1 "org/apache/archiva/test/3.0-SNAPSHOT/test-3.0-20070822.033400-42.jar" "Modify File (proxied)"
 INFO|main|57506|Cache:url-failures-cache       - Disposing cache: [ name = url-failures-cache status = STATUS_ALIVE eternal = false overflowToDisk = false maxElementsInMemory = 1000 maxElementsOnDisk = 0 memoryStoreEvictionPolicy = LRU timeToLiveSeconds = 1800 timeToIdleSeconds = 2700 diskPersistent = false diskExpiryThreadIntervalSeconds = 600 cacheEventListeners:  hitCount = 0 memoryStoreHitCount = 0 diskStoreHitCount = 0 missCountNotFound = 0 missCountExpired = 0 ]
There was no such logger 'org.codehaus.plexus.redback.xwork.filter.authentication.HttpAuthenticator:basic' 29943815.
 WARN|main|57507|PlexusContainer                - Component manager not found for returned component. Ignored. component=org.apache.maven.archiva.web.repository.ProxiedDavServer@3e07bd
 INFO|main|57589|log                            - jetty-6.1.5
 INFO|main|57590|log                            - Started SocketConnector@0.0.0.0:41733
Remote HTTP Server started on http://localhost:41733/snapshots
 INFO|main|58468|RepositoryProxyConnectors:default - Transfer not attempted on http://localhost:41733/snapshots/org/apache/archiva/test/3.0-SNAPSHOT/test-3.0-20070822.033400-42.jar : NO to update snapshots, policy is ONCE, and local file exist.: using already present local file.
 INFO|main|58469|AuditLog                       - internal guest 127.0.0.1 "org/apache/archiva/test/3.0-SNAPSHOT/test-3.0-20070822.033400-42.jar" "Modify File (proxied)"
 INFO|main|58472|Cache:url-failures-cache       - Disposing cache: [ name = url-failures-cache status = STATUS_ALIVE eternal = false overflowToDisk = false maxElementsInMemory = 1000 maxElementsOnDisk = 0 memoryStoreEvictionPolicy = LRU timeToLiveSeconds = 1800 timeToIdleSeconds = 2700 diskPersistent = false diskExpiryThreadIntervalSeconds = 600 cacheEventListeners:  hitCount = 0 memoryStoreHitCount = 0 diskStoreHitCount = 0 missCountNotFound = 0 missCountExpired = 0 ]
There was no such logger 'org.codehaus.plexus.redback.xwork.filter.authentication.HttpAuthenticator:basic' 16246225.
 WARN|main|58472|PlexusContainer                - Component manager not found for returned component. Ignored. component=org.apache.maven.archiva.web.repository.ProxiedDavServer@49ca75
 INFO|main|58743|log                            - jetty-6.1.5
 INFO|main|58744|log                            - Started SocketConnector@0.0.0.0:41737
Remote HTTP Server started on http://localhost:41737/snapshots
 INFO|main|59674|AuditLog                       - internal guest 127.0.0.1 "org/apache/archiva/test/3.0-SNAPSHOT/test-3.0-20070822.033400-42.jar" "Modify File (proxied)"
 INFO|main|59693|Cache:url-failures-cache       - Disposing cache: [ name = url-failures-cache status = STATUS_ALIVE eternal = false overflowToDisk = false maxElementsInMemory = 1000 maxElementsOnDisk = 0 memoryStoreEvictionPolicy = LRU timeToLiveSeconds = 1800 timeToIdleSeconds = 2700 diskPersistent = false diskExpiryThreadIntervalSeconds = 600 cacheEventListeners:  hitCount = 0 memoryStoreHitCount = 0 diskStoreHitCount = 0 missCountNotFound = 0 missCountExpired = 0 ]
 WARN|main|59693|PlexusContainer                - Component manager not found for returned component. Ignored. component=org.apache.maven.archiva.web.repository.ProxiedDavServer@8bb0f8
There was no such logger 'org.codehaus.plexus.redback.xwork.filter.authentication.HttpAuthenticator:basic' 11919482.
 INFO|main|59844|log                            - jetty-6.1.5
 INFO|main|59846|log                            - Started SocketConnector@0.0.0.0:41744
Remote HTTP Server started on http://localhost:41744/snapshots
 INFO|main|60798|AuditLog                       - internal guest 127.0.0.1 "org/apache/archiva/test/3.0-SNAPSHOT/test-3.0-20070822.033400-42.jar" "Modify File (proxied)"
 INFO|main|60906|Cache:url-failures-cache       - Disposing cache: [ name = url-failures-cache status = STATUS_ALIVE eternal = false overflowToDisk = false maxElementsInMemory = 1000 maxElementsOnDisk = 0 memoryStoreEvictionPolicy = LRU timeToLiveSeconds = 1800 timeToIdleSeconds = 2700 diskPersistent = false diskExpiryThreadIntervalSeconds = 600 cacheEventListeners:  hitCount = 0 memoryStoreHitCount = 0 diskStoreHitCount = 0 missCountNotFound = 0 missCountExpired = 0 ]
There was no such logger 'org.codehaus.plexus.redback.xwork.filter.authentication.HttpAuthenticator:basic' 25774080.
 WARN|main|60906|PlexusContainer                - Component manager not found for returned component. Ignored. component=org.apache.maven.archiva.web.repository.ProxiedDavServer@1ee33f3
Tests run: 15, Failures: 0, Errors: 0, Skipped: 0, Time elapsed: 19.546 sec
Running org.apache.maven.archiva.web.action.admin.repositories.RepositoriesActionTest
 INFO|main|60984|Cache:url-failures-cache       - Disposing cache: [ name = url-failures-cache status = STATUS_ALIVE eternal = false overflowToDisk = false maxElementsInMemory = 1000 maxElementsOnDisk = 0 memoryStoreEvictionPolicy = LRU timeToLiveSeconds = 1800 timeToIdleSeconds = 2700 diskPersistent = true diskExpiryThreadIntervalSeconds = 600 cacheEventListeners:  hitCount = 0 memoryStoreHitCount = 0 diskStoreHitCount = 0 missCountNotFound = 0 missCountExpired = 0 ]
 INFO|main|61068|Cache:url-failures-cache       - Disposing cache: [ name = url-failures-cache status = STATUS_ALIVE eternal = false overflowToDisk = false maxElementsInMemory = 1000 maxElementsOnDisk = 0 memoryStoreEvictionPolicy = LRU timeToLiveSeconds = 1800 timeToIdleSeconds = 2700 diskPersistent = true diskExpiryThreadIntervalSeconds = 600 cacheEventListeners:  hitCount = 0 memoryStoreHitCount = 0 diskStoreHitCount = 0 missCountNotFound = 0 missCountExpired = 0 ]
Tests run: 2, Failures: 0, Errors: 0, Skipped: 0, Time elapsed: 0.159 sec
Running org.apache.maven.archiva.web.repository.RepositoryServletProxiedSnapshotPolicyTest
 INFO|main|61519|log                            - jetty-6.1.5
 INFO|main|61520|log                            - Started SocketConnector@0.0.0.0:41748
Remote HTTP Server started on http://localhost:41748/snapshots
 INFO|main|62545|Cache:url-failures-cache       - Disposing cache: [ name = url-failures-cache status = STATUS_ALIVE eternal = false overflowToDisk = false maxElementsInMemory = 1000 maxElementsOnDisk = 0 memoryStoreEvictionPolicy = LRU timeToLiveSeconds = 1800 timeToIdleSeconds = 2700 diskPersistent = false diskExpiryThreadIntervalSeconds = 600 cacheEventListeners:  hitCount = 0 memoryStoreHitCount = 0 diskStoreHitCount = 0 missCountNotFound = 0 missCountExpired = 0 ]
There was no such logger 'org.codehaus.plexus.redback.xwork.filter.authentication.HttpAuthenticator:basic' 27870384.
 WARN|main|62546|PlexusContainer                - Component manager not found for returned component. Ignored. component=org.apache.maven.archiva.web.repository.ProxiedDavServer@10e38c7
 INFO|main|62631|log                            - jetty-6.1.5
 INFO|main|62632|log                            - Started SocketConnector@0.0.0.0:41751
Remote HTTP Server started on http://localhost:41751/snapshots
 INFO|main|63589|AuditLog                       - internal guest 127.0.0.1 "org/apache/archiva/test/2.0-SNAPSHOT/test-2.0-SNAPSHOT.jar" "Modify File (proxied)"
 INFO|main|63696|Cache:url-failures-cache       - Disposing cache: [ name = url-failures-cache status = STATUS_ALIVE eternal = false overflowToDisk = false maxElementsInMemory = 1000 maxElementsOnDisk = 0 memoryStoreEvictionPolicy = LRU timeToLiveSeconds = 1800 timeToIdleSeconds = 2700 diskPersistent = false diskExpiryThreadIntervalSeconds = 600 cacheEventListeners:  hitCount = 0 memoryStoreHitCount = 0 diskStoreHitCount = 0 missCountNotFound = 0 missCountExpired = 0 ]
There was no such logger 'org.codehaus.plexus.redback.xwork.filter.authentication.HttpAuthenticator:basic' 13829463.
 WARN|main|63697|PlexusContainer                - Component manager not found for returned component. Ignored. component=org.apache.maven.archiva.web.repository.ProxiedDavServer@1d69fa3
 INFO|main|63782|log                            - jetty-6.1.5
 INFO|main|63784|log                            - Started SocketConnector@0.0.0.0:41756
Remote HTTP Server started on http://localhost:41756/snapshots
 INFO|main|64734|AuditLog                       - internal guest 127.0.0.1 "org/apache/archiva/test/2.0-SNAPSHOT/test-2.0-SNAPSHOT.jar" "Modify File (proxied)"
 INFO|main|64846|Cache:url-failures-cache       - Disposing cache: [ name = url-failures-cache status = STATUS_ALIVE eternal = false overflowToDisk = false maxElementsInMemory = 1000 maxElementsOnDisk = 0 memoryStoreEvictionPolicy = LRU timeToLiveSeconds = 1800 timeToIdleSeconds = 2700 diskPersistent = false diskExpiryThreadIntervalSeconds = 600 cacheEventListeners:  hitCount = 0 memoryStoreHitCount = 0 diskStoreHitCount = 0 missCountNotFound = 0 missCountExpired = 0 ]
There was no such logger 'org.codehaus.plexus.redback.xwork.filter.authentication.HttpAuthenticator:basic' 23791810.
 WARN|main|64847|PlexusContainer                - Component manager not found for returned component. Ignored. component=org.apache.maven.archiva.web.repository.ProxiedDavServer@3f9ad
 INFO|main|65132|log                            - jetty-6.1.5
 INFO|main|65132|log                            - Started SocketConnector@0.0.0.0:41760
Remote HTTP Server started on http://localhost:41760/snapshots
 INFO|main|65983|RepositoryProxyConnectors:default - Transfer not attempted on http://localhost:41760/snapshots/org/apache/archiva/test/2.0-SNAPSHOT/test-2.0-SNAPSHOT.jar : NO to update snapshots, policy is DAILY, local file exist, and has been updated within the last day.: using already present local file.
 INFO|main|65983|AuditLog                       - internal guest 127.0.0.1 "org/apache/archiva/test/2.0-SNAPSHOT/test-2.0-SNAPSHOT.jar" "Modify File (proxied)"
 INFO|main|66095|Cache:url-failures-cache       - Disposing cache: [ name = url-failures-cache status = STATUS_ALIVE eternal = false overflowToDisk = false maxElementsInMemory = 1000 maxElementsOnDisk = 0 memoryStoreEvictionPolicy = LRU timeToLiveSeconds = 1800 timeToIdleSeconds = 2700 diskPersistent = false diskExpiryThreadIntervalSeconds = 600 cacheEventListeners:  hitCount = 0 memoryStoreHitCount = 0 diskStoreHitCount = 0 missCountNotFound = 0 missCountExpired = 0 ]
There was no such logger 'org.codehaus.plexus.redback.xwork.filter.authentication.HttpAuthenticator:basic' 2830316.
 WARN|main|66096|PlexusContainer                - Component manager not found for returned component. Ignored. component=org.apache.maven.archiva.web.repository.ProxiedDavServer@1ba1c47
 INFO|main|66182|log                            - jetty-6.1.5
 INFO|main|66183|log                            - Started SocketConnector@0.0.0.0:41763
Remote HTTP Server started on http://localhost:41763/snapshots
 INFO|main|67096|AuditLog                       - internal guest 127.0.0.1 "org/apache/archiva/test/2.0-SNAPSHOT/test-2.0-SNAPSHOT.jar" "Modify File (proxied)"
 INFO|main|67205|Cache:url-failures-cache       - Disposing cache: [ name = url-failures-cache status = STATUS_ALIVE eternal = false overflowToDisk = false maxElementsInMemory = 1000 maxElementsOnDisk = 0 memoryStoreEvictionPolicy = LRU timeToLiveSeconds = 1800 timeToIdleSeconds = 2700 diskPersistent = false diskExpiryThreadIntervalSeconds = 600 cacheEventListeners:  hitCount = 0 memoryStoreHitCount = 0 diskStoreHitCount = 0 missCountNotFound = 0 missCountExpired = 0 ]
There was no such logger 'org.codehaus.plexus.redback.xwork.filter.authentication.HttpAuthenticator:basic' 13266288.
 WARN|main|67206|PlexusContainer                - Component manager not found for returned component. Ignored. component=org.apache.maven.archiva.web.repository.ProxiedDavServer@1360218
 INFO|main|67351|log                            - jetty-6.1.5
 INFO|main|67353|log                            - Started SocketConnector@0.0.0.0:41772
Remote HTTP Server started on http://localhost:41772/snapshots
 INFO|main|68380|AuditLog                       - internal guest 127.0.0.1 "org/apache/archiva/test/2.0-SNAPSHOT/test-2.0-SNAPSHOT.jar" "Modify File (proxied)"
 INFO|main|68493|Cache:url-failures-cache       - Disposing cache: [ name = url-failures-cache status = STATUS_ALIVE eternal = false overflowToDisk = false maxElementsInMemory = 1000 maxElementsOnDisk = 0 memoryStoreEvictionPolicy = LRU timeToLiveSeconds = 1800 timeToIdleSeconds = 2700 diskPersistent = false diskExpiryThreadIntervalSeconds = 600 cacheEventListeners:  hitCount = 0 memoryStoreHitCount = 0 diskStoreHitCount = 0 missCountNotFound = 0 missCountExpired = 0 ]
There was no such logger 'org.codehaus.plexus.redback.xwork.filter.authentication.HttpAuthenticator:basic' 14320460.
 WARN|main|68494|PlexusContainer                - Component manager not found for returned component. Ignored. component=org.apache.maven.archiva.web.repository.ProxiedDavServer@175ae09
 INFO|main|68647|log                            - jetty-6.1.5
 INFO|main|68648|log                            - Started SocketConnector@0.0.0.0:41777
Remote HTTP Server started on http://localhost:41777/snapshots
 INFO|main|69579|RepositoryProxyConnectors:default - Transfer not attempted on http://localhost:41777/snapshots/org/apache/archiva/test/2.0-SNAPSHOT/test-2.0-SNAPSHOT.pom : NO to update, snapshots policy set to NEVER.
 INFO|main|69580|RepositoryProxyConnectors:default - Transfer not attempted on http://localhost:41777/snapshots/org/apache/archiva/test/2.0-SNAPSHOT/test-2.0-SNAPSHOT.jar : NO to update, snapshots policy set to NEVER.: using already present local file.
 INFO|main|69580|AuditLog                       - internal guest 127.0.0.1 "org/apache/archiva/test/2.0-SNAPSHOT/test-2.0-SNAPSHOT.jar" "Modify File (proxied)"
 INFO|main|69725|Cache:url-failures-cache       - Disposing cache: [ name = url-failures-cache status = STATUS_ALIVE eternal = false overflowToDisk = false maxElementsInMemory = 1000 maxElementsOnDisk = 0 memoryStoreEvictionPolicy = LRU timeToLiveSeconds = 1800 timeToIdleSeconds = 2700 diskPersistent = false diskExpiryThreadIntervalSeconds = 600 cacheEventListeners:  hitCount = 0 memoryStoreHitCount = 0 diskStoreHitCount = 0 missCountNotFound = 0 missCountExpired = 0 ]
There was no such logger 'org.codehaus.plexus.redback.xwork.filter.authentication.HttpAuthenticator:basic' 16378091.
 WARN|main|69725|PlexusContainer                - Component manager not found for returned component. Ignored. component=org.apache.maven.archiva.web.repository.ProxiedDavServer@d5232c
 INFO|main|69904|log                            - jetty-6.1.5
 INFO|main|69905|log                            - Started SocketConnector@0.0.0.0:41781
Remote HTTP Server started on http://localhost:41781/snapshots
 INFO|main|70852|RepositoryProxyConnectors:default - Transfer not attempted on http://localhost:41781/snapshots/org/apache/archiva/test/2.0-SNAPSHOT/test-2.0-SNAPSHOT.pom : NO to update, snapshots policy set to NEVER.
 INFO|main|70862|RepositoryProxyConnectors:default - Transfer not attempted on http://localhost:41781/snapshots/org/apache/archiva/test/2.0-SNAPSHOT/test-2.0-SNAPSHOT.jar : NO to update, snapshots policy set to NEVER.
 INFO|main|70968|Cache:url-failures-cache       - Disposing cache: [ name = url-failures-cache status = STATUS_ALIVE eternal = false overflowToDisk = false maxElementsInMemory = 1000 maxElementsOnDisk = 0 memoryStoreEvictionPolicy = LRU timeToLiveSeconds = 1800 timeToIdleSeconds = 2700 diskPersistent = false diskExpiryThreadIntervalSeconds = 600 cacheEventListeners:  hitCount = 0 memoryStoreHitCount = 0 diskStoreHitCount = 0 missCountNotFound = 0 missCountExpired = 0 ]
There was no such logger 'org.codehaus.plexus.redback.xwork.filter.authentication.HttpAuthenticator:basic' 20333014.
 WARN|main|70972|PlexusContainer                - Component manager not found for returned component. Ignored. component=org.apache.maven.archiva.web.repository.ProxiedDavServer@16ac22d
 INFO|main|71066|log                            - jetty-6.1.5
 INFO|main|71067|log                            - Started SocketConnector@0.0.0.0:41783
Remote HTTP Server started on http://localhost:41783/snapshots
 INFO|main|71971|RepositoryProxyConnectors:default - Transfer not attempted on http://localhost:41783/snapshots/org/apache/archiva/test/2.0-SNAPSHOT/test-2.0-SNAPSHOT.pom : NO to update, snapshots policy set to NEVER.
 INFO|main|71971|RepositoryProxyConnectors:default - Transfer not attempted on http://localhost:41783/snapshots/org/apache/archiva/test/2.0-SNAPSHOT/test-2.0-SNAPSHOT.jar : NO to update, snapshots policy set to NEVER.: using already present local file.
 INFO|main|71972|AuditLog                       - internal guest 127.0.0.1 "org/apache/archiva/test/2.0-SNAPSHOT/test-2.0-SNAPSHOT.jar" "Modify File (proxied)"
 INFO|main|72225|Cache:url-failures-cache       - Disposing cache: [ name = url-failures-cache status = STATUS_ALIVE eternal = false overflowToDisk = false maxElementsInMemory = 1000 maxElementsOnDisk = 0 memoryStoreEvictionPolicy = LRU timeToLiveSeconds = 1800 timeToIdleSeconds = 2700 diskPersistent = false diskExpiryThreadIntervalSeconds = 600 cacheEventListeners:  hitCount = 0 memoryStoreHitCount = 0 diskStoreHitCount = 0 missCountNotFound = 0 missCountExpired = 0 ]
There was no such logger 'org.codehaus.plexus.redback.xwork.filter.authentication.HttpAuthenticator:basic' 12098566.
 WARN|main|72225|PlexusContainer                - Component manager not found for returned component. Ignored. component=org.apache.maven.archiva.web.repository.ProxiedDavServer@14e5966
 INFO|main|72310|log                            - jetty-6.1.5
 INFO|main|72311|log                            - Started SocketConnector@0.0.0.0:41785
Remote HTTP Server started on http://localhost:41785/snapshots
 INFO|main|73200|RepositoryProxyConnectors:default - Transfer not attempted on http://localhost:41785/snapshots/org/apache/archiva/test/2.0-SNAPSHOT/test-2.0-SNAPSHOT.jar : NO to update snapshots, policy is HOURLY, local file exist, and has been updated within the last hour.: using already present local file.
 INFO|main|73200|AuditLog                       - internal guest 127.0.0.1 "org/apache/archiva/test/2.0-SNAPSHOT/test-2.0-SNAPSHOT.jar" "Modify File (proxied)"
 INFO|main|73354|Cache:url-failures-cache       - Disposing cache: [ name = url-failures-cache status = STATUS_ALIVE eternal = false overflowToDisk = false maxElementsInMemory = 1000 maxElementsOnDisk = 0 memoryStoreEvictionPolicy = LRU timeToLiveSeconds = 1800 timeToIdleSeconds = 2700 diskPersistent = false diskExpiryThreadIntervalSeconds = 600 cacheEventListeners:  hitCount = 0 memoryStoreHitCount = 0 diskStoreHitCount = 0 missCountNotFound = 0 missCountExpired = 0 ]
There was no such logger 'org.codehaus.plexus.redback.xwork.filter.authentication.HttpAuthenticator:basic' 22846648.
 WARN|main|73355|PlexusContainer                - Component manager not found for returned component. Ignored. component=org.apache.maven.archiva.web.repository.ProxiedDavServer@ad80cf
 INFO|main|73440|log                            - jetty-6.1.5
 INFO|main|73441|log                            - Started SocketConnector@0.0.0.0:41787
Remote HTTP Server started on http://localhost:41787/snapshots
 INFO|main|74371|AuditLog                       - internal guest 127.0.0.1 "org/apache/archiva/test/2.0-SNAPSHOT/test-2.0-SNAPSHOT.jar" "Modify File (proxied)"
 INFO|main|74494|Cache:url-failures-cache       - Disposing cache: [ name = url-failures-cache status = STATUS_ALIVE eternal = false overflowToDisk = false maxElementsInMemory = 1000 maxElementsOnDisk = 0 memoryStoreEvictionPolicy = LRU timeToLiveSeconds = 1800 timeToIdleSeconds = 2700 diskPersistent = false diskExpiryThreadIntervalSeconds = 600 cacheEventListeners:  hitCount = 0 memoryStoreHitCount = 0 diskStoreHitCount = 0 missCountNotFound = 0 missCountExpired = 0 ]
There was no such logger 'org.codehaus.plexus.redback.xwork.filter.authentication.HttpAuthenticator:basic' 21028376.
 WARN|main|74495|PlexusContainer                - Component manager not found for returned component. Ignored. component=org.apache.maven.archiva.web.repository.ProxiedDavServer@1a63e06
 INFO|main|74657|log                            - jetty-6.1.5
 INFO|main|74658|log                            - Started SocketConnector@0.0.0.0:41791
Remote HTTP Server started on http://localhost:41791/snapshots
 INFO|main|75608|AuditLog                       - internal guest 127.0.0.1 "org/apache/archiva/test/2.0-SNAPSHOT/test-2.0-SNAPSHOT.jar" "Modify File (proxied)"
 INFO|main|75724|Cache:url-failures-cache       - Disposing cache: [ name = url-failures-cache status = STATUS_ALIVE eternal = false overflowToDisk = false maxElementsInMemory = 1000 maxElementsOnDisk = 0 memoryStoreEvictionPolicy = LRU timeToLiveSeconds = 1800 timeToIdleSeconds = 2700 diskPersistent = false diskExpiryThreadIntervalSeconds = 600 cacheEventListeners:  hitCount = 0 memoryStoreHitCount = 0 diskStoreHitCount = 0 missCountNotFound = 0 missCountExpired = 0 ]
There was no such logger 'org.codehaus.plexus.redback.xwork.filter.authentication.HttpAuthenticator:basic' 24713718.
 WARN|main|75725|PlexusContainer                - Component manager not found for returned component. Ignored. component=org.apache.maven.archiva.web.repository.ProxiedDavServer@192deaf
 INFO|main|75806|log                            - jetty-6.1.5
 INFO|main|75807|log                            - Started SocketConnector@0.0.0.0:41795
Remote HTTP Server started on http://localhost:41795/snapshots
 INFO|main|76720|RepositoryProxyConnectors:default - Transfer not attempted on http://localhost:41795/snapshots/org/apache/archiva/test/2.0-SNAPSHOT/test-2.0-SNAPSHOT.jar : NO to update snapshots, policy is ONCE, and local file exist.: using already present local file.
 INFO|main|76721|AuditLog                       - internal guest 127.0.0.1 "org/apache/archiva/test/2.0-SNAPSHOT/test-2.0-SNAPSHOT.jar" "Modify File (proxied)"
 INFO|main|76834|Cache:url-failures-cache       - Disposing cache: [ name = url-failures-cache status = STATUS_ALIVE eternal = false overflowToDisk = false maxElementsInMemory = 1000 maxElementsOnDisk = 0 memoryStoreEvictionPolicy = LRU timeToLiveSeconds = 1800 timeToIdleSeconds = 2700 diskPersistent = false diskExpiryThreadIntervalSeconds = 600 cacheEventListeners:  hitCount = 0 memoryStoreHitCount = 0 diskStoreHitCount = 0 missCountNotFound = 0 missCountExpired = 0 ]
There was no such logger 'org.codehaus.plexus.redback.xwork.filter.authentication.HttpAuthenticator:basic' 2144866.
 WARN|main|76835|PlexusContainer                - Component manager not found for returned component. Ignored. component=org.apache.maven.archiva.web.repository.ProxiedDavServer@1059a9a
 INFO|main|77013|log                            - jetty-6.1.5
 INFO|main|77015|log                            - Started SocketConnector@0.0.0.0:41798
Remote HTTP Server started on http://localhost:41798/snapshots
 INFO|main|77978|AuditLog                       - internal guest 127.0.0.1 "org/apache/archiva/test/2.0-SNAPSHOT/test-2.0-SNAPSHOT.jar" "Modify File (proxied)"
 INFO|main|78003|Cache:url-failures-cache       - Disposing cache: [ name = url-failures-cache status = STATUS_ALIVE eternal = false overflowToDisk = false maxElementsInMemory = 1000 maxElementsOnDisk = 0 memoryStoreEvictionPolicy = LRU timeToLiveSeconds = 1800 timeToIdleSeconds = 2700 diskPersistent = false diskExpiryThreadIntervalSeconds = 600 cacheEventListeners:  hitCount = 0 memoryStoreHitCount = 0 diskStoreHitCount = 0 missCountNotFound = 0 missCountExpired = 0 ]
There was no such logger 'org.codehaus.plexus.redback.xwork.filter.authentication.HttpAuthenticator:basic' 13390892.
 WARN|main|78004|PlexusContainer                - Component manager not found for returned component. Ignored. component=org.apache.maven.archiva.web.repository.ProxiedDavServer@1946cd6
 INFO|main|78300|log                            - jetty-6.1.5
 INFO|main|78301|log                            - Started SocketConnector@0.0.0.0:41803
Remote HTTP Server started on http://localhost:41803/snapshots
 INFO|main|79440|AuditLog                       - internal guest 127.0.0.1 "org/apache/archiva/test/2.0-SNAPSHOT/test-2.0-SNAPSHOT.jar" "Modify File (proxied)"
 INFO|main|79984|Cache:url-failures-cache       - Disposing cache: [ name = url-failures-cache status = STATUS_ALIVE eternal = false overflowToDisk = false maxElementsInMemory = 1000 maxElementsOnDisk = 0 memoryStoreEvictionPolicy = LRU timeToLiveSeconds = 1800 timeToIdleSeconds = 2700 diskPersistent = false diskExpiryThreadIntervalSeconds = 600 cacheEventListeners:  hitCount = 0 memoryStoreHitCount = 0 diskStoreHitCount = 0 missCountNotFound = 0 missCountExpired = 0 ]
There was no such logger 'org.codehaus.plexus.redback.xwork.filter.authentication.HttpAuthenticator:basic' 1786887.
 WARN|main|79984|PlexusContainer                - Component manager not found for returned component. Ignored. component=org.apache.maven.archiva.web.repository.ProxiedDavServer@1c8b234
Tests run: 15, Failures: 0, Errors: 0, Skipped: 0, Time elapsed: 18.914 sec
Running org.apache.maven.archiva.web.repository.RepositoryServletProxiedMetadataLocalOnlyTest
 INFO|main|80101|log                            - jetty-6.1.5
 INFO|main|80102|log                            - Started SocketConnector@0.0.0.0:41808
Remote HTTP Server started on http://localhost:41808/snapshots
 INFO|main|81058|log                            - jetty-6.1.5
 INFO|main|81059|log                            - Started SocketConnector@0.0.0.0:41812
Remote HTTP Server started on http://localhost:41812/private-snapshots
 INFO|main|81933|AuditLog                       - internal guest 127.0.0.1 "/org/apache/archiva/archivatest-maven-plugin/4.0-alpha-1-SNAPSHOT/maven-metadata.xml" "Modify File (proxied)"
 INFO|main|82154|Cache:url-failures-cache       - Disposing cache: [ name = url-failures-cache status = STATUS_ALIVE eternal = false overflowToDisk = false maxElementsInMemory = 1000 maxElementsOnDisk = 0 memoryStoreEvictionPolicy = LRU timeToLiveSeconds = 1800 timeToIdleSeconds = 2700 diskPersistent = false diskExpiryThreadIntervalSeconds = 600 cacheEventListeners:  hitCount = 0 memoryStoreHitCount = 0 diskStoreHitCount = 0 missCountNotFound = 0 missCountExpired = 0 ]
There was no such logger 'org.codehaus.plexus.redback.xwork.filter.authentication.HttpAuthenticator:basic' 26562728.
 WARN|main|82154|PlexusContainer                - Component manager not found for returned component. Ignored. component=org.apache.maven.archiva.web.repository.ProxiedDavServer@1f5f379
 INFO|main|82246|log                            - jetty-6.1.5
 INFO|main|82247|log                            - Started SocketConnector@0.0.0.0:41819
Remote HTTP Server started on http://localhost:41819/snapshots
 INFO|main|83058|log                            - jetty-6.1.5
 INFO|main|83059|log                            - Started SocketConnector@0.0.0.0:41821
Remote HTTP Server started on http://localhost:41821/private-snapshots
 INFO|main|84031|AuditLog                       - internal guest 127.0.0.1 "/org/apache/archiva/archivatest-maven-plugin/4.0-alpha-2/maven-metadata.xml" "Modify File (proxied)"
 INFO|main|84253|Cache:url-failures-cache       - Disposing cache: [ name = url-failures-cache status = STATUS_ALIVE eternal = false overflowToDisk = false maxElementsInMemory = 1000 maxElementsOnDisk = 0 memoryStoreEvictionPolicy = LRU timeToLiveSeconds = 1800 timeToIdleSeconds = 2700 diskPersistent = false diskExpiryThreadIntervalSeconds = 600 cacheEventListeners:  hitCount = 0 memoryStoreHitCount = 0 diskStoreHitCount = 0 missCountNotFound = 0 missCountExpired = 0 ]
There was no such logger 'org.codehaus.plexus.redback.xwork.filter.authentication.HttpAuthenticator:basic' 12549034.
 WARN|main|84254|PlexusContainer                - Component manager not found for returned component. Ignored. component=org.apache.maven.archiva.web.repository.ProxiedDavServer@d9a8c6
 INFO|main|84331|log                            - jetty-6.1.5
 INFO|main|84332|log                            - Started SocketConnector@0.0.0.0:41823
Remote HTTP Server started on http://localhost:41823/snapshots
 INFO|main|85222|log                            - jetty-6.1.5
 INFO|main|85224|log                            - Started SocketConnector@0.0.0.0:41830
Remote HTTP Server started on http://localhost:41830/private-snapshots
 INFO|main|86198|AuditLog                       - internal guest 127.0.0.1 "/org/apache/archiva/archivatest-maven-plugin/maven-metadata.xml" "Modify File (proxied)"
 INFO|main|86453|Cache:url-failures-cache       - Disposing cache: [ name = url-failures-cache status = STATUS_ALIVE eternal = false overflowToDisk = false maxElementsInMemory = 1000 maxElementsOnDisk = 0 memoryStoreEvictionPolicy = LRU timeToLiveSeconds = 1800 timeToIdleSeconds = 2700 diskPersistent = false diskExpiryThreadIntervalSeconds = 600 cacheEventListeners:  hitCount = 0 memoryStoreHitCount = 0 diskStoreHitCount = 0 missCountNotFound = 0 missCountExpired = 0 ]
There was no such logger 'org.codehaus.plexus.redback.xwork.filter.authentication.HttpAuthenticator:basic' 20355494.
 WARN|main|86454|PlexusContainer                - Component manager not found for returned component. Ignored. component=org.apache.maven.archiva.web.repository.ProxiedDavServer@10864d2
Tests run: 3, Failures: 0, Errors: 0, Skipped: 0, Time elapsed: 6.466 sec
Running org.apache.maven.archiva.web.repository.RepositoryServletBrowseTest
 INFO|main|86899|Cache:url-failures-cache       - Disposing cache: [ name = url-failures-cache status = STATUS_ALIVE eternal = false overflowToDisk = false maxElementsInMemory = 1000 maxElementsOnDisk = 0 memoryStoreEvictionPolicy = LRU timeToLiveSeconds = 1800 timeToIdleSeconds = 2700 diskPersistent = false diskExpiryThreadIntervalSeconds = 600 cacheEventListeners:  hitCount = 0 memoryStoreHitCount = 0 diskStoreHitCount = 0 missCountNotFound = 0 missCountExpired = 0 ]
There was no such logger 'org.codehaus.plexus.redback.xwork.filter.authentication.HttpAuthenticator:basic' 21756776.
 WARN|main|86899|PlexusContainer                - Component manager not found for returned component. Ignored. component=org.apache.maven.archiva.web.repository.ProxiedDavServer@159fd10
Tests run: 1, Failures: 0, Errors: 0, Skipped: 0, Time elapsed: 0.443 sec
Running org.apache.maven.archiva.web.repository.RepositoryServletNoProxyTest
 INFO|main|86992|Cache:url-failures-cache       - Disposing cache: [ name = url-failures-cache status = STATUS_ALIVE eternal = false overflowToDisk = false maxElementsInMemory = 1000 maxElementsOnDisk = 0 memoryStoreEvictionPolicy = LRU timeToLiveSeconds = 1800 timeToIdleSeconds = 2700 diskPersistent = false diskExpiryThreadIntervalSeconds = 600 cacheEventListeners:  hitCount = 0 memoryStoreHitCount = 0 diskStoreHitCount = 0 missCountNotFound = 0 missCountExpired = 0 ]
There was no such logger 'org.codehaus.plexus.redback.xwork.filter.authentication.HttpAuthenticator:basic' 22758450.
 WARN|main|87001|PlexusContainer                - Component manager not found for returned component. Ignored. component=org.apache.maven.archiva.web.repository.ProxiedDavServer@e5394c
 INFO|main|87095|Cache:url-failures-cache       - Disposing cache: [ name = url-failures-cache status = STATUS_ALIVE eternal = false overflowToDisk = false maxElementsInMemory = 1000 maxElementsOnDisk = 0 memoryStoreEvictionPolicy = LRU timeToLiveSeconds = 1800 timeToIdleSeconds = 2700 diskPersistent = false diskExpiryThreadIntervalSeconds = 600 cacheEventListeners:  hitCount = 0 memoryStoreHitCount = 0 diskStoreHitCount = 0 missCountNotFound = 0 missCountExpired = 0 ]
There was no such logger 'org.codehaus.plexus.redback.xwork.filter.authentication.HttpAuthenticator:basic' 19118327.
 WARN|main|87096|PlexusContainer                - Component manager not found for returned component. Ignored. component=org.apache.maven.archiva.web.repository.ProxiedDavServer@1adb0d5
 INFO|main|87186|AuditLog                       - internal guest 127.0.0.1 "/commons-lang/commons-lang/2.1/maven-metadata.xml" "Modify File (proxied)"
 INFO|main|87188|Cache:url-failures-cache       - Disposing cache: [ name = url-failures-cache status = STATUS_ALIVE eternal = false overflowToDisk = false maxElementsInMemory = 1000 maxElementsOnDisk = 0 memoryStoreEvictionPolicy = LRU timeToLiveSeconds = 1800 timeToIdleSeconds = 2700 diskPersistent = false diskExpiryThreadIntervalSeconds = 600 cacheEventListeners:  hitCount = 0 memoryStoreHitCount = 0 diskStoreHitCount = 0 missCountNotFound = 0 missCountExpired = 0 ]
There was no such logger 'org.codehaus.plexus.redback.xwork.filter.authentication.HttpAuthenticator:basic' 9158059.
 WARN|main|87188|PlexusContainer                - Component manager not found for returned component. Ignored. component=org.apache.maven.archiva.web.repository.ProxiedDavServer@1404e39
 INFO|main|87377|AuditLog                       - internal guest 127.0.0.1 "/commons-lang/commons-lang/maven-metadata.xml" "Modify File (proxied)"
 INFO|main|87379|Cache:url-failures-cache       - Disposing cache: [ name = url-failures-cache status = STATUS_ALIVE eternal = false overflowToDisk = false maxElementsInMemory = 1000 maxElementsOnDisk = 0 memoryStoreEvictionPolicy = LRU timeToLiveSeconds = 1800 timeToIdleSeconds = 2700 diskPersistent = false diskExpiryThreadIntervalSeconds = 600 cacheEventListeners:  hitCount = 0 memoryStoreHitCount = 0 diskStoreHitCount = 0 missCountNotFound = 0 missCountExpired = 0 ]
There was no such logger 'org.codehaus.plexus.redback.xwork.filter.authentication.HttpAuthenticator:basic' 5427592.
 WARN|main|87380|PlexusContainer                - Component manager not found for returned component. Ignored. component=org.apache.maven.archiva.web.repository.ProxiedDavServer@1ed9bc5
 INFO|main|87468|Cache:url-failures-cache       - Disposing cache: [ name = url-failures-cache status = STATUS_ALIVE eternal = false overflowToDisk = false maxElementsInMemory = 1000 maxElementsOnDisk = 0 memoryStoreEvictionPolicy = LRU timeToLiveSeconds = 1800 timeToIdleSeconds = 2700 diskPersistent = false diskExpiryThreadIntervalSeconds = 600 cacheEventListeners:  hitCount = 0 memoryStoreHitCount = 0 diskStoreHitCount = 0 missCountNotFound = 0 missCountExpired = 0 ]
There was no such logger 'org.codehaus.plexus.redback.xwork.filter.authentication.HttpAuthenticator:basic' 32868878.
 WARN|main|87468|PlexusContainer                - Component manager not found for returned component. Ignored. component=org.apache.maven.archiva.web.repository.ProxiedDavServer@588116
 INFO|main|87573|Cache:url-failures-cache       - Disposing cache: [ name = url-failures-cache status = STATUS_ALIVE eternal = false overflowToDisk = false maxElementsInMemory = 1000 maxElementsOnDisk = 0 memoryStoreEvictionPolicy = LRU timeToLiveSeconds = 1800 timeToIdleSeconds = 2700 diskPersistent = false diskExpiryThreadIntervalSeconds = 600 cacheEventListeners:  hitCount = 0 memoryStoreHitCount = 0 diskStoreHitCount = 0 missCountNotFound = 0 missCountExpired = 0 ]
There was no such logger 'org.codehaus.plexus.redback.xwork.filter.authentication.HttpAuthenticator:basic' 5515298.
 WARN|main|87574|PlexusContainer                - Component manager not found for returned component. Ignored. component=org.apache.maven.archiva.web.repository.ProxiedDavServer@174318a
 INFO|main|87678|Cache:url-failures-cache       - Disposing cache: [ name = url-failures-cache status = STATUS_ALIVE eternal = false overflowToDisk = false maxElementsInMemory = 1000 maxElementsOnDisk = 0 memoryStoreEvictionPolicy = LRU timeToLiveSeconds = 1800 timeToIdleSeconds = 2700 diskPersistent = false diskExpiryThreadIntervalSeconds = 600 cacheEventListeners:  hitCount = 0 memoryStoreHitCount = 0 diskStoreHitCount = 0 missCountNotFound = 0 missCountExpired = 0 ]
There was no such logger 'org.codehaus.plexus.redback.xwork.filter.authentication.HttpAuthenticator:basic' 16581213.
 WARN|main|87679|PlexusContainer                - Component manager not found for returned component. Ignored. component=org.apache.maven.archiva.web.repository.ProxiedDavServer@13e1384
 INFO|main|87822|Cache:url-failures-cache       - Disposing cache: [ name = url-failures-cache status = STATUS_ALIVE eternal = false overflowToDisk = false maxElementsInMemory = 1000 maxElementsOnDisk = 0 memoryStoreEvictionPolicy = LRU timeToLiveSeconds = 1800 timeToIdleSeconds = 2700 diskPersistent = false diskExpiryThreadIntervalSeconds = 600 cacheEventListeners:  hitCount = 0 memoryStoreHitCount = 0 diskStoreHitCount = 0 missCountNotFound = 0 missCountExpired = 0 ]
There was no such logger 'org.codehaus.plexus.redback.xwork.filter.authentication.HttpAuthenticator:basic' 19437207.
 WARN|main|87827|PlexusContainer                - Component manager not found for returned component. Ignored. component=org.apache.maven.archiva.web.repository.ProxiedDavServer@baa6ba
 INFO|main|88645|Cache:url-failures-cache       - Disposing cache: [ name = url-failures-cache status = STATUS_ALIVE eternal = false overflowToDisk = false maxElementsInMemory = 1000 maxElementsOnDisk = 0 memoryStoreEvictionPolicy = LRU timeToLiveSeconds = 1800 timeToIdleSeconds = 2700 diskPersistent = false diskExpiryThreadIntervalSeconds = 600 cacheEventListeners:  hitCount = 0 memoryStoreHitCount = 0 diskStoreHitCount = 0 missCountNotFound = 0 missCountExpired = 0 ]
There was no such logger 'org.codehaus.plexus.redback.xwork.filter.authentication.HttpAuthenticator:basic' 18554375.
 WARN|main|88646|PlexusContainer                - Component manager not found for returned component. Ignored. component=org.apache.maven.archiva.web.repository.ProxiedDavServer@d7bef6
 INFO|main|88774|Cache:url-failures-cache       - Disposing cache: [ name = url-failures-cache status = STATUS_ALIVE eternal = false overflowToDisk = false maxElementsInMemory = 1000 maxElementsOnDisk = 0 memoryStoreEvictionPolicy = LRU timeToLiveSeconds = 1800 timeToIdleSeconds = 2700 diskPersistent = false diskExpiryThreadIntervalSeconds = 600 cacheEventListeners:  hitCount = 0 memoryStoreHitCount = 0 diskStoreHitCount = 0 missCountNotFound = 0 missCountExpired = 0 ]
There was no such logger 'org.codehaus.plexus.redback.xwork.filter.authentication.HttpAuthenticator:basic' 8592657.
 WARN|main|88775|PlexusContainer                - Component manager not found for returned component. Ignored. component=org.apache.maven.archiva.web.repository.ProxiedDavServer@1b0eb2c
 INFO|main|88985|Cache:url-failures-cache       - Disposing cache: [ name = url-failures-cache status = STATUS_ALIVE eternal = false overflowToDisk = false maxElementsInMemory = 1000 maxElementsOnDisk = 0 memoryStoreEvictionPolicy = LRU timeToLiveSeconds = 1800 timeToIdleSeconds = 2700 diskPersistent = false diskExpiryThreadIntervalSeconds = 600 cacheEventListeners:  hitCount = 0 memoryStoreHitCount = 0 diskStoreHitCount = 0 missCountNotFound = 0 missCountExpired = 0 ]
There was no such logger 'org.codehaus.plexus.redback.xwork.filter.authentication.HttpAuthenticator:basic' 16479493.
 WARN|main|88986|PlexusContainer                - Component manager not found for returned component. Ignored. component=org.apache.maven.archiva.web.repository.ProxiedDavServer@1e0592c
Tests run: 11, Failures: 0, Errors: 0, Skipped: 0, Time elapsed: 2.084 sec
Running org.apache.maven.archiva.web.repository.RepositoryServletProxiedRelocatedTest
 INFO|main|89369|log                            - jetty-6.1.5
 INFO|main|89370|log                            - Started SocketConnector@0.0.0.0:41840
Remote HTTP Server started on http://localhost:41840/central
 INFO|main|91316|AuditLog                       - internal guest 127.0.0.1 "org/apache/archiva/test/1.0/test-1.0.jar" "Modify File (proxied)"
 INFO|main|91589|Cache:url-failures-cache       - Disposing cache: [ name = url-failures-cache status = STATUS_ALIVE eternal = false overflowToDisk = false maxElementsInMemory = 1000 maxElementsOnDisk = 0 memoryStoreEvictionPolicy = LRU timeToLiveSeconds = 1800 timeToIdleSeconds = 2700 diskPersistent = false diskExpiryThreadIntervalSeconds = 600 cacheEventListeners:  hitCount = 0 memoryStoreHitCount = 0 diskStoreHitCount = 0 missCountNotFound = 0 missCountExpired = 0 ]
There was no such logger 'org.codehaus.plexus.redback.xwork.filter.authentication.HttpAuthenticator:basic' 7686042.
 WARN|main|91862|PlexusContainer                - Component manager not found for returned component. Ignored. component=org.apache.maven.archiva.web.repository.ProxiedDavServer@12fd2db
Tests run: 1, Failures: 0, Errors: 0, Skipped: 0, Time elapsed: 2.873 sec
Running org.apache.maven.archiva.web.action.admin.connectors.proxy.ProxyConnectorsActionTest
[INFO] Disposing cache: [ name = url-failures-cache status = STATUS_ALIVE eternal = false overflowToDisk = false maxElementsInMemory = 1000 maxElementsOnDisk = 0 memoryStoreEvictionPolicy = LRU timeToLiveSeconds = 1800 timeToIdleSeconds = 2700 diskPersistent = true diskExpiryThreadIntervalSeconds = 600 cacheEventListeners:  hitCount = 0 memoryStoreHitCount = 0 diskStoreHitCount = 0 missCountNotFound = 0 missCountExpired = 0 ]
[INFO] Disposing cache: [ name = url-failures-cache status = STATUS_ALIVE eternal = false overflowToDisk = false maxElementsInMemory = 1000 maxElementsOnDisk = 0 memoryStoreEvictionPolicy = LRU timeToLiveSeconds = 1800 timeToIdleSeconds = 2700 diskPersistent = true diskExpiryThreadIntervalSeconds = 600 cacheEventListeners:  hitCount = 0 memoryStoreHitCount = 0 diskStoreHitCount = 0 missCountNotFound = 0 missCountExpired = 0 ]
Tests run: 2, Failures: 0, Errors: 0, Skipped: 0, Time elapsed: 0.237 sec
Running org.apache.maven.archiva.web.action.admin.connectors.proxy.SortProxyConnectorsActionTest
[INFO] Disposing cache: [ name = url-failures-cache status = STATUS_ALIVE eternal = false overflowToDisk = false maxElementsInMemory = 1000 maxElementsOnDisk = 0 memoryStoreEvictionPolicy = LRU timeToLiveSeconds = 1800 timeToIdleSeconds = 2700 diskPersistent = true diskExpiryThreadIntervalSeconds = 600 cacheEventListeners:  hitCount = 0 memoryStoreHitCount = 0 diskStoreHitCount = 0 missCountNotFound = 0 missCountExpired = 0 ]
[INFO] Disposing cache: [ name = url-failures-cache status = STATUS_ALIVE eternal = false overflowToDisk = false maxElementsInMemory = 1000 maxElementsOnDisk = 0 memoryStoreEvictionPolicy = LRU timeToLiveSeconds = 1800 timeToIdleSeconds = 2700 diskPersistent = true diskExpiryThreadIntervalSeconds = 600 cacheEventListeners:  hitCount = 0 memoryStoreHitCount = 0 diskStoreHitCount = 0 missCountNotFound = 0 missCountExpired = 0 ]
[INFO] Disposing cache: [ name = url-failures-cache status = STATUS_ALIVE eternal = false overflowToDisk = false maxElementsInMemory = 1000 maxElementsOnDisk = 0 memoryStoreEvictionPolicy = LRU timeToLiveSeconds = 1800 timeToIdleSeconds = 2700 diskPersistent = true diskExpiryThreadIntervalSeconds = 600 cacheEventListeners:  hitCount = 0 memoryStoreHitCount = 0 diskStoreHitCount = 0 missCountNotFound = 0 missCountExpired = 0 ]
[INFO] Disposing cache: [ name = url-failures-cache status = STATUS_ALIVE eternal = false overflowToDisk = false maxElementsInMemory = 1000 maxElementsOnDisk = 0 memoryStoreEvictionPolicy = LRU timeToLiveSeconds = 1800 timeToIdleSeconds = 2700 diskPersistent = true diskExpiryThreadIntervalSeconds = 600 cacheEventListeners:  hitCount = 0 memoryStoreHitCount = 0 diskStoreHitCount = 0 missCountNotFound = 0 missCountExpired = 0 ]
[INFO] Disposing cache: [ name = url-failures-cache status = STATUS_ALIVE eternal = false overflowToDisk = false maxElementsInMemory = 1000 maxElementsOnDisk = 0 memoryStoreEvictionPolicy = LRU timeToLiveSeconds = 1800 timeToIdleSeconds = 2700 diskPersistent = true diskExpiryThreadIntervalSeconds = 600 cacheEventListeners:  hitCount = 0 memoryStoreHitCount = 0 diskStoreHitCount = 0 missCountNotFound = 0 missCountExpired = 0 ]
Tests run: 5, Failures: 0, Errors: 0, Skipped: 0, Time elapsed: 0.503 sec
Running org.apache.maven.archiva.web.action.admin.repositories.EditRemoteRepositoryActionTest
[INFO] Disposing cache: [ name = url-failures-cache status = STATUS_ALIVE eternal = false overflowToDisk = false maxElementsInMemory = 1000 maxElementsOnDisk = 0 memoryStoreEvictionPolicy = LRU timeToLiveSeconds = 1800 timeToIdleSeconds = 2700 diskPersistent = true diskExpiryThreadIntervalSeconds = 600 cacheEventListeners:  hitCount = 0 memoryStoreHitCount = 0 diskStoreHitCount = 0 missCountNotFound = 0 missCountExpired = 0 ]
[INFO] Disposing cache: [ name = url-failures-cache status = STATUS_ALIVE eternal = false overflowToDisk = false maxElementsInMemory = 1000 maxElementsOnDisk = 0 memoryStoreEvictionPolicy = LRU timeToLiveSeconds = 1800 timeToIdleSeconds = 2700 diskPersistent = true diskExpiryThreadIntervalSeconds = 600 cacheEventListeners:  hitCount = 0 memoryStoreHitCount = 0 diskStoreHitCount = 0 missCountNotFound = 0 missCountExpired = 0 ]
[INFO] Disposing cache: [ name = url-failures-cache status = STATUS_ALIVE eternal = false overflowToDisk = false maxElementsInMemory = 1000 maxElementsOnDisk = 0 memoryStoreEvictionPolicy = LRU timeToLiveSeconds = 1800 timeToIdleSeconds = 2700 diskPersistent = true diskExpiryThreadIntervalSeconds = 600 cacheEventListeners:  hitCount = 0 memoryStoreHitCount = 0 diskStoreHitCount = 0 missCountNotFound = 0 missCountExpired = 0 ]
Tests run: 3, Failures: 0, Errors: 0, Skipped: 0, Time elapsed: 0.22 sec
Running org.apache.maven.archiva.web.repository.RepositoryServletTest
 INFO|main|92957|Cache:url-failures-cache       - Disposing cache: [ name = url-failures-cache status = STATUS_ALIVE eternal = false overflowToDisk = false maxElementsInMemory = 1000 maxElementsOnDisk = 0 memoryStoreEvictionPolicy = LRU timeToLiveSeconds = 1800 timeToIdleSeconds = 2700 diskPersistent = false diskExpiryThreadIntervalSeconds = 600 cacheEventListeners:  hitCount = 0 memoryStoreHitCount = 0 diskStoreHitCount = 0 missCountNotFound = 0 missCountExpired = 0 ]
There was no such logger 'org.codehaus.plexus.redback.xwork.filter.authentication.HttpAuthenticator:basic' 22699221.
 WARN|main|92958|PlexusContainer                - Component manager not found for returned component. Ignored. component=org.apache.maven.archiva.web.repository.ProxiedDavServer@f21f19
 INFO|main|93050|Cache:url-failures-cache       - Disposing cache: [ name = url-failures-cache status = STATUS_ALIVE eternal = false overflowToDisk = false maxElementsInMemory = 1000 maxElementsOnDisk = 0 memoryStoreEvictionPolicy = LRU timeToLiveSeconds = 1800 timeToIdleSeconds = 2700 diskPersistent = false diskExpiryThreadIntervalSeconds = 600 cacheEventListeners:  hitCount = 0 memoryStoreHitCount = 0 diskStoreHitCount = 0 missCountNotFound = 0 missCountExpired = 0 ]
There was no such logger 'org.codehaus.plexus.redback.xwork.filter.authentication.HttpAuthenticator:basic' 29254980.
 INFO|main|93149|Cache:url-failures-cache       - Disposing cache: [ name = url-failures-cache status = STATUS_ALIVE eternal = false overflowToDisk = false maxElementsInMemory = 1000 maxElementsOnDisk = 0 memoryStoreEvictionPolicy = LRU timeToLiveSeconds = 1800 timeToIdleSeconds = 2700 diskPersistent = false diskExpiryThreadIntervalSeconds = 600 cacheEventListeners:  hitCount = 0 memoryStoreHitCount = 0 diskStoreHitCount = 0 missCountNotFound = 0 missCountExpired = 0 ]
There was no such logger 'org.codehaus.plexus.redback.xwork.filter.authentication.HttpAuthenticator:basic' 24793104.
 WARN|main|93149|PlexusContainer                - Component manager not found for returned component. Ignored. component=org.apache.maven.archiva.web.repository.ProxiedDavServer@f029d3
 WARN|main|93149|PlexusContainer                - Component manager not found for returned component. Ignored. component=org.apache.maven.archiva.web.repository.ProxiedDavServer@aea2c
Tests run: 3, Failures: 0, Errors: 0, Skipped: 0, Time elapsed: 0.314 sec
Running org.apache.maven.archiva.web.repository.RepositoryServletProxiedReleasePolicyTest
 INFO|main|93290|log                            - jetty-6.1.5
 INFO|main|93291|log                            - Started SocketConnector@0.0.0.0:41851
Remote HTTP Server started on http://localhost:41851/central
 INFO|main|94584|Cache:url-failures-cache       - Disposing cache: [ name = url-failures-cache status = STATUS_ALIVE eternal = false overflowToDisk = false maxElementsInMemory = 1000 maxElementsOnDisk = 0 memoryStoreEvictionPolicy = LRU timeToLiveSeconds = 1800 timeToIdleSeconds = 2700 diskPersistent = false diskExpiryThreadIntervalSeconds = 600 cacheEventListeners:  hitCount = 0 memoryStoreHitCount = 0 diskStoreHitCount = 0 missCountNotFound = 0 missCountExpired = 0 ]
There was no such logger 'org.codehaus.plexus.redback.xwork.filter.authentication.HttpAuthenticator:basic' 14290550.
 WARN|main|94584|PlexusContainer                - Component manager not found for returned component. Ignored. component=org.apache.maven.archiva.web.repository.ProxiedDavServer@e6bc11
 INFO|main|94816|log                            - jetty-6.1.5
 INFO|main|94818|log                            - Started SocketConnector@0.0.0.0:41855
Remote HTTP Server started on http://localhost:41855/central
 INFO|main|95801|AuditLog                       - internal guest 127.0.0.1 "org/apache/archiva/test/1.0/test-1.0.jar" "Modify File (proxied)"
 INFO|main|95912|Cache:url-failures-cache       - Disposing cache: [ name = url-failures-cache status = STATUS_ALIVE eternal = false overflowToDisk = false maxElementsInMemory = 1000 maxElementsOnDisk = 0 memoryStoreEvictionPolicy = LRU timeToLiveSeconds = 1800 timeToIdleSeconds = 2700 diskPersistent = false diskExpiryThreadIntervalSeconds = 600 cacheEventListeners:  hitCount = 0 memoryStoreHitCount = 0 diskStoreHitCount = 0 missCountNotFound = 0 missCountExpired = 0 ]
There was no such logger 'org.codehaus.plexus.redback.xwork.filter.authentication.HttpAuthenticator:basic' 24197894.
 WARN|main|95912|PlexusContainer                - Component manager not found for returned component. Ignored. component=org.apache.maven.archiva.web.repository.ProxiedDavServer@186f141
 INFO|main|96015|log                            - jetty-6.1.5
 INFO|main|96016|log                            - Started SocketConnector@0.0.0.0:41860
Remote HTTP Server started on http://localhost:41860/central
 INFO|main|97027|AuditLog                       - internal guest 127.0.0.1 "org/apache/archiva/test/1.0/test-1.0.jar" "Modify File (proxied)"
 INFO|main|97164|Cache:url-failures-cache       - Disposing cache: [ name = url-failures-cache status = STATUS_ALIVE eternal = false overflowToDisk = false maxElementsInMemory = 1000 maxElementsOnDisk = 0 memoryStoreEvictionPolicy = LRU timeToLiveSeconds = 1800 timeToIdleSeconds = 2700 diskPersistent = false diskExpiryThreadIntervalSeconds = 600 cacheEventListeners:  hitCount = 0 memoryStoreHitCount = 0 diskStoreHitCount = 0 missCountNotFound = 0 missCountExpired = 0 ]
There was no such logger 'org.codehaus.plexus.redback.xwork.filter.authentication.HttpAuthenticator:basic' 6456148.
 WARN|main|97172|PlexusContainer                - Component manager not found for returned component. Ignored. component=org.apache.maven.archiva.web.repository.ProxiedDavServer@11ec4e7
 INFO|main|97263|log                            - jetty-6.1.5
 INFO|main|97264|log                            - Started SocketConnector@0.0.0.0:41866
Remote HTTP Server started on http://localhost:41866/central
 INFO|main|98150|RepositoryProxyConnectors:default - Transfer not attempted on http://localhost:41866/central/org/apache/archiva/test/1.0/test-1.0.jar : NO to update releases, policy is DAILY, local file exist, and has been updated within the last day.: using already present local file.
 INFO|main|98150|AuditLog                       - internal guest 127.0.0.1 "org/apache/archiva/test/1.0/test-1.0.jar" "Modify File (proxied)"
 INFO|main|98153|Cache:url-failures-cache       - Disposing cache: [ name = url-failures-cache status = STATUS_ALIVE eternal = false overflowToDisk = false maxElementsInMemory = 1000 maxElementsOnDisk = 0 memoryStoreEvictionPolicy = LRU timeToLiveSeconds = 1800 timeToIdleSeconds = 2700 diskPersistent = false diskExpiryThreadIntervalSeconds = 600 cacheEventListeners:  hitCount = 0 memoryStoreHitCount = 0 diskStoreHitCount = 0 missCountNotFound = 0 missCountExpired = 0 ]
There was no such logger 'org.codehaus.plexus.redback.xwork.filter.authentication.HttpAuthenticator:basic' 30365417.
 WARN|main|98154|PlexusContainer                - Component manager not found for returned component. Ignored. component=org.apache.maven.archiva.web.repository.ProxiedDavServer@ec078b
 INFO|main|98232|log                            - jetty-6.1.5
 INFO|main|98233|log                            - Started SocketConnector@0.0.0.0:41876
Remote HTTP Server started on http://localhost:41876/central
 INFO|main|99124|AuditLog                       - internal guest 127.0.0.1 "org/apache/archiva/test/1.0/test-1.0.jar" "Modify File (proxied)"
 INFO|main|99128|Cache:url-failures-cache       - Disposing cache: [ name = url-failures-cache status = STATUS_ALIVE eternal = false overflowToDisk = false maxElementsInMemory = 1000 maxElementsOnDisk = 0 memoryStoreEvictionPolicy = LRU timeToLiveSeconds = 1800 timeToIdleSeconds = 2700 diskPersistent = false diskExpiryThreadIntervalSeconds = 600 cacheEventListeners:  hitCount = 0 memoryStoreHitCount = 0 diskStoreHitCount = 0 missCountNotFound = 0 missCountExpired = 0 ]
There was no such logger 'org.codehaus.plexus.redback.xwork.filter.authentication.HttpAuthenticator:basic' 21306484.
 WARN|main|99128|PlexusContainer                - Component manager not found for returned component. Ignored. component=org.apache.maven.archiva.web.repository.ProxiedDavServer@14fb163
 INFO|main|99274|log                            - jetty-6.1.5
 INFO|main|99275|log                            - Started SocketConnector@0.0.0.0:41885
Remote HTTP Server started on http://localhost:41885/central
 INFO|main|100148|AuditLog                       - internal guest 127.0.0.1 "org/apache/archiva/test/1.0/test-1.0.jar" "Modify File (proxied)"
 INFO|main|100272|Cache:url-failures-cache       - Disposing cache: [ name = url-failures-cache status = STATUS_ALIVE eternal = false overflowToDisk = false maxElementsInMemory = 1000 maxElementsOnDisk = 0 memoryStoreEvictionPolicy = LRU timeToLiveSeconds = 1800 timeToIdleSeconds = 2700 diskPersistent = false diskExpiryThreadIntervalSeconds = 600 cacheEventListeners:  hitCount = 0 memoryStoreHitCount = 0 diskStoreHitCount = 0 missCountNotFound = 0 missCountExpired = 0 ]
There was no such logger 'org.codehaus.plexus.redback.xwork.filter.authentication.HttpAuthenticator:basic' 7004028.
 WARN|main|100273|PlexusContainer                - Component manager not found for returned component. Ignored. component=org.apache.maven.archiva.web.repository.ProxiedDavServer@1231ac6
 INFO|main|100357|log                            - jetty-6.1.5
 INFO|main|100358|log                            - Started SocketConnector@0.0.0.0:41891
Remote HTTP Server started on http://localhost:41891/central
 INFO|main|101225|RepositoryProxyConnectors:default - Transfer not attempted on http://localhost:41891/central/org/apache/archiva/test/1.0/test-1.0.pom : NO to update, releases policy set to NEVER.
 INFO|main|101226|RepositoryProxyConnectors:default - Transfer not attempted on http://localhost:41891/central/org/apache/archiva/test/1.0/test-1.0.jar : NO to update, releases policy set to NEVER.: using already present local file.
 INFO|main|101226|AuditLog                       - internal guest 127.0.0.1 "org/apache/archiva/test/1.0/test-1.0.jar" "Modify File (proxied)"
 INFO|main|101332|Cache:url-failures-cache       - Disposing cache: [ name = url-failures-cache status = STATUS_ALIVE eternal = false overflowToDisk = false maxElementsInMemory = 1000 maxElementsOnDisk = 0 memoryStoreEvictionPolicy = LRU timeToLiveSeconds = 1800 timeToIdleSeconds = 2700 diskPersistent = false diskExpiryThreadIntervalSeconds = 600 cacheEventListeners:  hitCount = 0 memoryStoreHitCount = 0 diskStoreHitCount = 0 missCountNotFound = 0 missCountExpired = 0 ]
There was no such logger 'org.codehaus.plexus.redback.xwork.filter.authentication.HttpAuthenticator:basic' 9681035.
 WARN|main|101332|PlexusContainer                - Component manager not found for returned component. Ignored. component=org.apache.maven.archiva.web.repository.ProxiedDavServer@108ab98
 INFO|main|101414|log                            - jetty-6.1.5
 INFO|main|101415|log                            - Started SocketConnector@0.0.0.0:41894
Remote HTTP Server started on http://localhost:41894/central
 INFO|main|102264|RepositoryProxyConnectors:default - Transfer not attempted on http://localhost:41894/central/org/apache/archiva/test/1.0/test-1.0.pom : NO to update, releases policy set to NEVER.
 INFO|main|102264|RepositoryProxyConnectors:default - Transfer not attempted on http://localhost:41894/central/org/apache/archiva/test/1.0/test-1.0.jar : NO to update, releases policy set to NEVER.
 INFO|main|102371|Cache:url-failures-cache       - Disposing cache: [ name = url-failures-cache status = STATUS_ALIVE eternal = false overflowToDisk = false maxElementsInMemory = 1000 maxElementsOnDisk = 0 memoryStoreEvictionPolicy = LRU timeToLiveSeconds = 1800 timeToIdleSeconds = 2700 diskPersistent = false diskExpiryThreadIntervalSeconds = 600 cacheEventListeners:  hitCount = 0 memoryStoreHitCount = 0 diskStoreHitCount = 0 missCountNotFound = 0 missCountExpired = 0 ]
There was no such logger 'org.codehaus.plexus.redback.xwork.filter.authentication.HttpAuthenticator:basic' 2030147.
 WARN|main|102372|PlexusContainer                - Component manager not found for returned component. Ignored. component=org.apache.maven.archiva.web.repository.ProxiedDavServer@3d60c4
 INFO|main|102495|log                            - jetty-6.1.5
 INFO|main|102496|log                            - Started SocketConnector@0.0.0.0:41897
Remote HTTP Server started on http://localhost:41897/central
 INFO|main|103345|RepositoryProxyConnectors:default - Transfer not attempted on http://localhost:41897/central/org/apache/archiva/test/1.0/test-1.0.pom : NO to update, releases policy set to NEVER.
 INFO|main|103345|RepositoryProxyConnectors:default - Transfer not attempted on http://localhost:41897/central/org/apache/archiva/test/1.0/test-1.0.jar : NO to update, releases policy set to NEVER.: using already present local file.
 INFO|main|103345|AuditLog                       - internal guest 127.0.0.1 "org/apache/archiva/test/1.0/test-1.0.jar" "Modify File (proxied)"
 INFO|main|103451|Cache:url-failures-cache       - Disposing cache: [ name = url-failures-cache status = STATUS_ALIVE eternal = false overflowToDisk = false maxElementsInMemory = 1000 maxElementsOnDisk = 0 memoryStoreEvictionPolicy = LRU timeToLiveSeconds = 1800 timeToIdleSeconds = 2700 diskPersistent = false diskExpiryThreadIntervalSeconds = 600 cacheEventListeners:  hitCount = 0 memoryStoreHitCount = 0 diskStoreHitCount = 0 missCountNotFound = 0 missCountExpired = 0 ]
There was no such logger 'org.codehaus.plexus.redback.xwork.filter.authentication.HttpAuthenticator:basic' 17912250.
 WARN|main|103452|PlexusContainer                - Component manager not found for returned component. Ignored. component=org.apache.maven.archiva.web.repository.ProxiedDavServer@10af581
 INFO|main|103527|log                            - jetty-6.1.5
 INFO|main|103528|log                            - Started SocketConnector@0.0.0.0:41900
Remote HTTP Server started on http://localhost:41900/central
 INFO|main|104407|RepositoryProxyConnectors:default - Transfer not attempted on http://localhost:41900/central/org/apache/archiva/test/1.0/test-1.0.jar : NO to update releases, policy is HOURLY, local file exist, and has been updated within the last hour.: using already present local file.
 INFO|main|104407|AuditLog                       - internal guest 127.0.0.1 "org/apache/archiva/test/1.0/test-1.0.jar" "Modify File (proxied)"
 INFO|main|104511|Cache:url-failures-cache       - Disposing cache: [ name = url-failures-cache status = STATUS_ALIVE eternal = false overflowToDisk = false maxElementsInMemory = 1000 maxElementsOnDisk = 0 memoryStoreEvictionPolicy = LRU timeToLiveSeconds = 1800 timeToIdleSeconds = 2700 diskPersistent = false diskExpiryThreadIntervalSeconds = 600 cacheEventListeners:  hitCount = 0 memoryStoreHitCount = 0 diskStoreHitCount = 0 missCountNotFound = 0 missCountExpired = 0 ]
There was no such logger 'org.codehaus.plexus.redback.xwork.filter.authentication.HttpAuthenticator:basic' 15258628.
 WARN|main|104512|PlexusContainer                - Component manager not found for returned component. Ignored. component=org.apache.maven.archiva.web.repository.ProxiedDavServer@8820fa
 INFO|main|104600|log                            - jetty-6.1.5
 INFO|main|104602|log                            - Started SocketConnector@0.0.0.0:41903
Remote HTTP Server started on http://localhost:41903/central
 INFO|main|105494|AuditLog                       - internal guest 127.0.0.1 "org/apache/archiva/test/1.0/test-1.0.jar" "Modify File (proxied)"
 INFO|main|105601|Cache:url-failures-cache       - Disposing cache: [ name = url-failures-cache status = STATUS_ALIVE eternal = false overflowToDisk = false maxElementsInMemory = 1000 maxElementsOnDisk = 0 memoryStoreEvictionPolicy = LRU timeToLiveSeconds = 1800 timeToIdleSeconds = 2700 diskPersistent = false diskExpiryThreadIntervalSeconds = 600 cacheEventListeners:  hitCount = 0 memoryStoreHitCount = 0 diskStoreHitCount = 0 missCountNotFound = 0 missCountExpired = 0 ]
There was no such logger 'org.codehaus.plexus.redback.xwork.filter.authentication.HttpAuthenticator:basic' 26417474.
 WARN|main|105602|PlexusContainer                - Component manager not found for returned component. Ignored. component=org.apache.maven.archiva.web.repository.ProxiedDavServer@b73feb
 INFO|main|105708|log                            - jetty-6.1.5
 INFO|main|105709|log                            - Started SocketConnector@0.0.0.0:41911
Remote HTTP Server started on http://localhost:41911/central
 INFO|main|106617|AuditLog                       - internal guest 127.0.0.1 "org/apache/archiva/test/1.0/test-1.0.jar" "Modify File (proxied)"
 INFO|main|106721|Cache:url-failures-cache       - Disposing cache: [ name = url-failures-cache status = STATUS_ALIVE eternal = false overflowToDisk = false maxElementsInMemory = 1000 maxElementsOnDisk = 0 memoryStoreEvictionPolicy = LRU timeToLiveSeconds = 1800 timeToIdleSeconds = 2700 diskPersistent = false diskExpiryThreadIntervalSeconds = 600 cacheEventListeners:  hitCount = 0 memoryStoreHitCount = 0 diskStoreHitCount = 0 missCountNotFound = 0 missCountExpired = 0 ]
There was no such logger 'org.codehaus.plexus.redback.xwork.filter.authentication.HttpAuthenticator:basic' 4253410.
 WARN|main|106722|PlexusContainer                - Component manager not found for returned component. Ignored. component=org.apache.maven.archiva.web.repository.ProxiedDavServer@1173e3d
 INFO|main|106858|log                            - jetty-6.1.5
 INFO|main|106859|log                            - Started SocketConnector@0.0.0.0:41917
Remote HTTP Server started on http://localhost:41917/central
 INFO|main|107755|RepositoryProxyConnectors:default - Transfer not attempted on http://localhost:41917/central/org/apache/archiva/test/1.0/test-1.0.jar : NO to update releases, policy is ONCE, and local file exist.: using already present local file.
 INFO|main|107756|AuditLog                       - internal guest 127.0.0.1 "org/apache/archiva/test/1.0/test-1.0.jar" "Modify File (proxied)"
 INFO|main|107861|Cache:url-failures-cache       - Disposing cache: [ name = url-failures-cache status = STATUS_ALIVE eternal = false overflowToDisk = false maxElementsInMemory = 1000 maxElementsOnDisk = 0 memoryStoreEvictionPolicy = LRU timeToLiveSeconds = 1800 timeToIdleSeconds = 2700 diskPersistent = false diskExpiryThreadIntervalSeconds = 600 cacheEventListeners:  hitCount = 0 memoryStoreHitCount = 0 diskStoreHitCount = 0 missCountNotFound = 0 missCountExpired = 0 ]
There was no such logger 'org.codehaus.plexus.redback.xwork.filter.authentication.HttpAuthenticator:basic' 15033815.
 WARN|main|107862|PlexusContainer                - Component manager not found for returned component. Ignored. component=org.apache.maven.archiva.web.repository.ProxiedDavServer@12733fc
 INFO|main|107941|log                            - jetty-6.1.5
 INFO|main|107942|log                            - Started SocketConnector@0.0.0.0:41920
Remote HTTP Server started on http://localhost:41920/central
 INFO|main|108861|AuditLog                       - internal guest 127.0.0.1 "org/apache/archiva/test/1.0/test-1.0.jar" "Modify File (proxied)"
 INFO|main|108971|Cache:url-failures-cache       - Disposing cache: [ name = url-failures-cache status = STATUS_ALIVE eternal = false overflowToDisk = false maxElementsInMemory = 1000 maxElementsOnDisk = 0 memoryStoreEvictionPolicy = LRU timeToLiveSeconds = 1800 timeToIdleSeconds = 2700 diskPersistent = false diskExpiryThreadIntervalSeconds = 600 cacheEventListeners:  hitCount = 0 memoryStoreHitCount = 0 diskStoreHitCount = 0 missCountNotFound = 0 missCountExpired = 0 ]
There was no such logger 'org.codehaus.plexus.redback.xwork.filter.authentication.HttpAuthenticator:basic' 2087358.
 WARN|main|108972|PlexusContainer                - Component manager not found for returned component. Ignored. component=org.apache.maven.archiva.web.repository.ProxiedDavServer@c92844
 INFO|main|109053|log                            - jetty-6.1.5
 INFO|main|109054|log                            - Started SocketConnector@0.0.0.0:41926
Remote HTTP Server started on http://localhost:41926/central
 INFO|main|109923|AuditLog                       - internal guest 127.0.0.1 "org/apache/archiva/test/1.0/test-1.0.jar" "Modify File (proxied)"
 INFO|main|110031|Cache:url-failures-cache       - Disposing cache: [ name = url-failures-cache status = STATUS_ALIVE eternal = false overflowToDisk = false maxElementsInMemory = 1000 maxElementsOnDisk = 0 memoryStoreEvictionPolicy = LRU timeToLiveSeconds = 1800 timeToIdleSeconds = 2700 diskPersistent = false diskExpiryThreadIntervalSeconds = 600 cacheEventListeners:  hitCount = 0 memoryStoreHitCount = 0 diskStoreHitCount = 0 missCountNotFound = 0 missCountExpired = 0 ]
There was no such logger 'org.codehaus.plexus.redback.xwork.filter.authentication.HttpAuthenticator:basic' 16578531.
 WARN|main|110031|PlexusContainer                - Component manager not found for returned component. Ignored. component=org.apache.maven.archiva.web.repository.ProxiedDavServer@8adb01
Tests run: 15, Failures: 0, Errors: 0, Skipped: 0, Time elapsed: 16.879 sec
Running org.apache.maven.archiva.web.repository.RepositoryServletDeployTest
 INFO|main|110131|AuditLog                       - internal guest 127.0.0.1 "path/to" "Created Directory"
 INFO|main|110134|AuditLog                       - internal guest 127.0.0.1 "/path/to/artifact.jar" "Created File"
 INFO|main|110135|Cache:url-failures-cache       - Disposing cache: [ name = url-failures-cache status = STATUS_ALIVE eternal = false overflowToDisk = false maxElementsInMemory = 1000 maxElementsOnDisk = 0 memoryStoreEvictionPolicy = LRU timeToLiveSeconds = 1800 timeToIdleSeconds = 2700 diskPersistent = false diskExpiryThreadIntervalSeconds = 600 cacheEventListeners:  hitCount = 0 memoryStoreHitCount = 0 diskStoreHitCount = 0 missCountNotFound = 0 missCountExpired = 0 ]
There was no such logger 'org.codehaus.plexus.redback.xwork.filter.authentication.HttpAuthenticator:basic' 31912044.
 WARN|main|110136|PlexusContainer                - Component manager not found for returned component. Ignored. component=org.apache.maven.archiva.web.repository.ProxiedDavServer@9fa55
Tests run: 1, Failures: 0, Errors: 0, Skipped: 0, Time elapsed: 0.101 sec

Results :
Tests run: 146, Failures: 1, Errors: 0, Skipped: 0

[INFO] ------------------------------------------------------------------------
[ERROR] BUILD FAILURE
[INFO] ------------------------------------------------------------------------
[INFO] There are test failures.
[INFO] ------------------------------------------------------------------------
[INFO] For more information, run Maven with the -e switch
[INFO] ------------------------------------------------------------------------
[INFO] Total time: 2 minutes 33 seconds
[INFO] Finished at: Wed Dec 12 21:23:11 GMT+00:00 2007
[INFO] Final Memory: 26M/327M
[INFO] ------------------------------------------------------------------------

****************************************************************************



Mime
View raw message