maven-notifications mailing list archives

Site index · List index
Message view « Date » · « Thread »
Top « Date » · « Thread »
From "Continuum@maven.zones.apache.org" <contin...@maven.zones.apache.org>
Subject [continuum] BUILD FAILURE: Maven Jar Plugin
Date Sat, 01 Dec 2007 14:17:38 GMT
Online report : http://maven.zones.apache.org/continuum/buildResult.action?buildId=38297&projectId=22

Build statistics:
  State: Failed
  Previous State: Failed
  Started at: Sat 1 Dec 2007 14:16:56 +0000
  Finished at: Sat 1 Dec 2007 14:17:35 +0000
  Total time: 39s
  Build Trigger: Schedule
  Build Number: 97
  Exit code: 1
  Building machine hostname: maven.zones.apache.org
  Operating system : SunOS(unknown)
  Java Home version : 
          java version "1.4.2_09"
          Java(TM) 2 Runtime Environment, Standard Edition (build 1.4.2_09-b05)
          Java HotSpot(TM) Client VM (build 1.4.2_09-b05, mixed mode)
        
  Builder version :
          Maven version: 2.0.7
          Java version: 1.4.2_09
          OS name: "sunos" version: "5.10" arch: "x86"
    
****************************************************************************
SCM Changes:
****************************************************************************
No files changed

****************************************************************************
Dependencies Changes:
****************************************************************************
No dependencies changed


****************************************************************************
Build Defintion:
****************************************************************************
POM filename: pom.xml
Goals: clean install   
Arguments: --batch-mode --non-recursive -P integration-tests
Build Fresh: true
Always Build: true
Default Build Definition: false
Schedule: Integration Test Run
Profile Name: JDK 1.4.2
Description: 


****************************************************************************
Test Summary:
****************************************************************************
Tests: 20
Failures: 5
Total time: 22359

****************************************************************************
Output:
****************************************************************************
[INFO] Scanning for projects...
[INFO] ----------------------------------------------------------------------------
[INFO] Building Maven Jar Plugin
[INFO]    task-segment: [clean, install]
[INFO] ----------------------------------------------------------------------------
[INFO] [clean:clean]
[INFO] [plugin:descriptor]
[INFO] Using 2 extractors.
[INFO] Applying extractor for language: java
[INFO] Extractor for language: java found 4 mojo descriptors.
[INFO] Applying extractor for language: bsh
[INFO] Extractor for language: bsh found 0 mojo descriptors.
[INFO] [resources:resources]
[INFO] Using default encoding to copy filtered resources.
[INFO] Resource directory does not exist: /export/home/build/data/continuum/checkouts/22/src/main/resources
[INFO] [compiler:compile]
[INFO] Compiling 5 source files to /export/home/build/data/continuum/checkouts/22/target/classes
[INFO] [resources:testResources]
[INFO] Using default encoding to copy filtered resources.
[INFO] Copying 48 resources
[INFO] [compiler:testCompile]
[INFO] Compiling 7 source files to /export/home/build/data/continuum/checkouts/22/target/test-classes
[INFO] [surefire:test]
[INFO] Surefire report directory: /export/home/build/data/continuum/checkouts/22/target/surefire-reports

-------------------------------------------------------
 T E S T S
-------------------------------------------------------
Running org.apache.maven.plugin.jar.JarSignVerifyMojoTest
[debug] jarsigner executable=[/usr/j2sdk1.4.2_09/jre/../bin/jarsigner]
[debug] Executing: /bin/bash -c "cd /var/tmp && /usr/j2sdk1.4.2_09/jre/../bin/jarsigner
-verify /tmp/signed/file-version.jar"
[info] jar verified.
[debug] jarsigner executable=[/usr/j2sdk1.4.2_09/jre/../bin/jarsigner]
[debug] Executing: /bin/bash -c "cd /var/tmp && /usr/j2sdk1.4.2_09/jre/../bin/jarsigner
-verify -verbose -certs /tmp/signed/file-version.jar"
[info] jar verified.
[debug] jarsigner executable=[/usr/j2sdk1.4.2_09/jre/../bin/jarsigner]
[debug] Executing: /bin/bash -c "cd /var/tmp && /usr/j2sdk1.4.2_09/jre/../bin/jarsigner
-verify /tmp/signed/file-version.jar"
[debug] jarsigner executable=[/usr/j2sdk1.4.2_09/jre/../bin/jarsigner]
[debug] Executing: /bin/bash -c "cd /var/tmp && /usr/j2sdk1.4.2_09/jre/../bin/jarsigner
-verify /tmp/signed/file-version.jar"
[info] jar is unsigned.
[debug] jarsigner executable=[/usr/j2sdk1.4.2_09/jre/../bin/jarsigner]
[debug] Executing: /bin/bash -c "cd /var/tmp && /usr/j2sdk1.4.2_09/jre/../bin/jarsigner
-verify /tmp/signed/file-version.jar"
Tests run: 6, Failures: 0, Errors: 0, Skipped: 0, Time elapsed: 0.12 sec
Running org.apache.maven.plugin.jar.JarSignMojoTest
[debug] jarsigner executable=[/usr/j2sdk1.4.2_09/jre/../bin/jarsigner]
[debug] mdkirs: false /tmp/signed
[debug] jarsigner executable=[/usr/j2sdk1.4.2_09/jre/../bin/jarsigner]
[debug] mdkirs: false /tmp/signed
[debug] jarsigner executable=[/usr/j2sdk1.4.2_09/jre/../bin/jarsigner]
[debug] mdkirs: false /tmp/signed
[debug] jarsigner executable=[/usr/j2sdk1.4.2_09/jre/../bin/jarsigner]
[debug] Executing: /bin/bash -c "cd /var/tmp && /usr/j2sdk1.4.2_09/jre/../bin/jarsigner
-verify /tmp/signed/file-version.jar"
[info] jar verified.
[debug] jarsigner executable=[/usr/j2sdk1.4.2_09/jre/../bin/jarsigner]
[debug] Signing JAR in-place (overwritting original JAR).
[debug] jarsigner executable=[/usr/j2sdk1.4.2_09/jre/../bin/jarsigner]
[debug] Executing: /bin/bash -c "cd /var/tmp && /usr/j2sdk1.4.2_09/jre/../bin/jarsigner
-verify /var/tmp/null.jar"
[info] jar verified.
[debug] jarsigner executable=[/usr/j2sdk1.4.2_09/jre/../bin/jarsigner]
[debug] mdkirs: false /tmp/signed
[info] JAR /tmp/signed/file-version.jar is already signed. Skipping.
[debug] jarsigner executable=[/usr/j2sdk1.4.2_09/jre/../bin/jarsigner]
[debug] mdkirs: false /tmp/signed
Tests run: 6, Failures: 0, Errors: 0, Skipped: 0, Time elapsed: 0.066 sec
Running org.apache.maven.plugin.jar.JarMojoTest
Tests run: 1, Failures: 0, Errors: 0, Skipped: 0, Time elapsed: 0.441 sec

Results :

Tests run: 13, Failures: 0, Errors: 0, Skipped: 0

[INFO] [jar:jar]
[INFO] Building jar: /export/home/build/data/continuum/checkouts/22/target/maven-jar-plugin-2.2-SNAPSHOT.jar
[INFO] [plugin:addPluginArtifactMetadata]
[INFO] [install:install-file {execution: it-test}]
[INFO] Installing /export/home/build/data/continuum/checkouts/22/target/maven-jar-plugin-2.2-SNAPSHOT.jar
to /export/home/build/.m2/repository/org/apache/maven/plugins/maven-jar-plugin/2.2-it-SNAPSHOT/maven-jar-plugin-2.2-it-SNAPSHOT.jar
[INFO] Installing /export/home/build/data/continuum/checkouts/22/pom.xml to /export/home/build/.m2/repository/org/apache/maven/plugins/maven-jar-plugin/2.2-it-SNAPSHOT/maven-jar-plugin-2.2-it-SNAPSHOT.pom
[INFO] [surefire:test {execution: integration-test}]
[INFO] Surefire report directory: /export/home/build/data/continuum/checkouts/22/target/surefire-reports

-------------------------------------------------------
 T E S T S
-------------------------------------------------------
Running org.apache.maven.plugin.jar.TestJarMojoIntegrationTest
[ maven embedder INFO] ----------------------------------------------------------------------------
[ maven embedder INFO] Building Maven
[ maven embedder INFO]    task-segment: [package]
[ maven embedder INFO] ----------------------------------------------------------------------------
[ maven embedder INFO] Ignoring available plugin update: 2.3-SNAPSHOT as it requires Maven
version 2.0.6
[ maven embedder INFO] Ignoring available plugin update: 2.4-SNAPSHOT as it requires Maven
version 2.0.6
[ maven embedder INFO] [resources:resources]
[ maven embedder INFO] Using default encoding to copy filtered resources.
[ maven embedder INFO] [compiler:compile]
[ maven embedder INFO] Compiling 1 source file to /export/home/build/data/continuum/checkouts/22/target/test-classes/it/mjar-80-01/target/classes
[ maven embedder INFO] [resources:testResources]
[ maven embedder INFO] Using default encoding to copy filtered resources.
[ maven embedder INFO] [compiler:testCompile]
[ maven embedder INFO] Compiling 2 source files to /export/home/build/data/continuum/checkouts/22/target/test-classes/it/mjar-80-01/target/test-classes
[ maven embedder INFO] [surefire:test]
[ maven embedder INFO] Surefire report directory: /export/home/build/data/continuum/checkouts/22/target/test-classes/it/mjar-80-01/target/surefire-reports
Exception in thread "main" java.lang.NoClassDefFoundError: org/codehaus/plexus/util/cli/StreamConsumer
[ maven embedder INFO] ----------------------------------------------------------------------------
[ maven embedder INFO] Building Maven
[ maven embedder INFO]    task-segment: [package]
[ maven embedder INFO] ----------------------------------------------------------------------------
[ maven embedder INFO] Ignoring available plugin update: 2.3-SNAPSHOT as it requires Maven
version 2.0.6
[ maven embedder INFO] Ignoring available plugin update: 2.4-SNAPSHOT as it requires Maven
version 2.0.6
[ maven embedder INFO] [resources:resources]
[ maven embedder INFO] Using default encoding to copy filtered resources.
[ maven embedder INFO] [compiler:compile]
[ maven embedder INFO] Compiling 1 source file to /export/home/build/data/continuum/checkouts/22/target/test-classes/it/mjar-80-02/target/classes
[ maven embedder INFO] [resources:testResources]
[ maven embedder INFO] Using default encoding to copy filtered resources.
[ maven embedder INFO] [compiler:testCompile]
[ maven embedder INFO] Compiling 2 source files to /export/home/build/data/continuum/checkouts/22/target/test-classes/it/mjar-80-02/target/test-classes
[ maven embedder INFO] [surefire:test]
[ maven embedder INFO] Surefire report directory: /export/home/build/data/continuum/checkouts/22/target/test-classes/it/mjar-80-02/target/surefire-reports
Exception in thread "main" java.lang.NoClassDefFoundError: org/codehaus/plexus/util/cli/StreamConsumer
[ maven embedder INFO] ----------------------------------------------------------------------------
[ maven embedder INFO] Building Maven
[ maven embedder INFO]    task-segment: [package]
[ maven embedder INFO] ----------------------------------------------------------------------------
[ maven embedder INFO] Ignoring available plugin update: 2.3-SNAPSHOT as it requires Maven
version 2.0.6
[ maven embedder INFO] Ignoring available plugin update: 2.4-SNAPSHOT as it requires Maven
version 2.0.6
[ maven embedder INFO] [resources:resources]
[ maven embedder INFO] Using default encoding to copy filtered resources.
[ maven embedder INFO] [compiler:compile]
[ maven embedder INFO] Compiling 1 source file to /export/home/build/data/continuum/checkouts/22/target/test-classes/it/mjar-80-03/target/classes
[ maven embedder INFO] [resources:testResources]
[ maven embedder INFO] Using default encoding to copy filtered resources.
[ maven embedder INFO] [compiler:testCompile]
[ maven embedder INFO] Compiling 2 source files to /export/home/build/data/continuum/checkouts/22/target/test-classes/it/mjar-80-03/target/test-classes
[ maven embedder INFO] [surefire:test]
[ maven embedder INFO] Surefire report directory: /export/home/build/data/continuum/checkouts/22/target/test-classes/it/mjar-80-03/target/surefire-reports
Exception in thread "main" java.lang.NoClassDefFoundError: org/codehaus/plexus/util/cli/StreamConsumer
Tests run: 3, Failures: 0, Errors: 3, Skipped: 0, Time elapsed: 11.491 sec <<< FAILURE!
Running org.apache.maven.plugin.jar.JarMojoIntegrationTest
[ maven embedder INFO] ----------------------------------------------------------------------------
[ maven embedder INFO] Building Maven
[ maven embedder INFO]    task-segment: [package]
[ maven embedder INFO] ----------------------------------------------------------------------------
[ maven embedder INFO] Ignoring available plugin update: 2.3-SNAPSHOT as it requires Maven
version 2.0.6
[ maven embedder INFO] Ignoring available plugin update: 2.4-SNAPSHOT as it requires Maven
version 2.0.6
[ maven embedder INFO] [resources:resources]
[ maven embedder INFO] Using default encoding to copy filtered resources.
[ maven embedder INFO] [compiler:compile]
[ maven embedder INFO] Compiling 1 source file to /export/home/build/data/continuum/checkouts/22/target/test-classes/it/mjar-30-01/target/classes
[ maven embedder INFO] [resources:testResources]
[ maven embedder INFO] Using default encoding to copy filtered resources.
[ maven embedder INFO] [compiler:testCompile]
[ maven embedder INFO] Compiling 1 source file to /export/home/build/data/continuum/checkouts/22/target/test-classes/it/mjar-30-01/target/test-classes
[ maven embedder INFO] [surefire:test]
[ maven embedder INFO] Surefire report directory: /export/home/build/data/continuum/checkouts/22/target/test-classes/it/mjar-30-01/target/surefire-reports
Exception in thread "main" java.lang.NoClassDefFoundError: org/codehaus/plexus/util/cli/StreamConsumer
[ maven embedder INFO] ----------------------------------------------------------------------------
[ maven embedder INFO] Building Maven
[ maven embedder INFO]    task-segment: [package]
[ maven embedder INFO] ----------------------------------------------------------------------------
[ maven embedder INFO] Ignoring available plugin update: 2.3-SNAPSHOT as it requires Maven
version 2.0.6
[ maven embedder INFO] Ignoring available plugin update: 2.4-SNAPSHOT as it requires Maven
version 2.0.6
[ maven embedder INFO] [resources:resources]
[ maven embedder INFO] Using default encoding to copy filtered resources.
[ maven embedder INFO] [compiler:compile]
[ maven embedder INFO] Compiling 3 source files to /export/home/build/data/continuum/checkouts/22/target/test-classes/it/mjar-30-02/target/classes
[ maven embedder INFO] [resources:testResources]
[ maven embedder INFO] Using default encoding to copy filtered resources.
[ maven embedder INFO] [compiler:testCompile]
[ maven embedder INFO] No sources to compile
[ maven embedder INFO] [surefire:test]
[ maven embedder INFO] No tests to run.
[ maven embedder INFO] [jar:jar]
[ maven embedder INFO] Building jar: /export/home/build/data/continuum/checkouts/22/target/test-classes/it/mjar-30-02/target/maven-jar-plugin-test-mjar-30-02-99.0.jar
[ maven embedder INFO] ----------------------------------------------------------------------------
[ maven embedder INFO] Building Maven
[ maven embedder INFO]    task-segment: [package]
[ maven embedder INFO] ----------------------------------------------------------------------------
[ maven embedder INFO] Ignoring available plugin update: 2.3-SNAPSHOT as it requires Maven
version 2.0.6
[ maven embedder INFO] Ignoring available plugin update: 2.4-SNAPSHOT as it requires Maven
version 2.0.6
[ maven embedder INFO] [resources:resources]
[ maven embedder INFO] Using default encoding to copy filtered resources.
[ maven embedder INFO] [compiler:compile]
[ maven embedder INFO] Compiling 1 source file to /export/home/build/data/continuum/checkouts/22/target/test-classes/it/mjar-30-03/target/classes
[ maven embedder INFO] [resources:testResources]
[ maven embedder INFO] Using default encoding to copy filtered resources.
[ maven embedder INFO] [compiler:testCompile]
[ maven embedder INFO] Compiling 1 source file to /export/home/build/data/continuum/checkouts/22/target/test-classes/it/mjar-30-03/target/test-classes
[ maven embedder INFO] [surefire:test]
[ maven embedder INFO] Surefire report directory: /export/home/build/data/continuum/checkouts/22/target/test-classes/it/mjar-30-03/target/surefire-reports
Exception in thread "main" java.lang.NoClassDefFoundError: org/codehaus/plexus/util/cli/StreamConsumer
[ maven embedder INFO] ----------------------------------------------------------------------------
[ maven embedder INFO] Building Maven
[ maven embedder INFO]    task-segment: [package]
[ maven embedder INFO] ----------------------------------------------------------------------------
[ maven embedder INFO] Ignoring available plugin update: 2.3-SNAPSHOT as it requires Maven
version 2.0.6
[ maven embedder INFO] Ignoring available plugin update: 2.4-SNAPSHOT as it requires Maven
version 2.0.6
[ maven embedder INFO] [resources:resources]
[ maven embedder INFO] Using default encoding to copy filtered resources.
[ maven embedder INFO] [compiler:compile]
[ maven embedder INFO] Compiling 3 source files to /export/home/build/data/continuum/checkouts/22/target/test-classes/it/project-004/target/classes
[ maven embedder INFO] [resources:testResources]
[ maven embedder INFO] Using default encoding to copy filtered resources.
[ maven embedder INFO] [compiler:testCompile]
[ maven embedder INFO] No sources to compile
[ maven embedder INFO] [surefire:test]
[ maven embedder INFO] No tests to run.
[ maven embedder INFO] [jar:jar]
[ maven embedder INFO] Building jar: /export/home/build/data/continuum/checkouts/22/target/test-classes/it/project-004/target/maven-jar-plugin-test-project-004-99.0.jar
[ maven embedder INFO] [jar:jar {execution: default}]
[ maven embedder INFO] Building jar: /export/home/build/data/continuum/checkouts/22/target/test-classes/it/project-004/target/maven-jar-plugin-test-project-004-99.0-service.jar
Tests run: 4, Failures: 0, Errors: 2, Skipped: 0, Time elapsed: 10.378 sec <<< FAILURE!

Results :

Tests in error: 
  testMJar_80_01(org.apache.maven.plugin.jar.TestJarMojoIntegrationTest)
  testMJar_80_02(org.apache.maven.plugin.jar.TestJarMojoIntegrationTest)
  testMJar_80_03(org.apache.maven.plugin.jar.TestJarMojoIntegrationTest)
  testMJar_30_01(org.apache.maven.plugin.jar.JarMojoIntegrationTest)
  testMJar_30_03(org.apache.maven.plugin.jar.JarMojoIntegrationTest)

Tests run: 7, Failures: 0, Errors: 5, Skipped: 0

[INFO] ------------------------------------------------------------------------
[ERROR] BUILD FAILURE
[INFO] ------------------------------------------------------------------------
[INFO] There are test failures.

Please refer to /export/home/build/data/continuum/checkouts/22/target/surefire-reports for
the individual test results.
[INFO] ------------------------------------------------------------------------
[INFO] For more information, run Maven with the -e switch
[INFO] ------------------------------------------------------------------------
[INFO] Total time: 37 seconds
[INFO] Finished at: Sat Dec 01 14:17:35 GMT+00:00 2007
[INFO] Final Memory: 13M/27M
[INFO] ------------------------------------------------------------------------

****************************************************************************



Mime
View raw message