maven-notifications mailing list archives: November 2007

Site index · List index
Message list1 · 2 · 3 · 4 · 5 · 6 · Next »Thread · Author · Date
Contin...@maven.zones.apache.org [continuum] BUILD FAILURE: Maven Install Plugin Thu, 01 Nov, 07:00
Contin...@maven.zones.apache.org [continuum] BUILD SUCCESSFUL: Maven Install Plugin Thu, 01 Nov, 10:24
Contin...@maven.zones.apache.org [continuum] BUILD FAILURE: Archiva Web :: Application Thu, 01 Nov, 20:24
Contin...@maven.zones.apache.org [continuum] BUILD SUCCESSFUL: Maven Shared Application Configuration Web Components Thu, 01 Nov, 22:34
Contin...@maven.zones.apache.org [continuum] BUILD SUCCESSFUL: Maven Shared Application Configuration Model Thu, 01 Nov, 22:34
Contin...@maven.zones.apache.org [continuum] BUILD SUCCESSFUL: Archiva Web :: Application Thu, 01 Nov, 22:46
Contin...@maven.zones.apache.org [continuum] BUILD FAILURE: Maven Lifecycle Model Fri, 02 Nov, 17:19
Contin...@maven.zones.apache.org [continuum] BUILD FAILURE: Maven Build Context Fri, 02 Nov, 17:20
Contin...@maven.zones.apache.org [continuum] BUILD FAILURE: Maven Profile Model Fri, 02 Nov, 17:21
Contin...@maven.zones.apache.org [continuum] BUILD FAILURE: Maven Project Builder Fri, 02 Nov, 17:22
Contin...@maven.zones.apache.org [continuum] BUILD FAILURE: Maven Plugin API Fri, 02 Nov, 17:22
Contin...@maven.zones.apache.org [continuum] BUILD FAILURE: Maven Core Fri, 02 Nov, 17:23
Contin...@maven.zones.apache.org [continuum] BUILD FAILURE: Maven Embedder Fri, 02 Nov, 17:24
Contin...@maven.zones.apache.org [continuum] BUILD FAILURE: Integration Test Executor Fri, 02 Nov, 17:25
Contin...@maven.zones.apache.org [continuum] BUILD SUCCESSFUL: Maven Project Builder Sat, 03 Nov, 00:32
Contin...@maven.zones.apache.org [continuum] BUILD SUCCESSFUL: Maven Plugin API Sat, 03 Nov, 00:32
Contin...@maven.zones.apache.org [continuum] BUILD SUCCESSFUL: Maven Core Sat, 03 Nov, 00:33
Contin...@maven.zones.apache.org [continuum] BUILD SUCCESSFUL: Maven Embedder Sat, 03 Nov, 00:36
Contin...@maven.zones.apache.org [continuum] BUILD FAILURE: Integration Test Executor Sat, 03 Nov, 00:56
Contin...@maven.zones.apache.org [continuum] BUILD FAILURE: Integration Test Executor Sat, 03 Nov, 10:41
Contin...@maven.zones.apache.org [continuum] BUILD FAILURE: Integration Test Executor Sun, 04 Nov, 12:42
Contin...@maven.zones.apache.org [continuum] BUILD SUCCESSFUL: Maven Lifecycle Model Mon, 05 Nov, 11:15
Contin...@maven.zones.apache.org [continuum] BUILD SUCCESSFUL: Maven Build Context Mon, 05 Nov, 11:15
Contin...@maven.zones.apache.org [continuum] BUILD SUCCESSFUL: Maven Profile Model Mon, 05 Nov, 11:15
Contin...@maven.zones.apache.org [continuum] BUILD FAILURE: Integration Test Executor Mon, 05 Nov, 11:37
Contin...@maven.zones.apache.org [continuum] BUILD FAILURE: Integration Test Executor Mon, 05 Nov, 14:47
Contin...@maven.zones.apache.org [continuum] BUILD SUCCESSFUL: Maven Artifact Mon, 05 Nov, 15:45
Contin...@maven.zones.apache.org [continuum] BUILD FAILURE: Maven Artifact Tue, 06 Nov, 08:49
Contin...@maven.zones.apache.org [continuum] BUILD FAILURE: Maven Project Builder Tue, 06 Nov, 08:50
Contin...@maven.zones.apache.org [continuum] BUILD FAILURE: Maven Plugin API Tue, 06 Nov, 08:50
Contin...@maven.zones.apache.org [continuum] BUILD FAILURE: Maven Core Tue, 06 Nov, 08:51
Contin...@maven.zones.apache.org [continuum] BUILD FAILURE: Maven Embedder Tue, 06 Nov, 08:52
Contin...@maven.zones.apache.org [continuum] BUILD FAILURE: Integration Test Executor Tue, 06 Nov, 08:52
Contin...@maven.zones.apache.org [continuum] BUILD SUCCESSFUL: Maven Artifact Tue, 06 Nov, 09:40
Contin...@maven.zones.apache.org [continuum] BUILD FAILURE: Maven Project Builder Tue, 06 Nov, 09:40
Contin...@maven.zones.apache.org [continuum] BUILD FAILURE: Maven Plugin API Tue, 06 Nov, 09:41
Contin...@maven.zones.apache.org [continuum] BUILD FAILURE: Maven Core Tue, 06 Nov, 09:41
Contin...@maven.zones.apache.org [continuum] BUILD SUCCESSFUL: Maven Project Builder Tue, 06 Nov, 10:45
Contin...@maven.zones.apache.org [continuum] BUILD SUCCESSFUL: Maven Plugin API Tue, 06 Nov, 10:46
Contin...@maven.zones.apache.org [continuum] BUILD SUCCESSFUL: Maven Core Tue, 06 Nov, 10:47
Contin...@maven.zones.apache.org [continuum] BUILD SUCCESSFUL: Maven Embedder Tue, 06 Nov, 10:49
Contin...@maven.zones.apache.org [continuum] BUILD FAILURE: Integration Test Executor Tue, 06 Nov, 11:14
Contin...@maven.zones.apache.org [continuum] BUILD FAILURE: Integration Test Executor Tue, 06 Nov, 12:49
Contin...@maven.zones.apache.org [continuum] BUILD FAILURE: Enforcer Rules Wed, 07 Nov, 21:59
Contin...@maven.zones.apache.org [continuum] BUILD FAILURE: Integration Test Executor Wed, 07 Nov, 22:33
Contin...@maven.zones.apache.org [continuum] BUILD FAILURE: Maven Enforcer Plugin Wed, 07 Nov, 22:38
Contin...@maven.zones.apache.org [continuum] BUILD FAILURE: Enforcer Rules Wed, 07 Nov, 23:06
Contin...@maven.zones.apache.org [continuum] BUILD FAILURE: Maven Enforcer Plugin Wed, 07 Nov, 23:21
Contin...@maven.zones.apache.org [continuum] BUILD SUCCESSFUL: Enforcer Rules Thu, 08 Nov, 00:23
Contin...@maven.zones.apache.org [continuum] BUILD FAILURE: Integration Test Executor Thu, 08 Nov, 00:59
Contin...@maven.zones.apache.org [continuum] BUILD SUCCESSFUL: Maven Enforcer Plugin Thu, 08 Nov, 01:15
Contin...@maven.zones.apache.org [continuum] BUILD FAILURE: Integration Test Executor Thu, 08 Nov, 11:35
Contin...@maven.zones.apache.org [continuum] BUILD FAILURE: Integration Test Executor Fri, 09 Nov, 09:43
Contin...@maven.zones.apache.org [continuum] BUILD FAILURE: Archiva Web :: Application Fri, 09 Nov, 10:32
Contin...@maven.zones.apache.org [continuum] BUILD SUCCESSFUL: Archiva Web :: Application Fri, 09 Nov, 16:32
Contin...@maven.zones.apache.org [continuum] BUILD FAILURE: Integration Test Executor Sat, 10 Nov, 12:12
Contin...@maven.zones.apache.org [continuum] BUILD FAILURE: Maven Artifact Sun, 11 Nov, 10:56
Contin...@maven.zones.apache.org [continuum] BUILD FAILURE: Integration Test Executor Sun, 11 Nov, 11:25
Contin...@maven.zones.apache.org [continuum] BUILD ERROR: Maven Meeper Sun, 11 Nov, 13:26
Contin...@maven.zones.apache.org [continuum] BUILD ERROR: Archiva Site Sun, 11 Nov, 14:23
Contin...@maven.zones.apache.org [continuum] BUILD ERROR: Maven Meeper Sun, 11 Nov, 14:47
Contin...@maven.zones.apache.org [continuum] BUILD ERROR: Archiva Site Sun, 11 Nov, 15:13
Contin...@maven.zones.apache.org [continuum] BUILD ERROR: Maven Meeper Sun, 11 Nov, 15:27
Contin...@maven.zones.apache.org [continuum] BUILD SUCCESSFUL: Archiva Common Parent Project Sun, 11 Nov, 15:52
Contin...@maven.zones.apache.org [continuum] BUILD SUCCESSFUL: Archiva Sun, 11 Nov, 15:52
Contin...@maven.zones.apache.org [continuum] BUILD SUCCESSFUL: Archiva Sun, 11 Nov, 17:04
Contin...@maven.zones.apache.org [continuum] BUILD SUCCESSFUL: Archiva Tools :: Parent Sun, 11 Nov, 17:18
Contin...@maven.zones.apache.org [continuum] BUILD SUCCESSFUL: Archiva Dev Maven Plugin Sun, 11 Nov, 17:18
Contin...@maven.zones.apache.org [continuum] BUILD ERROR: Archiva Site Sun, 11 Nov, 17:19
Contin...@maven.zones.apache.org [continuum] BUILD SUCCESSFUL: Maven Artifact Sun, 11 Nov, 17:32
Contin...@maven.zones.apache.org [continuum] BUILD FAILURE: Integration Test Executor Sun, 11 Nov, 17:50
Contin...@maven.zones.apache.org [continuum] BUILD SUCCESSFUL: Maven Meeper Sun, 11 Nov, 17:55
Contin...@maven.zones.apache.org [continuum] BUILD ERROR: Archiva Site Sun, 11 Nov, 18:22
Contin...@maven.zones.apache.org [continuum] BUILD FAILURE: Integration Test Executor Sun, 11 Nov, 18:57
Contin...@maven.zones.apache.org [continuum] BUILD ERROR: Archiva Site Sun, 11 Nov, 19:25
Contin...@maven.zones.apache.org [continuum] BUILD FAILURE: Maven Integration Tests Sun, 11 Nov, 19:36
Contin...@maven.zones.apache.org [continuum] BUILD ERROR: Archiva Site Sun, 11 Nov, 20:12
Contin...@maven.zones.apache.org [continuum] BUILD SUCCESSFUL: Maven Integration Tests Sun, 11 Nov, 20:23
Contin...@maven.zones.apache.org [continuum] BUILD FAILURE: Integration Test Executor Sun, 11 Nov, 20:49
Contin...@maven.zones.apache.org [continuum] BUILD SUCCESSFUL: Archiva Documentation Sun, 11 Nov, 21:39
Contin...@maven.zones.apache.org [continuum] BUILD FAILURE: Integration Test Executor Tue, 13 Nov, 17:01
Contin...@maven.zones.apache.org [continuum] BUILD FAILURE: Continuum Core Wed, 14 Nov, 08:25
Contin...@maven.zones.apache.org [continuum] BUILD FAILURE: Continuum Web APP Wed, 14 Nov, 08:29
Contin...@maven.zones.apache.org [continuum] BUILD SUCCESSFUL: Continuum Reports Wed, 14 Nov, 08:32
Contin...@maven.zones.apache.org [continuum] BUILD SUCCESSFUL: Continuum Core Wed, 14 Nov, 09:32
Contin...@maven.zones.apache.org [continuum] BUILD SUCCESSFUL: Continuum Web APP Wed, 14 Nov, 09:35
Contin...@maven.zones.apache.org [continuum] BUILD FAILURE: Archiva Web :: Application Wed, 14 Nov, 15:38
Contin...@maven.zones.apache.org [continuum] BUILD FAILURE: Maven Clean Plugin Wed, 14 Nov, 16:28
Contin...@maven.zones.apache.org [continuum] BUILD FAILURE: Maven Clean Plugin Wed, 14 Nov, 18:51
Contin...@maven.zones.apache.org [continuum] BUILD ERROR: Maven Build Context Thu, 15 Nov, 08:23
Contin...@maven.zones.apache.org [continuum] BUILD FAILURE: Integration Test Executor Thu, 15 Nov, 08:55
Contin...@maven.zones.apache.org [continuum] BUILD SUCCESSFUL: Maven Clean Plugin Thu, 15 Nov, 09:02
Contin...@maven.zones.apache.org [continuum] BUILD ERROR: Maven Build Context Thu, 15 Nov, 11:01
Contin...@maven.zones.apache.org [continuum] BUILD ERROR: Maven Build Context Thu, 15 Nov, 12:34
Contin...@maven.zones.apache.org [continuum] BUILD FAILURE: Maven Clean Plugin Thu, 15 Nov, 12:35
Contin...@maven.zones.apache.org [continuum] BUILD SUCCESSFUL: Maven Plugins Thu, 15 Nov, 12:47
Contin...@maven.zones.apache.org [continuum] BUILD FAILURE: Maven Clean Plugin Thu, 15 Nov, 13:01
Contin...@maven.zones.apache.org [continuum] BUILD ERROR: Maven Build Context Thu, 15 Nov, 13:43
Contin...@maven.zones.apache.org [continuum] BUILD ERROR: Maven Build Context Thu, 15 Nov, 15:27
Contin...@maven.zones.apache.org [continuum] BUILD SUCCESSFUL: Maven Clean Plugin Thu, 15 Nov, 15:28
Message list1 · 2 · 3 · 4 · 5 · 6 · Next »Thread · Author · Date
Box list
Dec 2014398
Nov 2014618
Oct 2014426
Sep 2014304
Aug 2014246
Jul 2014317
Jun 2014341
May 2014161
Apr 2014146
Mar 2014336
Feb 2014308
Jan 2014189
Dec 2013319
Nov 2013274
Oct 2013167
Sep 2013486
Aug 2013263
Jul 2013726
Jun 2013722
May 2013378
Apr 2013313
Mar 2013467
Feb 2013520
Jan 20131437
Dec 20121778
Nov 2012775
Oct 20121224
Sep 2012791
Aug 2012362
Jul 2012232
Jun 2012149
May 2012189
Apr 2012115
Mar 201257
Feb 2012155
Jan 2012170
Dec 2011244
Nov 2011187
Oct 2011139
Sep 2011190
Aug 2011276
Jul 201194
Jun 20114
Apr 201162
Mar 201176
Feb 201154
Jan 201185
Dec 201079
Nov 201061
Oct 201058
Sep 20101
Aug 201057
Jul 201037
Jun 201020
May 201075
Apr 201053
Mar 201012
Feb 201030
Jan 201071
Dec 2009104
Nov 200919
Oct 200931
Sep 2009193
Aug 2009268
Jul 2009193
Jun 2009147
May 200975
Apr 200979
Mar 2009134
Feb 2009657
Jan 200983
Dec 2008349
Nov 2008288
Oct 2008986
Sep 2008842
Aug 2008707
Jul 2008887
Jun 2008167
May 200821
Apr 2008231
Mar 2008438
Feb 2008317
Jan 2008205
Dec 2007185
Nov 2007532
Oct 2007439
Sep 2007699
Aug 20071294
Jul 2007351
Jun 20072211
May 2007273
Apr 2007262
Mar 2007534
Feb 20071648
Jan 20072359
Dec 2006575
Nov 2006357
Oct 2006642
Sep 2006660
Aug 20061662
Jul 20061320
Jun 2006473
May 20064700
Apr 20061113
Mar 20061048