maven-notifications mailing list archives

Site index · List index
Message view « Date » · « Thread »
Top « Date » · « Thread »
From "Continuum@maven.zones.apache.org" <contin...@maven.zones.apache.org>
Subject [continuum] BUILD FAILURE: Enforcer Rules
Date Wed, 07 Nov 2007 23:06:38 GMT
Online report : http://maven.zones.apache.org/continuum/buildResult.action?buildId=33501&projectId=449

Build statistics:
  State: Failed
  Previous State: Failed
  Started at: Wed 7 Nov 2007 23:06:27 +0000
  Finished at: Wed 7 Nov 2007 23:06:36 +0000
  Total time: 9s
  Build Trigger: Schedule
  Build Number: 8
  Exit code: 1
  Building machine hostname: maven.zones.apache.org
  Operating system : SunOS(unknown)
  Java Home version : 
          java version "1.4.2_09"
          Java(TM) 2 Runtime Environment, Standard Edition (build 1.4.2_09-b05)
          Java HotSpot(TM) Client VM (build 1.4.2_09-b05, mixed mode)
        
  Builder version :
          Maven version: 2.0.7
          Java version: 1.4.2_09
          OS name: "sunos" version: "5.10" arch: "x86"
    
****************************************************************************
SCM Changes:
****************************************************************************
Changed: no author @ no date
Comment: no comment
Files changed:
  src/test/java/org/apache/maven/plugins/enforcer/EnforcerTestUtils.java ( no revision )
  src/main/java/org/apache/maven/plugins/enforcer/DefaultEnforcementRuleHelper.java ( no revision
)
  src/main/java/org/apache/maven/plugins/enforcer/RequirePluginVersions.java ( no revision
)

****************************************************************************
Dependencies Changes:
****************************************************************************
org.apache.maven.enforcer:enforcer-api:1.0-alpha-3-SNAPSHOT

org.apache.maven.enforcer:enforcer:1-SNAPSHOT


****************************************************************************
Build Defintion:
****************************************************************************
POM filename: pom.xml
Goals: clean install   
Arguments: --batch-mode --non-recursive
Build Fresh: false
Always Build: false
Default Build Definition: true
Schedule: DEFAULT_SCHEDULE
Profile Name: JDK 1.4.2
Description: 


****************************************************************************
Test Summary:
****************************************************************************
Tests: 0
Failures: 0
Total time: 0

****************************************************************************
Output:
****************************************************************************
[INFO] Scanning for projects...
[INFO] ----------------------------------------------------------------------------
[INFO] Building Enforcer Rules
[INFO]    task-segment: [clean, install]
[INFO] ----------------------------------------------------------------------------
[INFO] [clean:clean]
[INFO] Deleting directory /export/home/build/data/continuum/checkouts/449/target
[INFO] [plexus:descriptor {execution: default}]
[INFO] Setting property: classpath.resource.loader.class => 'org.codehaus.plexus.velocity.ContextClassLoaderResourceLoader'.
[INFO] Setting property: velocimacro.messages.on => 'false'.
[INFO] Setting property: resource.loader => 'classpath'.
[INFO] Setting property: resource.manager.logwhenfound => 'false'.
[INFO] [remote-resources:process {execution: default}]
[INFO] [resources:resources]
[INFO] Using default encoding to copy filtered resources.
[INFO] [compiler:compile]
[INFO] Compiling 14 source files to /export/home/build/data/continuum/checkouts/449/target/classes
[INFO] [resources:testResources]
[INFO] Using default encoding to copy filtered resources.
[INFO] [compiler:testCompile]
[INFO] Compiling 15 source files to /export/home/build/data/continuum/checkouts/449/target/test-classes
[INFO] ------------------------------------------------------------------------
[ERROR] BUILD FAILURE
[INFO] ------------------------------------------------------------------------
[INFO] Compilation failure
/export/home/build/data/continuum/checkouts/449/src/test/java/org/apache/maven/plugins/enforcer/TestNoSnapshots.java:[24,-1]
cannot access junit.framework.TestCase
bad class file: /export/home/build/.m2/repository/junit/junit/4.4/junit-4.4.jar(junit/framework/TestCase.class)
class file has wrong version 49.0, should be 48.0



/export/home/build/data/continuum/checkouts/449/src/test/java/org/apache/maven/plugins/enforcer/TestNoSnapshots.java:[24,-1]
cannot access junit.framework.TestCase
bad class file: /export/home/build/.m2/repository/junit/junit/4.4/junit-4.4.jar(junit/framework/TestCase.class)
class file has wrong version 49.0, should be 48.0


[INFO] ------------------------------------------------------------------------
[INFO] For more information, run Maven with the -e switch
[INFO] ------------------------------------------------------------------------
[INFO] Total time: 7 seconds
[INFO] Finished at: Wed Nov 07 23:06:36 GMT+00:00 2007
[INFO] Final Memory: 15M/28M
[INFO] ------------------------------------------------------------------------

****************************************************************************



Mime
View raw message