maven-notifications mailing list archives: October 2007

Site index · List index
Message list1 · 2 · 3 · 4 · 5 · Next »Thread · Author · Date
Contin...@maven.zones.apache.org [continuum] BUILD FAILURE: Continuum Web APP Thu, 04 Oct, 21:34
Contin...@maven.zones.apache.org [continuum] BUILD SUCCESSFUL: Continuum Web APP Thu, 04 Oct, 22:08
Contin...@maven.zones.apache.org [continuum] BUILD FAILURE: Maven Eclipse Plugin Fri, 05 Oct, 02:09
Contin...@maven.zones.apache.org [continuum] BUILD FAILURE: Continuum Web APP Wed, 10 Oct, 14:22
Contin...@maven.zones.apache.org [continuum] BUILD SUCCESSFUL: Continuum Web APP Wed, 10 Oct, 16:20
Contin...@maven.zones.apache.org [continuum] BUILD FAILURE: Integration Test Executor Wed, 10 Oct, 16:57
Contin...@maven.zones.apache.org [continuum] BUILD FAILURE: Doxia Document Renderer Component Wed, 10 Oct, 20:11
Contin...@maven.zones.apache.org [continuum] BUILD FAILURE: Doxia Document Renderer Component Wed, 10 Oct, 21:27
Contin...@maven.zones.apache.org [continuum] BUILD FAILURE: Doxia Document Renderer Component Thu, 11 Oct, 08:29
Contin...@maven.zones.apache.org [continuum] BUILD FAILURE: Doxia Document Renderer Component Thu, 11 Oct, 10:07
Contin...@maven.zones.apache.org [continuum] BUILD FAILURE: Doxia Document Renderer Component Thu, 11 Oct, 13:24
Contin...@maven.zones.apache.org [continuum] BUILD FAILURE: Doxia Document Renderer Component Thu, 11 Oct, 15:19
Contin...@maven.zones.apache.org [continuum] BUILD FAILURE: Archiva Base :: Proxy Thu, 11 Oct, 16:23
Contin...@maven.zones.apache.org [continuum] BUILD FAILURE: Archiva Base :: Proxy Thu, 11 Oct, 17:38
Contin...@maven.zones.apache.org [continuum] BUILD FAILURE: Archiva Base :: Proxy Thu, 11 Oct, 18:21
Contin...@maven.zones.apache.org [continuum] BUILD SUCCESSFUL: Archiva Base :: Proxy Thu, 11 Oct, 19:33
Contin...@maven.zones.apache.org [continuum] BUILD FAILURE: Maven Dependency Analyzer Thu, 11 Oct, 20:07
Contin...@maven.zones.apache.org [continuum] BUILD SUCCESSFUL: Doxia Document Renderer Component Thu, 11 Oct, 20:40
Contin...@maven.zones.apache.org [continuum] BUILD FAILURE: Integration Test Executor Fri, 12 Oct, 02:34
Contin...@maven.zones.apache.org [continuum] BUILD FAILURE: Integration Test Executor Fri, 12 Oct, 02:47
Contin...@maven.zones.apache.org [continuum] BUILD FAILURE: Maven Archiver Fri, 12 Oct, 05:29
Contin...@maven.zones.apache.org [continuum] BUILD FAILURE: Maven Lifecycle Model Sat, 13 Oct, 07:45
Contin...@maven.zones.apache.org [continuum] BUILD FAILURE: Maven Build Context Sat, 13 Oct, 07:45
Contin...@maven.zones.apache.org [continuum] BUILD FAILURE: Maven Profile Model Sat, 13 Oct, 07:46
Contin...@maven.zones.apache.org [continuum] BUILD FAILURE: Maven Artifact Sat, 13 Oct, 07:46
Contin...@maven.zones.apache.org [continuum] BUILD FAILURE: Maven Project Builder Sat, 13 Oct, 07:46
Contin...@maven.zones.apache.org [continuum] BUILD FAILURE: Maven Plugin API Sat, 13 Oct, 07:46
Contin...@maven.zones.apache.org [continuum] BUILD FAILURE: Maven Core Sat, 13 Oct, 07:47
Contin...@maven.zones.apache.org [continuum] BUILD FAILURE: Maven Embedder Sat, 13 Oct, 07:47
Contin...@maven.zones.apache.org [continuum] BUILD FAILURE: Integration Test Executor Sat, 13 Oct, 07:47
Contin...@maven.zones.apache.org [continuum] BUILD FAILURE: Maven Eclipse Plugin Mon, 15 Oct, 06:38
Contin...@maven.zones.apache.org [continuum] BUILD SUCCESSFUL: Maven Lifecycle Model Mon, 15 Oct, 16:42
Contin...@maven.zones.apache.org [continuum] BUILD SUCCESSFUL: Maven Build Context Mon, 15 Oct, 16:42
Contin...@maven.zones.apache.org [continuum] BUILD SUCCESSFUL: Maven Profile Model Mon, 15 Oct, 16:42
Contin...@maven.zones.apache.org [continuum] BUILD SUCCESSFUL: Maven Artifact Mon, 15 Oct, 16:43
Contin...@maven.zones.apache.org [continuum] BUILD SUCCESSFUL: Maven Project Builder Mon, 15 Oct, 16:43
Contin...@maven.zones.apache.org [continuum] BUILD SUCCESSFUL: Maven Plugin API Mon, 15 Oct, 16:43
Contin...@maven.zones.apache.org [continuum] BUILD SUCCESSFUL: Maven Core Mon, 15 Oct, 16:44
Contin...@maven.zones.apache.org [continuum] BUILD SUCCESSFUL: Maven Embedder Mon, 15 Oct, 16:45
Contin...@maven.zones.apache.org [continuum] BUILD FAILURE: Integration Test Executor Mon, 15 Oct, 16:46
Contin...@maven.zones.apache.org [continuum] BUILD FAILURE: Integration Test Executor Tue, 16 Oct, 04:00
Contin...@maven.zones.apache.org [continuum] BUILD FAILURE: Apache Maven Tue, 16 Oct, 20:00
Contin...@maven.zones.apache.org [continuum] BUILD FAILURE: Integration Test Executor Tue, 16 Oct, 20:26
Contin...@maven.zones.apache.org [continuum] BUILD FAILURE: Apache Maven Tue, 16 Oct, 20:39
Contin...@maven.zones.apache.org [continuum] BUILD FAILURE: Integration Test Executor Tue, 16 Oct, 22:03
Contin...@maven.zones.apache.org [continuum] BUILD FAILURE: Integration Test Executor Tue, 16 Oct, 22:13
Contin...@maven.zones.apache.org [continuum] BUILD FAILURE: Integration Test Executor Tue, 16 Oct, 23:29
Contin...@maven.zones.apache.org [continuum] BUILD FAILURE: Maven Project Builder Wed, 17 Oct, 01:55
Contin...@maven.zones.apache.org [continuum] BUILD FAILURE: Integration Test Executor Wed, 17 Oct, 02:13
Contin...@maven.zones.apache.org [continuum] BUILD FAILURE: Maven Project Builder Wed, 17 Oct, 02:17
Contin...@maven.zones.apache.org [continuum] BUILD FAILURE: Integration Test Executor Wed, 17 Oct, 02:26
Contin...@maven.zones.apache.org [continuum] BUILD SUCCESSFUL: Maven Project Builder Wed, 17 Oct, 03:21
Contin...@maven.zones.apache.org [continuum] BUILD FAILURE: Integration Test Executor Wed, 17 Oct, 03:39
Contin...@maven.zones.apache.org [continuum] BUILD SUCCESSFUL: Maven Project Builder Thu, 18 Oct, 02:57
Contin...@maven.zones.apache.org [continuum] BUILD FAILURE: Integration Test Executor Thu, 18 Oct, 03:10
Contin...@maven.zones.apache.org [continuum] BUILD FAILURE: Integration Test Executor Thu, 18 Oct, 04:23
Contin...@maven.zones.apache.org [continuum] BUILD FAILURE: Integration Test Executor Thu, 18 Oct, 05:28
Contin...@maven.zones.apache.org [continuum] BUILD FAILURE: Continuum Core Thu, 18 Oct, 13:33
Contin...@maven.zones.apache.org [continuum] BUILD SUCCESSFUL: Continuum Core Thu, 18 Oct, 14:30
Contin...@maven.zones.apache.org [continuum] BUILD FAILURE: Apache Maven Thu, 18 Oct, 16:16
Contin...@maven.zones.apache.org [continuum] BUILD FAILURE: Integration Test Executor Thu, 18 Oct, 18:58
Contin...@maven.zones.apache.org [continuum] BUILD FAILURE: Integration Test Executor Thu, 18 Oct, 20:02
Contin...@maven.zones.apache.org [continuum] BUILD FAILURE: Integration Test Executor Thu, 18 Oct, 21:51
Contin...@maven.zones.apache.org [continuum] BUILD SUCCESSFUL: Maven Ant Task Thu, 18 Oct, 23:32
Contin...@maven.zones.apache.org [continuum] BUILD SUCCESSFUL: Maven Ant Task Thu, 18 Oct, 23:35
Contin...@maven.zones.apache.org [continuum] BUILD FAILURE: Integration Test Executor Fri, 19 Oct, 01:42
Contin...@maven.zones.apache.org [continuum] BUILD FAILURE: Integration Test Executor Fri, 19 Oct, 01:56
Contin...@maven.zones.apache.org [continuum] BUILD FAILURE: Integration Test Executor Fri, 19 Oct, 04:07
Contin...@maven.zones.apache.org [continuum] BUILD ERROR: SureFire Fri, 19 Oct, 05:33
Contin...@maven.zones.apache.org [continuum] BUILD FAILURE: Integration Test Executor Fri, 19 Oct, 13:00
Contin...@maven.zones.apache.org [continuum] BUILD FAILURE: Integration Test Executor Fri, 19 Oct, 16:25
Contin...@maven.zones.apache.org [continuum] BUILD FAILURE: Integration Test Executor Fri, 19 Oct, 17:39
Contin...@maven.zones.apache.org [continuum] BUILD FAILURE: Integration Test Executor Fri, 19 Oct, 17:51
Contin...@maven.zones.apache.org [continuum] BUILD FAILURE: Integration Test Executor Fri, 19 Oct, 19:15
Contin...@maven.zones.apache.org [continuum] BUILD FAILURE: Integration Test Executor Fri, 19 Oct, 20:36
Contin...@maven.zones.apache.org [continuum] BUILD SUCCESSFUL: SureFire Mon, 22 Oct, 02:03
Contin...@maven.zones.apache.org [continuum] BUILD SUCCESSFUL: Integration Test Executor Mon, 22 Oct, 04:07
Contin...@maven.zones.apache.org [continuum] BUILD SUCCESSFUL: Integration Test Executor Mon, 22 Oct, 04:17
Contin...@maven.zones.apache.org [continuum] BUILD FAILURE: Maven Embedder Mon, 22 Oct, 07:14
Contin...@maven.zones.apache.org [continuum] BUILD FAILURE: Maven Lifecycle Model Mon, 22 Oct, 08:12
Contin...@maven.zones.apache.org [continuum] BUILD FAILURE: Maven Build Context Mon, 22 Oct, 08:12
Contin...@maven.zones.apache.org [continuum] BUILD FAILURE: Maven Profile Model Mon, 22 Oct, 08:13
Contin...@maven.zones.apache.org [continuum] BUILD FAILURE: Maven Project Builder Mon, 22 Oct, 08:14
Contin...@maven.zones.apache.org [continuum] BUILD FAILURE: Maven Plugin API Mon, 22 Oct, 08:14
Contin...@maven.zones.apache.org [continuum] BUILD FAILURE: Maven Core Mon, 22 Oct, 08:14
Contin...@maven.zones.apache.org [continuum] BUILD FAILURE: Maven Embedder Mon, 22 Oct, 08:15
Contin...@maven.zones.apache.org [continuum] BUILD FAILURE: Integration Test Executor Mon, 22 Oct, 08:16
Contin...@maven.zones.apache.org [continuum] BUILD FAILURE: Archiva Base :: Configuration Mon, 22 Oct, 13:10
Contin...@maven.zones.apache.org [continuum] BUILD FAILURE: Archiva Web :: Application Mon, 22 Oct, 13:22
Contin...@maven.zones.apache.org [continuum] BUILD SUCCESSFUL: Archiva Base :: Configuration Mon, 22 Oct, 14:08
Contin...@maven.zones.apache.org [continuum] BUILD SUCCESSFUL: Archiva Web :: Application Mon, 22 Oct, 14:22
Contin...@maven.zones.apache.org [continuum] BUILD FAILURE: Maven Lifecycle Model Mon, 22 Oct, 16:24
Contin...@maven.zones.apache.org [continuum] BUILD FAILURE: Maven Build Context Mon, 22 Oct, 16:25
Contin...@maven.zones.apache.org [continuum] BUILD FAILURE: Maven Profile Model Mon, 22 Oct, 16:25
Contin...@maven.zones.apache.org [continuum] BUILD FAILURE: Maven Project Builder Mon, 22 Oct, 16:25
Contin...@maven.zones.apache.org [continuum] BUILD FAILURE: Maven Plugin API Mon, 22 Oct, 16:26
Contin...@maven.zones.apache.org [continuum] BUILD FAILURE: Maven Core Mon, 22 Oct, 16:27
Contin...@maven.zones.apache.org [continuum] BUILD FAILURE: Maven Embedder Mon, 22 Oct, 16:28
Contin...@maven.zones.apache.org [continuum] BUILD FAILURE: Integration Test Executor Mon, 22 Oct, 16:28
Contin...@maven.zones.apache.org [continuum] BUILD SUCCESSFUL: Maven Lifecycle Model Mon, 22 Oct, 18:44
Message list1 · 2 · 3 · 4 · 5 · Next »Thread · Author · Date
Box list
Sep 2014210
Aug 2014246
Jul 2014317
Jun 2014341
May 2014161
Apr 2014146
Mar 2014336
Feb 2014308
Jan 2014189
Dec 2013319
Nov 2013274
Oct 2013167
Sep 2013486
Aug 2013263
Jul 2013726
Jun 2013722
May 2013378
Apr 2013313
Mar 2013467
Feb 2013520
Jan 20131437
Dec 20121778
Nov 2012775
Oct 20121224
Sep 2012791
Aug 2012362
Jul 2012232
Jun 2012149
May 2012189
Apr 2012115
Mar 201257
Feb 2012155
Jan 2012170
Dec 2011244
Nov 2011187
Oct 2011139
Sep 2011190
Aug 2011276
Jul 201194
Jun 20114
Apr 201162
Mar 201176
Feb 201154
Jan 201185
Dec 201079
Nov 201061
Oct 201058
Sep 20101
Aug 201057
Jul 201037
Jun 201020
May 201075
Apr 201053
Mar 201012
Feb 201030
Jan 201071
Dec 2009104
Nov 200919
Oct 200931
Sep 2009193
Aug 2009268
Jul 2009193
Jun 2009147
May 200975
Apr 200979
Mar 2009134
Feb 2009657
Jan 200983
Dec 2008349
Nov 2008288
Oct 2008986
Sep 2008842
Aug 2008707
Jul 2008887
Jun 2008167
May 200821
Apr 2008231
Mar 2008438
Feb 2008317
Jan 2008205
Dec 2007185
Nov 2007532
Oct 2007439
Sep 2007699
Aug 20071294
Jul 2007351
Jun 20072211
May 2007273
Apr 2007262
Mar 2007534
Feb 20071648
Jan 20072359
Dec 2006575
Nov 2006357
Oct 2006642
Sep 2006660
Aug 20061662
Jul 20061320
Jun 2006473
May 20064700
Apr 20061113
Mar 20061048