maven-notifications mailing list archives

Site index · List index
Message view « Date » · « Thread »
Top « Date » · « Thread »
From "Continuum@maven.zones.apache.org" <contin...@maven.zones.apache.org>
Subject [continuum] BUILD FAILURE: Maven Archiver
Date Fri, 12 Oct 2007 05:29:29 GMT
Online report : http://maven.zones.apache.org/continuum/buildResult.action?buildId=27677&projectId=44

Build statistics:
  State: Failed
  Previous State: Failed
  Started at: Fri 12 Oct 2007 05:29:18 +0000
  Finished at: Fri 12 Oct 2007 05:29:27 +0000
  Total time: 8s
  Build Trigger: Forced
  Build Number: 7
  Exit code: 1
  Building machine hostname: maven.zones.apache.org
  Operating system : SunOS(unknown)
  Java Home version : 
          java version "1.4.2_06"
          Java(TM) 2 Runtime Environment, Standard Edition (build 1.4.2_06-b03)
          Java HotSpot(TM) Client VM (build 1.4.2_06-b03, mixed mode)
        
  Builder version :
          Maven version: 2.0.7
          Java version: 1.4.2_06
          OS name: "sunos" version: "5.10" arch: "x86"
    
****************************************************************************
SCM Changes:
****************************************************************************
No files changed

****************************************************************************
Dependencies Changes:
****************************************************************************
No dependencies changed


****************************************************************************
Build Defintion:
****************************************************************************
POM filename: pom.xml
Goals: clean install   
Arguments: --batch-mode --non-recursive
Build Fresh: false
Always Build: false
Default Build Definition: true
Schedule: DEFAULT_SCHEDULE
Profile Name: j2sdk1.4.2_06
Description: 


****************************************************************************
Test Summary:
****************************************************************************
Tests: 3
Failures: 1
Total time: 220

****************************************************************************
Output:
****************************************************************************
[INFO] Scanning for projects...
[INFO] ----------------------------------------------------------------------------
[INFO] Building Maven Archiver
[INFO]    task-segment: [clean, install]
[INFO] ----------------------------------------------------------------------------
[INFO] [clean:clean]
[INFO] Deleting directory /export/home/build/data/continuum/checkouts/44/target
[INFO] Deleting directory /export/home/build/data/continuum/checkouts/44/target/classes
[INFO] Deleting directory /export/home/build/data/continuum/checkouts/44/target/test-classes
[INFO] Deleting directory /export/home/build/data/continuum/checkouts/44/target/site
[INFO] [resources:resources]
[INFO] Using default encoding to copy filtered resources.
[INFO] [compiler:compile]
[INFO] Compiling 5 source files to /export/home/build/data/continuum/checkouts/44/target/classes
[INFO] [resources:testResources]
[INFO] Using default encoding to copy filtered resources.
[INFO] [compiler:testCompile]
[INFO] Compiling 2 source files to /export/home/build/data/continuum/checkouts/44/target/test-classes
[INFO] [surefire:test]
[INFO] Surefire report directory: /export/home/build/data/continuum/checkouts/44/target/surefire-reports

-------------------------------------------------------
 T E S T S
-------------------------------------------------------
Running org.apache.maven.archiver.MavenArchiverTest
[INFO] Building jar: /export/home/build/data/continuum/checkouts/44/target/test/dummy.jar
Tests run: 3, Failures: 1, Errors: 0, Skipped: 0, Time elapsed: 0.243 sec <<< FAILURE!

Results :

Failed tests: 
  testRecreation(org.apache.maven.archiver.MavenArchiverTest)

Tests run: 3, Failures: 1, Errors: 0, Skipped: 0

[INFO] ------------------------------------------------------------------------
[ERROR] BUILD FAILURE
[INFO] ------------------------------------------------------------------------
[INFO] There are test failures.
[INFO] ------------------------------------------------------------------------
[INFO] For more information, run Maven with the -e switch
[INFO] ------------------------------------------------------------------------
[INFO] Total time: 6 seconds
[INFO] Finished at: Fri Oct 12 05:29:27 GMT+00:00 2007
[INFO] Final Memory: 5M/10M
[INFO] ------------------------------------------------------------------------

****************************************************************************



Mime
View raw message