maven-notifications mailing list archives

Site index · List index
Message view « Date » · « Thread »
Top « Date » · « Thread »
From "Continuum@maven.zones.apache.org" <contin...@maven.zones.apache.org>
Subject [continuum] BUILD FAILURE: Maven Eclipse Plugin
Date Mon, 15 Oct 2007 06:38:16 GMT
Online report : http://maven.zones.apache.org/continuum/buildResult.action?buildId=28041&projectId=17

Build statistics:
  State: Failed
  Previous State: Failed
  Started at: Mon 15 Oct 2007 06:32:28 +0000
  Finished at: Mon 15 Oct 2007 06:37:55 +0000
  Total time: 5m 26s
  Build Trigger: Schedule
  Build Number: 45
  Exit code: 1
  Building machine hostname: maven.zones.apache.org
  Operating system : SunOS(unknown)
  Java Home version : 
          java version "1.4.2_06"
          Java(TM) 2 Runtime Environment, Standard Edition (build 1.4.2_06-b03)
          Java HotSpot(TM) Client VM (build 1.4.2_06-b03, mixed mode)
        
  Builder version :
          Maven version: 2.0.7
          Java version: 1.4.2_06
          OS name: "sunos" version: "5.10" arch: "x86"
    
****************************************************************************
SCM Changes:
****************************************************************************
Changed: no author @ no date
Comment: no comment
Files changed:
  src/main/java/org/apache/maven/plugin/ide/AbstractIdeSupportMojo.java ( no revision )
  src/main/java/org/apache/maven/plugin/eclipse/EclipsePlugin.java ( no revision )
  src/main/java/org/apache/maven/plugin/eclipse/EclipseCleanMojo.java ( no revision )
  src/main/java/org/apache/maven/plugin/eclipse/writers/rad/RadLibCopier.java ( no revision
)
  src/main/java/org/apache/maven/plugin/eclipse/writers/rad/RadWebSettingsWriter.java ( no
revision )
  src/main/java/org/apache/maven/plugin/eclipse/writers/rad/RadEjbClasspathWriter.java ( no
revision )
  src/main/java/org/apache/maven/plugin/eclipse/writers/rad/RadApplicationXMLWriter.java (
no revision )
  src/main/java/org/apache/maven/plugin/eclipse/writers/rad/RadJ2EEWriter.java ( no revision
)
  src/main/java/org/apache/maven/plugin/eclipse/writers/rad/RadManifestWriter.java ( no revision
)
  src/main/java/org/apache/maven/plugin/eclipse/writers/rad/RadWebsiteConfigWriter.java (
no revision )
  src/main/java/org/apache/maven/plugin/eclipse/writers/EclipseWriterConfig.java ( no revision
)
  src/main/java/org/apache/maven/plugin/eclipse/writers/wtp/EclipseWtpComponentWriter.java
( no revision )
  src/main/java/org/apache/maven/plugin/eclipse/writers/wtp/EclipseWtpFacetsWriter.java (
no revision )
  src/main/java/org/apache/maven/plugin/eclipse/writers/wtp/AbstractWtpResourceWriter.java
( no revision )
  src/main/java/org/apache/maven/plugin/eclipse/writers/wtp/EclipseWtpmodulesWriter.java (
no revision )
  src/main/java/org/apache/maven/plugin/eclipse/RadPlugin.java ( no revision )
  src/main/java/org/apache/maven/plugin/eclipse/RadCleanMojo.java ( no revision )

****************************************************************************
Dependencies Changes:
****************************************************************************
No dependencies changed


****************************************************************************
Build Defintion:
****************************************************************************
POM filename: pom.xml
Goals: clean install   
Arguments: --batch-mode --non-recursive -P integration-tests
Build Fresh: false
Always Build: false
Default Build Definition: true
Schedule: Integration Test Run
Profile Name: j2sdk1.4.2_06
Description: 


****************************************************************************
Test Summary:
****************************************************************************
Tests: 67
Failures: 44
Total time: 252400

****************************************************************************
Output:
****************************************************************************
[INFO] Scanning for projects...
[INFO] ----------------------------------------------------------------------------
[INFO] Building Maven Eclipse Plugin
[INFO]    task-segment: [clean, install]
[INFO] ----------------------------------------------------------------------------
[INFO] [clean:clean]
[INFO] Deleting directory /export/home/build/data/continuum/checkouts/17/target
[INFO] Deleting directory /export/home/build/data/continuum/checkouts/17/target/classes
[INFO] Deleting directory /export/home/build/data/continuum/checkouts/17/target/test-classes
[INFO] Deleting directory /export/home/build/data/continuum/checkouts/17/target/site
[INFO] [plugin:descriptor]
[INFO] Using 2 extractors.
[INFO] Applying extractor for language: java
[INFO] Extractor for language: java found 10 mojo descriptors.
[INFO] Applying extractor for language: bsh
[INFO] Extractor for language: bsh found 0 mojo descriptors.
[INFO] [resources:resources]
[INFO] Using default encoding to copy filtered resources.
[INFO] Copying 3 resources
[INFO] snapshot org.apache.maven.shared:maven-plugin-testing-tools:1.0-alpha-3-SNAPSHOT: checking
for updates from apache.snapshots
[INFO] snapshot org.apache.maven.shared:maven-invoker:2.0.7-SNAPSHOT: checking for updates
from apache.snapshots
[INFO] [compiler:compile]
[INFO] Compiling 54 source files to /export/home/build/data/continuum/checkouts/17/target/classes
[INFO] [resources:testResources]
[INFO] Using default encoding to copy filtered resources.
[INFO] Copying 284 resources
[INFO] [compiler:testCompile]
[INFO] Compiling 17 source files to /export/home/build/data/continuum/checkouts/17/target/test-classes
[INFO] [surefire:test]
[INFO] Surefire report directory: /export/home/build/data/continuum/checkouts/17/target/surefire-reports

-------------------------------------------------------
 T E S T S
-------------------------------------------------------
Running org.apache.maven.plugin.eclipse.AddMavenRepoMojoTest
Tests run: 1, Failures: 0, Errors: 0, Skipped: 0, Time elapsed: 0.598 sec
Running org.apache.maven.plugin.ide.IdeUtilsTest
Tests run: 1, Failures: 0, Errors: 0, Skipped: 0, Time elapsed: 0.013 sec
Running org.apache.maven.plugin.eclipse.BuildCommandTest
Tests run: 1, Failures: 0, Errors: 0, Skipped: 0, Time elapsed: 0.041 sec
Running org.apache.maven.plugin.eclipse.RadPluginTest
*** Running test builds; output will be directed to: target/surefire-reports/build-output

Using target/it-build-target and target/it-build-target/classes to build IT version of plugin
Now Building test version of the plugin...
Using staged plugin-pom: /export/home/build/data/continuum/checkouts/17/pom-test.xml
*** Running test builds; output will be directed to: target/surefire-reports/build-output

Using target/it-build-target and target/it-build-target/classes to build IT version of plugin
Now Building test version of the plugin...
Using staged plugin-pom: /export/home/build/data/continuum/checkouts/17/pom-test.xml
*** Running test builds; output will be directed to: target/surefire-reports/build-output

Using target/it-build-target and target/it-build-target/classes to build IT version of plugin
Now Building test version of the plugin...
Using staged plugin-pom: /export/home/build/data/continuum/checkouts/17/pom-test.xml
*** Running test builds; output will be directed to: target/surefire-reports/build-output

Using target/it-build-target and target/it-build-target/classes to build IT version of plugin
Now Building test version of the plugin...
Using staged plugin-pom: /export/home/build/data/continuum/checkouts/17/pom-test.xml
*** Running test builds; output will be directed to: target/surefire-reports/build-output

Using target/it-build-target and target/it-build-target/classes to build IT version of plugin
Now Building test version of the plugin...
Using staged plugin-pom: /export/home/build/data/continuum/checkouts/17/pom-test.xml
*** Running test builds; output will be directed to: target/surefire-reports/build-output

Using target/it-build-target and target/it-build-target/classes to build IT version of plugin
Now Building test version of the plugin...
Using staged plugin-pom: /export/home/build/data/continuum/checkouts/17/pom-test.xml
Tests run: 6, Failures: 0, Errors: 6, Skipped: 0, Time elapsed: 40.116 sec <<< FAILURE!
Running org.apache.maven.plugin.eclipse.writers.EclipseOSGiManifestWriterTest
Tests run: 3, Failures: 0, Errors: 0, Skipped: 0, Time elapsed: 0.008 sec
Running org.apache.maven.plugin.eclipse.writers.workspace.EclipseCodeFormatterTest
Tests run: 1, Failures: 0, Errors: 0, Skipped: 0, Time elapsed: 0.009 sec
Running org.apache.maven.plugin.eclipse.EclipseWorkspaceTest
*** Running test builds; output will be directed to: target/surefire-reports/build-output

Using target/it-build-target and target/it-build-target/classes to build IT version of plugin
Now Building test version of the plugin...
Using staged plugin-pom: /export/home/build/data/continuum/checkouts/17/pom-test.xml
*** Running test builds; output will be directed to: target/surefire-reports/build-output

Using target/it-build-target and target/it-build-target/classes to build IT version of plugin
Now Building test version of the plugin...
Using staged plugin-pom: /export/home/build/data/continuum/checkouts/17/pom-test.xml
Tests run: 2, Failures: 0, Errors: 2, Skipped: 0, Time elapsed: 6.487 sec <<< FAILURE!
Running org.apache.maven.plugin.eclipse.writers.EclipseClasspathWriterUnitTest
[debug] Processing resource src/main/resources: output=target/classes; default output=target/classes
[debug] Processing resource src/test/resources: output=target/classes/test-resources; default
output=target/classes
[debug] Marking as special to prevent output folder nesting: src/test/resources (output=target/classes/test-resources)
[info] Creating maven-eclipse.xml Ant file to handle resources
[info] Creating external launcher file
Tests run: 1, Failures: 0, Errors: 0, Skipped: 0, Time elapsed: 0.264 sec
Running org.apache.maven.plugin.eclipse.EclipsePluginMasterProjectTest
*** Running test builds; output will be directed to: target/surefire-reports/build-output

Using target/it-build-target and target/it-build-target/classes to build IT version of plugin
Now Building test version of the plugin...
Using staged plugin-pom: /export/home/build/data/continuum/checkouts/17/pom-test.xml
*** Running test builds; output will be directed to: target/surefire-reports/build-output

Using target/it-build-target and target/it-build-target/classes to build IT version of plugin
Now Building test version of the plugin...
Using staged plugin-pom: /export/home/build/data/continuum/checkouts/17/pom-test.xml
*** Running test builds; output will be directed to: target/surefire-reports/build-output

Using target/it-build-target and target/it-build-target/classes to build IT version of plugin
Now Building test version of the plugin...
Using staged plugin-pom: /export/home/build/data/continuum/checkouts/17/pom-test.xml
*** Running test builds; output will be directed to: target/surefire-reports/build-output

Using target/it-build-target and target/it-build-target/classes to build IT version of plugin
Now Building test version of the plugin...
Using staged plugin-pom: /export/home/build/data/continuum/checkouts/17/pom-test.xml
*** Running test builds; output will be directed to: target/surefire-reports/build-output

Using target/it-build-target and target/it-build-target/classes to build IT version of plugin
Now Building test version of the plugin...
Using staged plugin-pom: /export/home/build/data/continuum/checkouts/17/pom-test.xml
*** Running test builds; output will be directed to: target/surefire-reports/build-output

Using target/it-build-target and target/it-build-target/classes to build IT version of plugin
Now Building test version of the plugin...
Using staged plugin-pom: /export/home/build/data/continuum/checkouts/17/pom-test.xml
Tests run: 6, Failures: 0, Errors: 6, Skipped: 0, Time elapsed: 33.772 sec <<< FAILURE!
Running org.apache.maven.plugin.eclipse.writers.testutils.TestEclipseWriterConfig
Tests run: 0, Failures: 0, Errors: 0, Skipped: 0, Time elapsed: 0.002 sec
Running org.apache.maven.plugin.eclipse.EclipsePluginTest
*** Running test builds; output will be directed to: target/surefire-reports/build-output

Using target/it-build-target and target/it-build-target/classes to build IT version of plugin
Now Building test version of the plugin...
Using staged plugin-pom: /export/home/build/data/continuum/checkouts/17/pom-test.xml
*** Running test builds; output will be directed to: target/surefire-reports/build-output

Using target/it-build-target and target/it-build-target/classes to build IT version of plugin
Now Building test version of the plugin...
Using staged plugin-pom: /export/home/build/data/continuum/checkouts/17/pom-test.xml
*** Running test builds; output will be directed to: target/surefire-reports/build-output

Using target/it-build-target and target/it-build-target/classes to build IT version of plugin
Now Building test version of the plugin...
Using staged plugin-pom: /export/home/build/data/continuum/checkouts/17/pom-test.xml
*** Running test builds; output will be directed to: target/surefire-reports/build-output

Using target/it-build-target and target/it-build-target/classes to build IT version of plugin
Now Building test version of the plugin...
Using staged plugin-pom: /export/home/build/data/continuum/checkouts/17/pom-test.xml
*** Running test builds; output will be directed to: target/surefire-reports/build-output

Using target/it-build-target and target/it-build-target/classes to build IT version of plugin
Now Building test version of the plugin...
Using staged plugin-pom: /export/home/build/data/continuum/checkouts/17/pom-test.xml
*** Running test builds; output will be directed to: target/surefire-reports/build-output

Using target/it-build-target and target/it-build-target/classes to build IT version of plugin
Now Building test version of the plugin...
Using staged plugin-pom: /export/home/build/data/continuum/checkouts/17/pom-test.xml
*** Running test builds; output will be directed to: target/surefire-reports/build-output

Using target/it-build-target and target/it-build-target/classes to build IT version of plugin
Now Building test version of the plugin...
Using staged plugin-pom: /export/home/build/data/continuum/checkouts/17/pom-test.xml
*** Running test builds; output will be directed to: target/surefire-reports/build-output

Using target/it-build-target and target/it-build-target/classes to build IT version of plugin
Now Building test version of the plugin...
Using staged plugin-pom: /export/home/build/data/continuum/checkouts/17/pom-test.xml
*** Running test builds; output will be directed to: target/surefire-reports/build-output

Using target/it-build-target and target/it-build-target/classes to build IT version of plugin
Now Building test version of the plugin...
Using staged plugin-pom: /export/home/build/data/continuum/checkouts/17/pom-test.xml
*** Running test builds; output will be directed to: target/surefire-reports/build-output

Using target/it-build-target and target/it-build-target/classes to build IT version of plugin
Now Building test version of the plugin...
Using staged plugin-pom: /export/home/build/data/continuum/checkouts/17/pom-test.xml
*** Running test builds; output will be directed to: target/surefire-reports/build-output

Using target/it-build-target and target/it-build-target/classes to build IT version of plugin
Now Building test version of the plugin...
Using staged plugin-pom: /export/home/build/data/continuum/checkouts/17/pom-test.xml
*** Running test builds; output will be directed to: target/surefire-reports/build-output

Using target/it-build-target and target/it-build-target/classes to build IT version of plugin
Now Building test version of the plugin...
Using staged plugin-pom: /export/home/build/data/continuum/checkouts/17/pom-test.xml
*** Running test builds; output will be directed to: target/surefire-reports/build-output

Using target/it-build-target and target/it-build-target/classes to build IT version of plugin
Now Building test version of the plugin...
Using staged plugin-pom: /export/home/build/data/continuum/checkouts/17/pom-test.xml
*** Running test builds; output will be directed to: target/surefire-reports/build-output

Using target/it-build-target and target/it-build-target/classes to build IT version of plugin
Now Building test version of the plugin...
Using staged plugin-pom: /export/home/build/data/continuum/checkouts/17/pom-test.xml
*** Running test builds; output will be directed to: target/surefire-reports/build-output

Using target/it-build-target and target/it-build-target/classes to build IT version of plugin
Now Building test version of the plugin...
Using staged plugin-pom: /export/home/build/data/continuum/checkouts/17/pom-test.xml
*** Running test builds; output will be directed to: target/surefire-reports/build-output

Using target/it-build-target and target/it-build-target/classes to build IT version of plugin
Now Building test version of the plugin...
Using staged plugin-pom: /export/home/build/data/continuum/checkouts/17/pom-test.xml
*** Running test builds; output will be directed to: target/surefire-reports/build-output

Using target/it-build-target and target/it-build-target/classes to build IT version of plugin
Now Building test version of the plugin...
Using staged plugin-pom: /export/home/build/data/continuum/checkouts/17/pom-test.xml
*** Running test builds; output will be directed to: target/surefire-reports/build-output

Using target/it-build-target and target/it-build-target/classes to build IT version of plugin
Now Building test version of the plugin...
Using staged plugin-pom: /export/home/build/data/continuum/checkouts/17/pom-test.xml
*** Running test builds; output will be directed to: target/surefire-reports/build-output

Using target/it-build-target and target/it-build-target/classes to build IT version of plugin
Now Building test version of the plugin...
Using staged plugin-pom: /export/home/build/data/continuum/checkouts/17/pom-test.xml
*** Running test builds; output will be directed to: target/surefire-reports/build-output

Using target/it-build-target and target/it-build-target/classes to build IT version of plugin
Now Building test version of the plugin...
Using staged plugin-pom: /export/home/build/data/continuum/checkouts/17/pom-test.xml
*** Running test builds; output will be directed to: target/surefire-reports/build-output

Using target/it-build-target and target/it-build-target/classes to build IT version of plugin
Now Building test version of the plugin...
Using staged plugin-pom: /export/home/build/data/continuum/checkouts/17/pom-test.xml
*** Running test builds; output will be directed to: target/surefire-reports/build-output

Using target/it-build-target and target/it-build-target/classes to build IT version of plugin
Now Building test version of the plugin...
Using staged plugin-pom: /export/home/build/data/continuum/checkouts/17/pom-test.xml
*** Running test builds; output will be directed to: target/surefire-reports/build-output

Using target/it-build-target and target/it-build-target/classes to build IT version of plugin
Now Building test version of the plugin...
Using staged plugin-pom: /export/home/build/data/continuum/checkouts/17/pom-test.xml
*** Running test builds; output will be directed to: target/surefire-reports/build-output

Using target/it-build-target and target/it-build-target/classes to build IT version of plugin
Now Building test version of the plugin...
Using staged plugin-pom: /export/home/build/data/continuum/checkouts/17/pom-test.xml
*** Running test builds; output will be directed to: target/surefire-reports/build-output

Using target/it-build-target and target/it-build-target/classes to build IT version of plugin
Now Building test version of the plugin...
Using staged plugin-pom: /export/home/build/data/continuum/checkouts/17/pom-test.xml
*** Running test builds; output will be directed to: target/surefire-reports/build-output

Using target/it-build-target and target/it-build-target/classes to build IT version of plugin
Now Building test version of the plugin...
Using staged plugin-pom: /export/home/build/data/continuum/checkouts/17/pom-test.xml
*** Running test builds; output will be directed to: target/surefire-reports/build-output

Using target/it-build-target and target/it-build-target/classes to build IT version of plugin
Now Building test version of the plugin...
Using staged plugin-pom: /export/home/build/data/continuum/checkouts/17/pom-test.xml
*** Running test builds; output will be directed to: target/surefire-reports/build-output

Using target/it-build-target and target/it-build-target/classes to build IT version of plugin
Now Building test version of the plugin...
Using staged plugin-pom: /export/home/build/data/continuum/checkouts/17/pom-test.xml
*** Running test builds; output will be directed to: target/surefire-reports/build-output

Using target/it-build-target and target/it-build-target/classes to build IT version of plugin
Now Building test version of the plugin...
Using staged plugin-pom: /export/home/build/data/continuum/checkouts/17/pom-test.xml
*** Running test builds; output will be directed to: target/surefire-reports/build-output

Using target/it-build-target and target/it-build-target/classes to build IT version of plugin
Now Building test version of the plugin...
Using staged plugin-pom: /export/home/build/data/continuum/checkouts/17/pom-test.xml
Tests run: 30, Failures: 0, Errors: 30, Skipped: 0, Time elapsed: 170.709 sec <<<
FAILURE!
Running org.apache.maven.plugin.eclipse.EclipsePluginUnitTest
[debug] testOutput toRelativeAndFixSeparator /var/tmp/EclipsePlugin.unitTest.1192430274156
, target/main-output
[debug] testOutput after toRelative : target/main-output
[debug] Processing resource dir: src/main/resources
[debug] Making relative and fixing separator: { /var/tmp/EclipsePlugin.unitTest.1192430274156,
/var/tmp/EclipsePlugin.unitTest.1192430274156/target/main-output, false }.
[debug] Adding eclipse source dir: { src/main/resources, target/main-output, true, true, null,
null }.
[debug] Processing resource dir: src/main/resources
[debug] Making relative and fixing separator: { /var/tmp/EclipsePlugin.unitTest.1192430274196,
/var/tmp/EclipsePlugin.unitTest.1192430274196/target/classes/main-output, false }.
[debug] Adding eclipse source dir: { src/main/resources, target/classes/main-output, true,
false, null, null }.
[debug] Processing resource dir: src/main/resources
[debug] Making relative and fixing separator: { /var/tmp/EclipsePlugin.unitTest.1192430274226,
/var/tmp/EclipsePlugin.unitTest.1192430274226/target/main-output, false }.
[debug] Adding eclipse source dir: { src/main/resources, target/main-output, true, false,
null, null }.
[debug] Processing resource dir: src/main/resources
[debug] Making relative and fixing separator: { /var/tmp/EclipsePlugin.unitTest.1192430274256,
/var/tmp/EclipsePlugin.unitTest.1192430274256/target/classes, false }.
[debug] Adding eclipse source dir: { src/main/resources, target/classes, true, false, null,
null }.
[debug] Processing resource dir: src/test/resources
[debug] Making relative and fixing separator: { /var/tmp/EclipsePlugin.unitTest.1192430274256,
/var/tmp/EclipsePlugin.unitTest.1192430274256/target/test-classes, false }.
[debug] Adding eclipse source dir: { src/test/resources, target/test-classes, true, false,
null, null }.
[debug] Processing resource dir: src/main/resources
[debug] Making relative and fixing separator: { /var/tmp/EclipsePlugin.unitTest.1192430274316,
/var/tmp/EclipsePlugin.unitTest.1192430274316/target/classes, false }.
[debug] Adding eclipse source dir: { src-main-resources, target/classes, true, false, null,
null }.
[debug] Processing resource dir: src/test/resources
[debug] Making relative and fixing separator: { /var/tmp/EclipsePlugin.unitTest.1192430274316,
/var/tmp/EclipsePlugin.unitTest.1192430274316/target/test-classes, false }.
[debug] Adding eclipse source dir: { src-test-resources, target/test-classes, true, false,
null, null }.
Tests run: 5, Failures: 0, Errors: 0, Skipped: 0, Time elapsed: 0.192 sec
Running org.apache.maven.plugin.eclipse.EclipseToMavenTest
Tests run: 5, Failures: 0, Errors: 0, Skipped: 0, Time elapsed: 0.312 sec
Running org.apache.maven.plugin.eclipse.MakeArtifactsTest
Tests run: 5, Failures: 0, Errors: 0, Skipped: 0, Time elapsed: 0.017 sec

Results :

Tests in error: 
  testProject1(org.apache.maven.plugin.eclipse.RadPluginTest)
  testProject2(org.apache.maven.plugin.eclipse.RadPluginTest)
  testProject3(org.apache.maven.plugin.eclipse.RadPluginTest)
  testProject4(org.apache.maven.plugin.eclipse.RadPluginTest)
  testProject5(org.apache.maven.plugin.eclipse.RadPluginTest)
  testProject5_2(org.apache.maven.plugin.eclipse.RadPluginTest)
  testWorkspace01(org.apache.maven.plugin.eclipse.EclipseWorkspaceTest)
  testWorkspace02(org.apache.maven.plugin.eclipse.EclipseWorkspaceTest)
  testModule1Project(org.apache.maven.plugin.eclipse.EclipsePluginMasterProjectTest)
  testModule1Classpath(org.apache.maven.plugin.eclipse.EclipsePluginMasterProjectTest)
  testModule1Wtpmodules(org.apache.maven.plugin.eclipse.EclipsePluginMasterProjectTest)
  testModule2Project(org.apache.maven.plugin.eclipse.EclipsePluginMasterProjectTest)
  testModule2Classpath(org.apache.maven.plugin.eclipse.EclipsePluginMasterProjectTest)
  testModule2Wtpmodules(org.apache.maven.plugin.eclipse.EclipsePluginMasterProjectTest)
  testProject01(org.apache.maven.plugin.eclipse.EclipsePluginTest)
  testProject02(org.apache.maven.plugin.eclipse.EclipsePluginTest)
  testProject03(org.apache.maven.plugin.eclipse.EclipsePluginTest)
  testProject04(org.apache.maven.plugin.eclipse.EclipsePluginTest)
  testProject05(org.apache.maven.plugin.eclipse.EclipsePluginTest)
  testProject06(org.apache.maven.plugin.eclipse.EclipsePluginTest)
  testProject08(org.apache.maven.plugin.eclipse.EclipsePluginTest)
  testProject09(org.apache.maven.plugin.eclipse.EclipsePluginTest)
  testProject10(org.apache.maven.plugin.eclipse.EclipsePluginTest)
  testProject11(org.apache.maven.plugin.eclipse.EclipsePluginTest)
  testProject12(org.apache.maven.plugin.eclipse.EclipsePluginTest)
  testProject13(org.apache.maven.plugin.eclipse.EclipsePluginTest)
  testProject14(org.apache.maven.plugin.eclipse.EclipsePluginTest)
  testProject15(org.apache.maven.plugin.eclipse.EclipsePluginTest)
  testProject18(org.apache.maven.plugin.eclipse.EclipsePluginTest)
  testProject19(org.apache.maven.plugin.eclipse.EclipsePluginTest)
  testProject20(org.apache.maven.plugin.eclipse.EclipsePluginTest)
  testProject21(org.apache.maven.plugin.eclipse.EclipsePluginTest)
  testProject22(org.apache.maven.plugin.eclipse.EclipsePluginTest)
  testProject23(org.apache.maven.plugin.eclipse.EclipsePluginTest)
  testProject24(org.apache.maven.plugin.eclipse.EclipsePluginTest)
  testProject25(org.apache.maven.plugin.eclipse.EclipsePluginTest)
  testProject26(org.apache.maven.plugin.eclipse.EclipsePluginTest)
  testProject27(org.apache.maven.plugin.eclipse.EclipsePluginTest)
  testProject28(org.apache.maven.plugin.eclipse.EclipsePluginTest)
  testProject29(org.apache.maven.plugin.eclipse.EclipsePluginTest)
  testProject30(org.apache.maven.plugin.eclipse.EclipsePluginTest)
  testProject31(org.apache.maven.plugin.eclipse.EclipsePluginTest)
  testProject32(org.apache.maven.plugin.eclipse.EclipsePluginTest)
  testProject34(org.apache.maven.plugin.eclipse.EclipsePluginTest)

Tests run: 67, Failures: 0, Errors: 44, Skipped: 0

[INFO] ------------------------------------------------------------------------
[ERROR] BUILD FAILURE
[INFO] ------------------------------------------------------------------------
[INFO] There are test failures.
[INFO] ------------------------------------------------------------------------
[INFO] For more information, run Maven with the -e switch
[INFO] ------------------------------------------------------------------------
[INFO] Total time: 5 minutes 22 seconds
[INFO] Finished at: Mon Oct 15 06:37:54 GMT+00:00 2007
[INFO] Final Memory: 25M/49M
[INFO] ------------------------------------------------------------------------

****************************************************************************



Mime
View raw message