maven-notifications mailing list archives

Site index · List index
Message view « Date » · « Thread »
Top « Date » · « Thread »
From "Continuum@maven.zones.apache.org" <contin...@maven.zones.apache.org>
Subject [continuum] BUILD SUCCESSFUL: Maven Artifact
Date Mon, 15 Oct 2007 16:43:11 GMT
Online report : http://maven.zones.apache.org/continuum/buildResult.action?buildId=28117&projectId=442

Build statistics:
  State: Ok
  Previous State: Failed
  Started at: Mon 15 Oct 2007 16:42:50 +0000
  Finished at: Mon 15 Oct 2007 16:43:09 +0000
  Total time: 18s
  Build Trigger: Schedule
  Build Number: 16
  Exit code: 0
  Building machine hostname: maven.zones.apache.org
  Operating system : SunOS(unknown)
  Java Home version : 
          java version "1.4.2_06"
          Java(TM) 2 Runtime Environment, Standard Edition (build 1.4.2_06-b03)
          Java HotSpot(TM) Client VM (build 1.4.2_06-b03, mixed mode)
        
  Builder version :
          Maven version: 2.0.7
          Java version: 1.4.2_06
          OS name: "sunos" version: "5.10" arch: "x86"
    
****************************************************************************
SCM Changes:
****************************************************************************
Changed: jdcasey @ Mon 15 Oct 2007 14:15:13 +0000
Comment: rolling p-c-d version back down to -alpha-32, since this exception improvement from
-alpha-33-snap isn't critical ATM.
Files changed:
  /maven/artifact/trunk/pom.xml ( 584796 )

****************************************************************************
Dependencies Changes:
****************************************************************************
No dependencies changed


****************************************************************************
Build Defintion:
****************************************************************************
POM filename: pom.xml
Goals: clean install   
Arguments: --batch-mode --non-recursive
Build Fresh: false
Always Build: false
Default Build Definition: true
Schedule: DEFAULT_SCHEDULE
Profile Name: j2sdk1.4.2_06
Description: 


****************************************************************************
Test Summary:
****************************************************************************
Tests: 76
Failures: 0
Total time: 3399

****************************************************************************
Output:
****************************************************************************
[INFO] Scanning for projects...
[INFO] ----------------------------------------------------------------------------
[INFO] Building Maven Artifact
[INFO]    task-segment: [clean, install]
[INFO] ----------------------------------------------------------------------------
[INFO] [clean:clean]
[INFO] Deleting directory /export/home/build/data/continuum/checkouts/442/target
[INFO] Deleting directory /export/home/build/data/continuum/checkouts/442/target/classes
[INFO] Deleting directory /export/home/build/data/continuum/checkouts/442/target/test-classes
[INFO] Deleting directory /export/home/build/data/continuum/checkouts/442/target/site
[INFO] [modello:java {execution: standard}]
[INFO] outputDirectory: /export/home/build/data/continuum/checkouts/442/target/generated-sources/modello
[INFO] Generating current version: 1.0.0
[INFO] [modello:xpp3-reader {execution: standard}]
[INFO] outputDirectory: /export/home/build/data/continuum/checkouts/442/target/generated-sources/modello
[INFO] Generating current version: 1.0.0
[INFO] [modello:xpp3-writer {execution: standard}]
[INFO] outputDirectory: /export/home/build/data/continuum/checkouts/442/target/generated-sources/modello
[INFO] Generating current version: 1.0.0
[INFO] [resources:resources]
[INFO] Using default encoding to copy filtered resources.
[INFO] Copying 1 resource
[INFO] [compiler:compile]
[INFO] Compiling 103 source files to /export/home/build/data/continuum/checkouts/442/target/classes
[INFO] [resources:testResources]
[INFO] Using default encoding to copy filtered resources.
[INFO] Copying 6 resources
[INFO] [compiler:testCompile]
[INFO] Compiling 24 source files to /export/home/build/data/continuum/checkouts/442/target/test-classes
[INFO] [surefire:test]
[INFO] Surefire report directory: /export/home/build/data/continuum/checkouts/442/target/surefire-reports

-------------------------------------------------------
 T E S T S
-------------------------------------------------------
Running org.apache.maven.artifact.DefaultArtifactTest
Tests run: 9, Failures: 0, Errors: 0, Skipped: 0, Time elapsed: 0.061 sec
Running org.apache.maven.artifact.factory.DefaultArtifactFactoryTest
Tests run: 1, Failures: 0, Errors: 0, Skipped: 0, Time elapsed: 0.37 sec
Running org.apache.maven.artifact.manager.DefaultWagonManagerTest
[WARNING] Component manager not found for returned component. Ignored. component=org.codehaus.plexus.component.configurator.BasicComponentConfigurator@23e5d1
[WARNING] Component manager not found for returned component. Ignored. component=org.codehaus.plexus.component.configurator.BasicComponentConfigurator@11e1e67
[WARNING] Component manager not found for returned component. Ignored. component=org.codehaus.plexus.component.configurator.BasicComponentConfigurator@b8c8e6
[WARNING] Component manager not found for returned component. Ignored. component=org.codehaus.plexus.component.configurator.BasicComponentConfigurator@10ab323
Uploading: path to noop://url


Transfer finished. 0 bytes copied in 0.0 seconds
Tests run: 4, Failures: 0, Errors: 0, Skipped: 0, Time elapsed: 0.523 sec
Running org.apache.maven.artifact.repository.metadata.AbstractRepositoryMetadataTest
Tests run: 2, Failures: 0, Errors: 0, Skipped: 0, Time elapsed: 0.095 sec
Running org.apache.maven.artifact.resolver.DefaultArtifactCollectorTest
Tests run: 27, Failures: 0, Errors: 0, Skipped: 0, Time elapsed: 1.495 sec
Running org.apache.maven.artifact.deployer.ArtifactDeployerTest
[INFO] Retrieving previous metadata from test
[INFO] Uploading repository metadata for: 'artifact org.apache.maven:artifact'
Tests run: 1, Failures: 0, Errors: 0, Skipped: 0, Time elapsed: 0.1 sec
Running org.apache.maven.artifact.resolver.conflict.NewestConflictResolverTest
Tests run: 4, Failures: 0, Errors: 0, Skipped: 0, Time elapsed: 0.154 sec
Running org.apache.maven.artifact.installer.ArtifactInstallerTest
[INFO] Installing /export/home/build/data/continuum/checkouts/442/src/test/resources/artifact-install/artifact-1.0.jar
to /export/home/build/data/continuum/checkouts/442/target/test-classes/repositories/installer/local-repository/org.apache.maven/jars/artifact-1.0.jar
Tests run: 1, Failures: 0, Errors: 0, Skipped: 0, Time elapsed: 0.041 sec
Running org.apache.maven.artifact.resolver.conflict.FarthestConflictResolverTest
Tests run: 4, Failures: 0, Errors: 0, Skipped: 0, Time elapsed: 0.145 sec
Running org.apache.maven.artifact.resolver.conflict.NearestConflictResolverTest
Tests run: 4, Failures: 0, Errors: 0, Skipped: 0, Time elapsed: 0.145 sec
Running org.apache.maven.artifact.versioning.VersionRangeTest
Tests run: 5, Failures: 0, Errors: 0, Skipped: 0, Time elapsed: 0.008 sec
Running org.apache.maven.artifact.resolver.ArtifactResolverTest
[WARNING] *** CHECKSUM FAILED - Error retrieving checksum file for org.apache.maven/jars/b-1.0.jar
- IGNORING
[WARNING] *** CHECKSUM FAILED - Error retrieving checksum file for org.apache.maven/jars/i-1.0.jar
- IGNORING
[WARNING] *** CHECKSUM FAILED - Error retrieving checksum file for org.apache.maven/jars/j-1.0.jar
- IGNORING
[WARNING] *** CHECKSUM FAILED - Error retrieving checksum file for org.apache.maven/jars/l-1.0.jar
- IGNORING
Tests run: 6, Failures: 0, Errors: 0, Skipped: 0, Time elapsed: 0.248 sec
Running org.apache.maven.artifact.resolver.conflict.OldestConflictResolverTest
Tests run: 4, Failures: 0, Errors: 0, Skipped: 0, Time elapsed: 0.145 sec
Running org.apache.maven.artifact.versioning.DefaultArtifactVersionTest
Tests run: 4, Failures: 0, Errors: 0, Skipped: 0, Time elapsed: 0.011 sec

Results :

Tests run: 76, Failures: 0, Errors: 0, Skipped: 0

[INFO] [jar:jar]
[INFO] Building jar: /export/home/build/data/continuum/checkouts/442/target/maven-artifact-3.0-SNAPSHOT.jar
[INFO] [install:install]
[INFO] Installing /export/home/build/data/continuum/checkouts/442/target/maven-artifact-3.0-SNAPSHOT.jar
to /export/home/build/.m2/repository/org/apache/maven/artifact/maven-artifact/3.0-SNAPSHOT/maven-artifact-3.0-SNAPSHOT.jar
[INFO] ------------------------------------------------------------------------
[INFO] BUILD SUCCESSFUL
[INFO] ------------------------------------------------------------------------
[INFO] Total time: 17 seconds
[INFO] Finished at: Mon Oct 15 16:43:09 GMT+00:00 2007
[INFO] Final Memory: 12M/22M
[INFO] ------------------------------------------------------------------------

****************************************************************************



Mime
View raw message