maven-notifications mailing list archives

Site index · List index
Message view « Date » · « Thread »
Top « Date » · « Thread »
From "Continuum@maven.zones.apache.org" <contin...@maven.zones.apache.org>
Subject [continuum] BUILD FAILURE: Archiva Web :: Application
Date Mon, 22 Oct 2007 13:22:14 GMT
Online report : http://maven.zones.apache.org/continuum/buildResult.action?buildId=29719&projectId=296

Build statistics:
  State: Failed
  Previous State: Ok
  Started at: Mon 22 Oct 2007 13:21:56 +0000
  Finished at: Mon 22 Oct 2007 13:22:11 +0000
  Total time: 14s
  Build Trigger: Schedule
  Build Number: 142
  Exit code: 1
  Building machine hostname: maven.zones.apache.org
  Operating system : SunOS(unknown)
  Java Home version : 
          java version "1.5.0_13"
          Java(TM) 2 Runtime Environment, Standard Edition (build 1.5.0_13-b05)
          Java HotSpot(TM) Server VM (build 1.5.0_13-b05, mixed mode)
        
  Builder version :
          Maven version: 2.0.7
          Java version: 1.5.0_13
          OS name: "sunos" version: "5.10" arch: "x86"
    
****************************************************************************
SCM Changes:
****************************************************************************
Changed: brett @ Mon 22 Oct 2007 13:02:47 +0000
Comment: [MRM-559] fix version setting
Files changed:
  /maven/archiva/trunk/archiva-web/archiva-webapp/src/main/java/org/apache/maven/archiva/web/startup/ArchivaVersion.java
( 587079 )
  /maven/archiva/trunk/archiva-web/archiva-webapp/src/main/webapp/WEB-INF/jsp/decorators/default.jsp
( 587079 )

****************************************************************************
Dependencies Changes:
****************************************************************************
org.apache.maven.archiva:archiva-report-manager:1.0-beta-4-SNAPSHOT

org.apache.maven.archiva:archiva-scheduled:1.0-beta-4-SNAPSHOT

org.apache.maven.archiva:archiva-indexer:1.0-beta-4-SNAPSHOT

org.apache.maven.archiva:archiva-proxy:1.0-beta-4-SNAPSHOT

org.apache.maven.archiva:archiva-database:1.0-beta-4-SNAPSHOT

org.apache.maven.archiva:archiva-repository-layer:1.0-beta-4-SNAPSHOT

org.apache.maven.archiva:archiva-security:1.0-beta-4-SNAPSHOT

org.apache.maven.archiva:archiva-core-consumers:1.0-beta-4-SNAPSHOT

org.apache.maven.archiva:archiva-database-consumers:1.0-beta-4-SNAPSHOT

org.apache.maven.archiva:archiva-lucene-consumers:1.0-beta-4-SNAPSHOT

org.apache.maven.archiva:archiva-signature-consumers:1.0-beta-4-SNAPSHOT

org.apache.maven.archiva:archiva-applet:1.0-beta-4-SNAPSHOT

org.apache.maven.archiva:archiva-web:1.0-beta-4-SNAPSHOT


****************************************************************************
Build Defintion:
****************************************************************************
POM filename: pom.xml
Goals: clean install   
Arguments: --batch-mode --non-recursive
Build Fresh: false
Always Build: false
Default Build Definition: true
Schedule: DEFAULT_SCHEDULE
Description: 


****************************************************************************
Test Summary:
****************************************************************************
Tests: 0
Failures: 0
Total time: 0

****************************************************************************
Output:
****************************************************************************
[INFO] Scanning for projects...
[INFO] ----------------------------------------------------------------------------
[INFO] Building Archiva Web :: Application
[INFO]    task-segment: [clean, install]
[INFO] ----------------------------------------------------------------------------
[INFO] [clean:clean]
[INFO] Deleting directory /export/home/build/data/continuum/checkouts/296/target
[INFO] Deleting directory /export/home/build/data/continuum/checkouts/296/target/classes
[INFO] Deleting directory /export/home/build/data/continuum/checkouts/296/target/test-classes
[INFO] Deleting directory /export/home/build/data/continuum/checkouts/296/target/site
[INFO] Deleting file-set: /export/home/build/data/continuum/checkouts/296/src/main/webapp
(included: [META-INF, images/redback, template/redback, WEB-INF/classes, WEB-INF/lib, WEB-INF/database,
WEB-INF/logs, redback, css/redback, WEB-INF/jsp/redback, WEB-INF/template/redback, WEB-INF/logs,
WEB-INF/temp, WEB-INF/jasperreports], excluded: [])
[INFO] [plexus:descriptor {execution: generate}]
[INFO] Setting property: classpath.resource.loader.class => 'org.codehaus.plexus.velocity.ContextClassLoaderResourceLoader'.
[INFO] Setting property: velocimacro.messages.on => 'false'.
[INFO] Setting property: resource.loader => 'classpath'.
[INFO] Setting property: resource.manager.logwhenfound => 'false'.
[INFO] [remote-resources:process {execution: default}]
[INFO] [antrun:run {execution: default}]
[INFO] Executing tasks
     [copy] Copying 3 files to /export/home/build/data/continuum/checkouts/296/target/appserver-base
[INFO] Executed tasks
[INFO] [resources:resources]
[INFO] Using default encoding to copy filtered resources.
[INFO] Copying 24 resources
[INFO] Copying 1 resource
[INFO] Copying 2 resources
[INFO] [dependency:copy {execution: copy}]
[INFO] Configured Artifact: org.apache.maven.archiva:archiva-applet:null:1.0-beta-4-SNAPSHOT:jar
[INFO] archiva-applet-1.0-beta-4-SNAPSHOT.jar already exists.
[INFO] [compiler:compile]
[INFO] Compiling 62 source files to /export/home/build/data/continuum/checkouts/296/target/classes
[INFO] ------------------------------------------------------------------------
[ERROR] BUILD FAILURE
[INFO] ------------------------------------------------------------------------
[INFO] Compilation failure
/export/home/build/data/continuum/checkouts/296/src/main/java/org/apache/maven/archiva/web/startup/ArchivaVersion.java:[91,31]
non-static variable this cannot be referenced from a static context



/export/home/build/data/continuum/checkouts/296/src/main/java/org/apache/maven/archiva/web/startup/ArchivaVersion.java:[91,31]
non-static variable this cannot be referenced from a static context


[INFO] ------------------------------------------------------------------------
[INFO] For more information, run Maven with the -e switch
[INFO] ------------------------------------------------------------------------
[INFO] Total time: 12 seconds
[INFO] Finished at: Mon Oct 22 13:22:11 GMT+00:00 2007
[INFO] Final Memory: 26M/306M
[INFO] ------------------------------------------------------------------------

****************************************************************************



Mime
View raw message