maven-notifications mailing list archives

Site index · List index
Message view « Date » · « Thread »
Top « Date » · « Thread »
From "Continuum@maven.zones.apache.org" <contin...@maven.zones.apache.org>
Subject [continuum] BUILD FAILURE: Doxia Document Renderer Component
Date Thu, 11 Oct 2007 13:24:39 GMT
Online report : http://maven.zones.apache.org/continuum/buildResult.action?buildId=27435&projectId=331

Build statistics:
  State: Failed
  Previous State: Failed
  Started at: Thu 11 Oct 2007 13:24:20 +0000
  Finished at: Thu 11 Oct 2007 13:24:37 +0000
  Total time: 17s
  Build Trigger: Schedule
  Build Number: 89
  Exit code: 1
  Building machine hostname: maven.zones.apache.org
  Operating system : SunOS(unknown)
  Java Home version : 
          java version "1.4.2_06"
          Java(TM) 2 Runtime Environment, Standard Edition (build 1.4.2_06-b03)
          Java HotSpot(TM) Client VM (build 1.4.2_06-b03, mixed mode)
        
  Builder version :
          Maven version: 2.0.7
          Java version: 1.4.2_06
          OS name: "sunos" version: "5.10" arch: "x86"
    
****************************************************************************
SCM Changes:
****************************************************************************
No files changed

****************************************************************************
Dependencies Changes:
****************************************************************************
org.apache.maven.doxia:doxia-core:1.0-beta-1-SNAPSHOT

org.apache.maven.doxia:doxia-sink-api:1.0-beta-1-SNAPSHOT

org.apache.maven.doxia:doxia-module-itext:1.0-beta-1-SNAPSHOT

org.apache.maven.doxia:doxia-module-apt:1.0-beta-1-SNAPSHOT

org.apache.maven.doxia:doxia-module-fml:1.0-beta-1-SNAPSHOT

org.apache.maven.doxia:doxia-module-xdoc:1.0-beta-1-SNAPSHOT

org.apache.maven.doxia:doxia-module-xhtml:1.0-beta-1-SNAPSHOT


****************************************************************************
Build Defintion:
****************************************************************************
POM filename: pom.xml
Goals: clean install   
Arguments: --batch-mode --non-recursive
Build Fresh: false
Always Build: false
Default Build Definition: true
Schedule: DEFAULT_SCHEDULE
Profile Name: j2sdk1.4.2_06
Description: 


****************************************************************************
Test Summary:
****************************************************************************
Tests: 2
Failures: 2
Total time: 1607

****************************************************************************
Output:
****************************************************************************
[INFO] Scanning for projects...
[INFO] ----------------------------------------------------------------------------
[INFO] Building Doxia Document Renderer Component
[INFO]    task-segment: [clean, install]
[INFO] ----------------------------------------------------------------------------
[INFO] [clean:clean]
[INFO] Deleting directory /export/home/build/data/continuum/checkouts/331/target
[INFO] Deleting directory /export/home/build/data/continuum/checkouts/331/target/classes
[INFO] Deleting directory /export/home/build/data/continuum/checkouts/331/target/test-classes
[INFO] Deleting directory /export/home/build/data/continuum/checkouts/331/target/site
[INFO] [modello:xpp3-writer {execution: default}]
[INFO] outputDirectory: /export/home/build/data/continuum/checkouts/331/target/generated-sources/modello
[INFO] Generating current version: 1.0.0
[INFO] [modello:java {execution: default}]
[INFO] outputDirectory: /export/home/build/data/continuum/checkouts/331/target/generated-sources/modello
[INFO] Generating current version: 1.0.0
[INFO] [modello:xpp3-reader {execution: default}]
[INFO] outputDirectory: /export/home/build/data/continuum/checkouts/331/target/generated-sources/modello
[INFO] Generating current version: 1.0.0
[INFO] [modello:xsd {execution: default}]
[INFO] outputDirectory: /export/home/build/data/continuum/checkouts/331/target/generated-site/xsd
[INFO] Generating current version: 1.0.0
[INFO] Setting property: classpath.resource.loader.class => 'org.codehaus.plexus.velocity.ContextClassLoaderResourceLoader'.
[INFO] Setting property: velocimacro.messages.on => 'false'.
[INFO] Setting property: resource.loader => 'classpath'.
[INFO] Setting property: resource.manager.logwhenfound => 'false'.
[INFO] [remote-resources:process {execution: default}]
[INFO] [resources:resources]
[INFO] Using default encoding to copy filtered resources.
[INFO] [compiler:compile]
[INFO] Compiling 19 source files to /export/home/build/data/continuum/checkouts/331/target/classes
[INFO] [resources:testResources]
[INFO] Using default encoding to copy filtered resources.
[INFO] [compiler:testCompile]
[INFO] Compiling 1 source file to /export/home/build/data/continuum/checkouts/331/target/test-classes
[INFO] [surefire:test]
[INFO] Surefire report directory: /export/home/build/data/continuum/checkouts/331/target/surefire-reports

-------------------------------------------------------
 T E S T S
-------------------------------------------------------
Running org.apache.maven.doxia.docrenderer.itext.DefaultPdfRendererTest
[INFO] No TOC is defined in the document descriptor. Merging all documents.
Tests run: 2, Failures: 0, Errors: 2, Skipped: 0, Time elapsed: 1.633 sec <<< FAILURE!

Results :

Tests in error: 
  testRenderFileFile(org.apache.maven.doxia.docrenderer.itext.DefaultPdfRendererTest)
  testRenderFileFileFile(org.apache.maven.doxia.docrenderer.itext.DefaultPdfRendererTest)

Tests run: 2, Failures: 0, Errors: 2, Skipped: 0

[INFO] ------------------------------------------------------------------------
[ERROR] BUILD FAILURE
[INFO] ------------------------------------------------------------------------
[INFO] There are test failures.
[INFO] ------------------------------------------------------------------------
[INFO] For more information, run Maven with the -e switch
[INFO] ------------------------------------------------------------------------
[INFO] Total time: 15 seconds
[INFO] Finished at: Thu Oct 11 13:24:37 GMT+00:00 2007
[INFO] Final Memory: 16M/33M
[INFO] ------------------------------------------------------------------------

****************************************************************************



Mime
View raw message