maven-notifications mailing list archives

Site index · List index
Message view « Date » · « Thread »
Top « Date » · « Thread »
From "Continuum@maven.zones.apache.org" <contin...@maven.zones.apache.org>
Subject [continuum] BUILD FAILURE: Maven Dependency Analyzer
Date Thu, 11 Oct 2007 20:07:41 GMT
Online report : http://maven.zones.apache.org/continuum/buildResult.action?buildId=27599&projectId=398

Build statistics:
  State: Failed
  Previous State: Ok
  Started at: Thu 11 Oct 2007 20:07:06 +0000
  Finished at: Thu 11 Oct 2007 20:07:39 +0000
  Total time: 33s
  Build Trigger: Schedule
  Build Number: 12
  Exit code: 1
  Building machine hostname: maven.zones.apache.org
  Operating system : SunOS(unknown)
  Java Home version : 
          java version "1.4.2_06"
          Java(TM) 2 Runtime Environment, Standard Edition (build 1.4.2_06-b03)
          Java HotSpot(TM) Client VM (build 1.4.2_06-b03, mixed mode)
        
  Builder version :
          Maven version: 2.0.7
          Java version: 1.4.2_06
          OS name: "sunos" version: "5.10" arch: "x86"
    
****************************************************************************
SCM Changes:
****************************************************************************
Changed: markh @ Thu 11 Oct 2007 19:58:56 +0000
Comment: Correct header and format source
Files changed:
  /maven/shared/trunk/maven-dependency-analyzer/src/test/java/org/apache/maven/shared/dependency/analyzer/DefaultProjectDependencyAnalyzerTest.java
( 583939 )

****************************************************************************
Dependencies Changes:
****************************************************************************
No dependencies changed


****************************************************************************
Build Defintion:
****************************************************************************
POM filename: pom.xml
Goals: clean install   
Arguments: --batch-mode --non-recursive
Build Fresh: false
Always Build: false
Default Build Definition: true
Schedule: DEFAULT_SCHEDULE
Profile Name: j2sdk1.4.2_06
Description: 


****************************************************************************
Test Summary:
****************************************************************************
Tests: 88
Failures: 4
Total time: 1000

****************************************************************************
Output:
****************************************************************************
[INFO] Scanning for projects...
[INFO] ----------------------------------------------------------------------------
[INFO] Building Maven Dependency Analyzer
[INFO]    task-segment: [clean, install]
[INFO] ----------------------------------------------------------------------------
[INFO] [clean:clean]
[INFO] Deleting directory /export/home/build/data/continuum/checkouts/398/target
[INFO] Deleting directory /export/home/build/data/continuum/checkouts/398/target/classes
[INFO] Deleting directory /export/home/build/data/continuum/checkouts/398/target/test-classes
[INFO] Deleting directory /export/home/build/data/continuum/checkouts/398/target/site
[INFO] [plexus:descriptor {execution: default}]
[INFO] [resources:resources]
[INFO] Using default encoding to copy filtered resources.
[INFO] snapshot org.apache.maven.shared:maven-plugin-testing-tools:1.0-alpha-3-SNAPSHOT: checking
for updates from apache.snapshots
[INFO] snapshot org.apache.maven.shared:maven-invoker:2.0.7-SNAPSHOT: checking for updates
from apache.snapshots
[INFO] [compiler:compile]
[INFO] Compiling 13 source files to /export/home/build/data/continuum/checkouts/398/target/classes
[INFO] [resources:testResources]
[INFO] Using default encoding to copy filtered resources.
[INFO] [compiler:testCompile]
[INFO] Compiling 10 source files to /export/home/build/data/continuum/checkouts/398/target/test-classes
[INFO] [surefire:test]
[INFO] Surefire report directory: /export/home/build/data/continuum/checkouts/398/target/surefire-reports

-------------------------------------------------------
 T E S T S
-------------------------------------------------------
Running org.apache.maven.shared.dependency.analyzer.CollectorClassFileVisitorTest
Tests run: 1, Failures: 0, Errors: 0, Skipped: 0, Time elapsed: 0.051 sec
Running org.apache.maven.shared.dependency.analyzer.DefaultProjectDependencyAnalyzerTest
Tests run: 4, Failures: 0, Errors: 4, Skipped: 0, Time elapsed: 0.837 sec <<< FAILURE!
Running org.apache.maven.shared.dependency.analyzer.ProjectDependencyAnalyzerExceptionTest
Tests run: 2, Failures: 0, Errors: 0, Skipped: 0, Time elapsed: 0.023 sec
Running org.apache.maven.shared.dependency.analyzer.asm.DependencyVisitorTest
Tests run: 73, Failures: 0, Errors: 0, Skipped: 0, Time elapsed: 0.054 sec
Running org.apache.maven.shared.dependency.analyzer.DefaultClassAnalyzerTest
Tests run: 1, Failures: 0, Errors: 0, Skipped: 0, Time elapsed: 0.015 sec
Running org.apache.maven.shared.dependency.analyzer.ProjectDependencyAnalysisTest
Tests run: 1, Failures: 0, Errors: 0, Skipped: 0, Time elapsed: 0.007 sec
Running org.apache.maven.shared.dependency.analyzer.ClassFileVisitorUtilsTest
Tests run: 6, Failures: 0, Errors: 0, Skipped: 0, Time elapsed: 0.075 sec

Results :

Tests in error: 
  testPom(org.apache.maven.shared.dependency.analyzer.DefaultProjectDependencyAnalyzerTest)
  testJarWithNoDependencies(org.apache.maven.shared.dependency.analyzer.DefaultProjectDependencyAnalyzerTest)
  testJarWithCompileDependency(org.apache.maven.shared.dependency.analyzer.DefaultProjectDependencyAnalyzerTest)
  testJarWithTestDependency(org.apache.maven.shared.dependency.analyzer.DefaultProjectDependencyAnalyzerTest)

Tests run: 88, Failures: 0, Errors: 4, Skipped: 0

[INFO] ------------------------------------------------------------------------
[ERROR] BUILD FAILURE
[INFO] ------------------------------------------------------------------------
[INFO] There are test failures.
[INFO] ------------------------------------------------------------------------
[INFO] For more information, run Maven with the -e switch
[INFO] ------------------------------------------------------------------------
[INFO] Total time: 27 seconds
[INFO] Finished at: Thu Oct 11 20:07:39 GMT+00:00 2007
[INFO] Final Memory: 9M/20M
[INFO] ------------------------------------------------------------------------

****************************************************************************



Mime
View raw message