maven-notifications mailing list archives

Site index · List index
Message view « Date » · « Thread »
Top « Date » · « Thread »
From "Continuum@maven.zones.apache.org" <contin...@maven.zones.apache.org>
Subject [continuum] BUILD FAILURE: Maven Project Builder
Date Wed, 17 Oct 2007 01:55:02 GMT
Online report : http://maven.zones.apache.org/continuum/buildResult.action?buildId=28520&projectId=464

Build statistics:
  State: Failed
  Previous State: Ok
  Started at: Wed 17 Oct 2007 01:54:36 +0000
  Finished at: Wed 17 Oct 2007 01:54:59 +0000
  Total time: 22s
  Build Trigger: Schedule
  Build Number: 21
  Exit code: 1
  Building machine hostname: maven.zones.apache.org
  Operating system : SunOS(unknown)
  Java Home version : 
          java version "1.4.2_06"
          Java(TM) 2 Runtime Environment, Standard Edition (build 1.4.2_06-b03)
          Java HotSpot(TM) Client VM (build 1.4.2_06-b03, mixed mode)
        
  Builder version :
          Maven version: 2.0.7
          Java version: 1.4.2_06
          OS name: "sunos" version: "5.10" arch: "x86"
    
****************************************************************************
SCM Changes:
****************************************************************************
Changed: brianf @ Wed 17 Oct 2007 00:49:21 +0000
Comment: MNG2045 applying patch from Paul Gier to fix test jar dependencies from sibling projects.
Files changed:
  /maven/components/branches/maven-2.0.x/maven-project/src/main/java/org/apache/maven/project/MavenProject.java
( 585307 )

Changed: brianf @ Wed 17 Oct 2007 01:40:02 +0000
Comment: MNG2025 patch to add encoding unit tests
Files changed:
  /maven/components/branches/maven-2.0.x/maven-project/src/test/java/org/apache/maven/project/MavenProjectTest.java
( 585319 )
  /maven/components/branches/maven-2.0.x/maven-project/src/test/resources/iso-8859-15-encoded-pom.xml
( 585319 )
  /maven/components/branches/maven-2.0.x/maven-project/src/test/resources/utf-8-encoded-pom.xml
( 585319 )

****************************************************************************
Dependencies Changes:
****************************************************************************
org.apache.maven:maven-settings:2.0.8-SNAPSHOT

org.apache.maven:maven-artifact-test:2.0.8-SNAPSHOT

org.apache.maven:maven-profile:2.0.8-SNAPSHOT

org.apache.maven:maven-model:2.0.8-SNAPSHOT

org.apache.maven:maven-artifact-manager:2.0.8-SNAPSHOT

org.apache.maven:maven-plugin-registry:2.0.8-SNAPSHOT

org.apache.maven:maven-artifact:2.0.8-SNAPSHOT

org.apache.maven:maven:2.0.8-SNAPSHOT


****************************************************************************
Build Defintion:
****************************************************************************
POM filename: pom.xml
Goals: clean install   
Arguments: --batch-mode --non-recursive
Build Fresh: false
Always Build: false
Default Build Definition: true
Schedule: DEFAULT_SCHEDULE
Profile Name: j2sdk1.4.2_06
Description: 


****************************************************************************
Test Summary:
****************************************************************************
Tests: 121
Failures: 2
Total time: 4272

****************************************************************************
Output:
****************************************************************************
[INFO] Scanning for projects...
[INFO] ----------------------------------------------------------------------------
[INFO] Building Maven Project Builder
[INFO]    task-segment: [clean, install]
[INFO] ----------------------------------------------------------------------------
[INFO] [clean:clean]
[INFO] Deleting directory /export/home/build/data/continuum/checkouts/464/target
[INFO] Deleting directory /export/home/build/data/continuum/checkouts/464/target/classes
[INFO] Deleting directory /export/home/build/data/continuum/checkouts/464/target/test-classes
[INFO] Deleting directory /export/home/build/data/continuum/checkouts/464/target/site
[INFO] [resources:resources]
[INFO] Using default encoding to copy filtered resources.
[INFO] Copying 2 resources
[INFO] snapshot org.apache.maven:maven-artifact-test:2.0.8-SNAPSHOT: checking for updates
from apache.snapshots
[INFO] snapshot org.apache.maven:maven-profile:2.0.8-SNAPSHOT: checking for updates from apache.snapshots
[INFO] snapshot org.apache.maven:maven-plugin-registry:2.0.8-SNAPSHOT: checking for updates
from apache.snapshots
[INFO] [compiler:compile]
[INFO] Compiling 42 source files to /export/home/build/data/continuum/checkouts/464/target/classes
[INFO] [resources:testResources]
[INFO] Using default encoding to copy filtered resources.
[INFO] Copying 173 resources
[INFO] [compiler:testCompile]
[INFO] Compiling 31 source files to /export/home/build/data/continuum/checkouts/464/target/test-classes
[INFO] [surefire:test]
[INFO] Surefire report directory: /export/home/build/data/continuum/checkouts/464/target/surefire-reports

-------------------------------------------------------
 T E S T S
-------------------------------------------------------
Running org.apache.maven.project.inheritance.t04.ProjectInheritanceTest
Artifact: maven-test:maven-test-c:jar 1.0 Optional=false
Artifact: maven-test:maven-test-a:jar 1.0 Optional=false
Artifact: maven-test:maven-test-b:jar 1.0 Optional=false
Tests run: 1, Failures: 0, Errors: 0, Skipped: 0, Time elapsed: 0.597 sec
Running org.apache.maven.project.canonical.CanonicalProjectBuilderTest
Tests run: 1, Failures: 0, Errors: 0, Skipped: 0, Time elapsed: 0.127 sec
Running org.apache.maven.project.MavenProjectTest
Tests run: 9, Failures: 2, Errors: 0, Skipped: 0, Time elapsed: 0.708 sec <<< FAILURE!
Running org.apache.maven.project.ProjectBaseDirectoryAlignmentTest
Tests run: 1, Failures: 0, Errors: 0, Skipped: 0, Time elapsed: 0.068 sec
Running org.apache.maven.project.inheritance.t11.ProjectInheritanceTest
Tests run: 1, Failures: 0, Errors: 0, Skipped: 0, Time elapsed: 0.061 sec
Running org.apache.maven.project.inheritance.t02.ProjectInheritanceTest
Local repository is at: /export/home/build/data/continuum/checkouts/464/src/test/resources/inheritance-repo/t02
Location of project-4's POM: /export/home/build/data/continuum/checkouts/464/src/test/resources/inheritance-repo/t02/p0/p1/p2/p3/p4/pom.xml
Tests run: 1, Failures: 0, Errors: 0, Skipped: 0, Time elapsed: 0.188 sec
Running org.apache.maven.project.interpolation.RegexBasedModelInterpolatorTest
Tests run: 11, Failures: 0, Errors: 0, Skipped: 0, Time elapsed: 0.203 sec
Running org.apache.maven.project.inheritance.t06.ProjectInheritanceTest
Project maven:p1:pom:1.0 org.apache.maven.project.MavenProject@9cea71d
Artifact: maven-test:maven-test-a:jar 1.0 Optional=false
Artifact: maven-test:maven-test-c:jar 1.0 Optional=false
Artifact: maven-test:maven-test-d:jar 1.0 Optional=false
Artifact: maven-test:maven-test-b:jar 1.0 Optional=false
Tests run: 1, Failures: 0, Errors: 0, Skipped: 0, Time elapsed: 0.11 sec
Running org.apache.maven.project.ProjectClasspathTest
Tests run: 1, Failures: 0, Errors: 0, Skipped: 0, Time elapsed: 0.085 sec
Running org.apache.maven.project.inheritance.t00.ProjectInheritanceTest
Tests run: 1, Failures: 0, Errors: 0, Skipped: 0, Time elapsed: 0.077 sec
Running org.apache.maven.project.validation.DefaultModelValidatorTest
Tests run: 16, Failures: 0, Errors: 0, Skipped: 0, Time elapsed: 0.918 sec
Running org.apache.maven.project.inheritance.t01.ProjectInheritanceTest
Tests run: 1, Failures: 0, Errors: 0, Skipped: 0, Time elapsed: 0.078 sec
Running org.apache.maven.project.inheritance.t07.ProjectInheritanceTest
Project maven:p1:pom:1.0 org.apache.maven.project.MavenProject@9cea71d
Artifact: maven-test:maven-test-c:jar 1.0 Optional=false
Artifact: maven-test:maven-test-a:jar 1.0 Optional=false
Artifact: maven-test:maven-test-b:jar 1.0 Optional=false
Tests run: 1, Failures: 0, Errors: 0, Skipped: 0, Time elapsed: 0.139 sec
Running org.apache.maven.project.inheritance.t05.ProjectInheritanceTest
Artifact: maven-test:maven-test-c:jar 1.0 Scope: runtime
Artifact: maven-test:maven-test-a:jar 1.0 Scope: runtime
Artifact: maven-test:maven-test-d:jar 1.0 Scope: runtime
Artifact: maven-test:maven-test-b:jar 1.0 Scope: runtime
Tests run: 1, Failures: 0, Errors: 0, Skipped: 0, Time elapsed: 0.114 sec
Running org.apache.maven.project.injection.TestProfileInjector
Tests run: 0, Failures: 0, Errors: 0, Skipped: 0, Time elapsed: 0.002 sec
Running org.apache.maven.project.artifact.MavenMetadataSourceTest
Tests run: 3, Failures: 0, Errors: 0, Skipped: 0, Time elapsed: 0.099 sec
Running org.apache.maven.project.TestArtifactResolver
Tests run: 0, Failures: 0, Errors: 0, Skipped: 0, Time elapsed: 0.001 sec
Running org.apache.maven.project.injection.DefaultProfileInjectorTest
Tests run: 6, Failures: 0, Errors: 0, Skipped: 0, Time elapsed: 0.01 sec
Running org.apache.maven.project.inheritance.t08.ProjectInheritanceTest
Project maven:p1:pom:1.0 org.apache.maven.project.MavenProject@9cea71d
Artifact: maven-test:maven-test-a:jar 1.0 Optional=false
Artifact: maven-test:maven-test-c:jar 1.0 Optional=false
Artifact: maven-test:maven-test-d:jar 1.0 Optional=false
Artifact: maven-test:maven-test-b:jar 1.0 Optional=false
Tests run: 1, Failures: 0, Errors: 0, Skipped: 0, Time elapsed: 0.106 sec
Running org.apache.maven.project.inheritance.t03.ProjectInheritanceTest
Tests run: 1, Failures: 0, Errors: 0, Skipped: 0, Time elapsed: 0.059 sec
Running org.apache.maven.project.inheritance.DefaultModelInheritanceAssemblerTest
http://www.google.com/child
http://www.google.com/bottom
Resulting path is: '/file-management'
Resulting path is: 'http://maven.apache.org/shared/file-management'
Resulting path is: 'http://maven.apache.org/shared/file-management'
Tests run: 26, Failures: 0, Errors: 0, Skipped: 0, Time elapsed: 0.024 sec
Running org.apache.maven.profiles.DefaultProfileManagerTest
Tests run: 6, Failures: 0, Errors: 0, Skipped: 0, Time elapsed: 0.181 sec
Running org.apache.maven.project.DefaultMavenProjectBuilderTest
Tests run: 3, Failures: 0, Errors: 0, Skipped: 0, Time elapsed: 0.239 sec
Running org.apache.maven.project.injection.DefaultModelDefaultsInjectorTest
Tests run: 11, Failures: 0, Errors: 0, Skipped: 0, Time elapsed: 0.009 sec
Running org.apache.maven.project.inheritance.t10.ProjectInheritanceTest
Project maven:p1:pom:1.0 org.apache.maven.project.MavenProject@9cea71d
Tests run: 1, Failures: 0, Errors: 0, Skipped: 0, Time elapsed: 0.08 sec
Running org.apache.maven.project.ModelUtilsTest
Tests run: 9, Failures: 0, Errors: 0, Skipped: 0, Time elapsed: 0.008 sec
Running org.apache.maven.project.TestProjectBuilder
Tests run: 0, Failures: 0, Errors: 0, Skipped: 0, Time elapsed: 0.002 sec
Running org.apache.maven.project.ProjectSorterTest
Tests run: 5, Failures: 0, Errors: 0, Skipped: 0, Time elapsed: 0.012 sec
Running org.apache.maven.project.inheritance.t09.ProjectInheritanceTest
Project maven:p1:pom:1.0 org.apache.maven.project.MavenProject@9cea71d
Project maven:p2:pom:1.0 org.apache.maven.project.MavenProject@9e13161e
Tests run: 2, Failures: 0, Errors: 0, Skipped: 0, Time elapsed: 0.152 sec

Results :

Failed tests: 
  testUTF8EncodedProject(org.apache.maven.project.MavenProjectTest)
  testISOEncodedProject(org.apache.maven.project.MavenProjectTest)

Tests run: 121, Failures: 2, Errors: 0, Skipped: 0

[INFO] ------------------------------------------------------------------------
[ERROR] BUILD FAILURE
[INFO] ------------------------------------------------------------------------
[INFO] There are test failures.
[INFO] ------------------------------------------------------------------------
[INFO] For more information, run Maven with the -e switch
[INFO] ------------------------------------------------------------------------
[INFO] Total time: 20 seconds
[INFO] Finished at: Wed Oct 17 01:54:59 GMT+00:00 2007
[INFO] Final Memory: 6M/15M
[INFO] ------------------------------------------------------------------------

****************************************************************************



Mime
View raw message