maven-notifications mailing list archives

Site index · List index
Message view « Date » · « Thread »
Top « Date » · « Thread »
From "Continuum@maven.zones.apache.org" <contin...@maven.zones.apache.org>
Subject [continuum] BUILD FAILURE: Integration Test Executor
Date Tue, 16 Oct 2007 20:26:37 GMT
Online report : http://maven.zones.apache.org/continuum/buildResult.action?buildId=28421&projectId=514

Build statistics:
  State: Failed
  Previous State: Failed
  Started at: Tue 16 Oct 2007 20:23:24 +0000
  Finished at: Tue 16 Oct 2007 20:26:34 +0000
  Total time: 3m 9s
  Build Trigger: Schedule
  Build Number: 13
  Exit code: 1
  Building machine hostname: maven.zones.apache.org
  Operating system : SunOS(unknown)
  Java Home version : 
          java version "1.4.2_06"
          Java(TM) 2 Runtime Environment, Standard Edition (build 1.4.2_06-b03)
          Java HotSpot(TM) Client VM (build 1.4.2_06-b03, mixed mode)
        
  Builder version :
          Maven version: 2.0.7
          Java version: 1.4.2_06
          OS name: "sunos" version: "5.10" arch: "x86"
    
****************************************************************************
SCM Changes:
****************************************************************************
No files changed

****************************************************************************
Dependencies Changes:
****************************************************************************
org.apache.maven:maven-embedder:2.1-SNAPSHOT


****************************************************************************
Build Defintion:
****************************************************************************
POM filename: pom.xml
Goals: clean install   
Arguments: --batch-mode --non-recursive -Pstandard
Build Fresh: false
Always Build: false
Default Build Definition: true
Schedule: DEFAULT_SCHEDULE
Profile Name: j2sdk1.4.2_06
Description: 


****************************************************************************
Test Summary:
****************************************************************************
Tests: 110
Failures: 106
Total time: 162708

****************************************************************************
Output:
****************************************************************************
[INFO] Scanning for projects...
[INFO] ----------------------------------------------------------------------------
[INFO] Building Integration Test Executor
[INFO]    task-segment: [clean, install]
[INFO] ----------------------------------------------------------------------------
[INFO] [clean:clean]
[INFO] Deleting directory /export/home/build/data/continuum/checkouts/514/target
[INFO] Deleting directory /export/home/build/data/continuum/checkouts/514/target/classes
[INFO] Deleting directory /export/home/build/data/continuum/checkouts/514/target/test-classes
[INFO] Deleting directory /export/home/build/data/continuum/checkouts/514/target/site
[INFO] [dependency:unpack {execution: default}]
[INFO] Configured Artifact: org.apache.maven:maven-embedder:bin:2.1-SNAPSHOT:tar.gz
[INFO] Unpacking /export/home/build/.m2/repository/org/apache/maven/maven-embedder/2.1-SNAPSHOT/maven-embedder-2.1-SNAPSHOT-bin.tar.gzto
 /export/home/build/data/continuum/checkouts/514/target/maven-installation
with Includes null and excludes:null
[INFO] Expanding /export/home/build/.m2/repository/org/apache/maven/maven-embedder/2.1-SNAPSHOT/maven-embedder-2.1-SNAPSHOT-bin.tar.gz
to /var/tmp/tmp45182.tar
[INFO] Expanding: /var/tmp/tmp45182.tar into /export/home/build/data/continuum/checkouts/514/target/maven-installation
[INFO] [antrun:run {execution: default}]
[INFO] Executing tasks
[INFO] Executed tasks
[INFO] [resources:resources]
[INFO] Using default encoding to copy filtered resources.
[INFO] Resource directory does not exist: /export/home/build/data/continuum/checkouts/514/src/main/resources
[INFO] [compiler:compile]
[INFO] No sources to compile
[INFO] [resources:testResources]
[INFO] Using default encoding to copy filtered resources.
[INFO] Resource directory does not exist: /export/home/build/data/continuum/checkouts/514/src/test/resources
[INFO] [compiler:testCompile]
[INFO] Compiling 1 source file to /export/home/build/data/continuum/checkouts/514/target/test-classes
[INFO] [surefire:test]
[INFO] Surefire report directory: /export/home/build/data/continuum/checkouts/514/target/surefire-reports
Running integration tests for Maven 2.1-SNAPSHOT

-------------------------------------------------------
 T E S T S
-------------------------------------------------------
Running org.apache.maven.its.Suite
Running integration tests for Maven 2.1-SNAPSHOT
0000(testit0000).. Failure
0001(testit0001).. Failure
0002(testit0002).. Failure
0003(testit0003).. Failure
0004(testit0004).. Failure
0005(testit0005).. Failure
0006(testit0006).. Failure
0007(testit0007).. Failure
0008(testit0008).. Failure
0009(testit0009).. Failure
0010(testit0010).. Failure
0011(testit0011).. Failure
0012(testit0012).. Failure
0013(testit0013).. Failure
0014(testit0014).. Failure
0016(testit0016).. Failure
0017(testit0017).. Failure
0018(testit0018).. Failure
0019(testit0019).. Failure
0020(testit0020).. Failure
0021(testit0021).. Failure
0022(testit0022).. Failure
0023(testit0023).. Failure
0024(testit0024).. Failure
0025(testit0025).. Failure
0026(testit0026).. Skipping (version 2.1-SNAPSHOT not in range [,2.1-SNAPSHOT))
0027(testit0027).. Failure
0028(testit0028).. Failure
0029(testit0029).. Failure
0030(testit0030).. Failure
0031(testit0031).. Skipping (version 2.1-SNAPSHOT not in range [,2.1-SNAPSHOT))
0032(testit0032).. Failure
0033(testit0033).. Failure
0034(testit0034).. Failure
0035(testit0035).. Failure
0036(testit0036).. Failure
0037(testit0037).. Failure
0038(testit0038).. Failure
0039(testit0039).. Failure
0040(testit0040).. Failure
0041(testit0041).. Failure
0042(testit0042).. Failure
0043(testit0043).. Failure
0044(testit0044).. Failure
0045(testit0045).. Failure
0046(testit0046).. Failure
0047(testit0047).. Failure
0048(testit0048).. Failure
0049(testit0049).. Failure
0050(testit0050).. Failure
0051(testit0051).. Skipping (version 2.1-SNAPSHOT not in range [,2.1-SNAPSHOT))
0052(testit0052).. Failure
0053(testit0053).. Failure
0054(testit0054).. Failure
0055(testit0055).. Failure
0056(testit0056).. Failure
0057(testit0057).. Failure
0058(testit0058).. Failure
0059(testit0059).. Failure
0060(testit0060).. Failure
0061(testit0061).. Failure
0062(testit0062).. Failure
0063(testit0063).. Failure
0064(testit0064).. Failure
0065(testit0065).. Failure
0066(testit0066).. Failure
0067(testit0067).. Failure
0068(testit0068).. Failure
0069(testit0069).. Failure
0070(testit0070).. Failure
0071(testit0071).. Failure
0072(testit0072).. Failure
0073(testit0073).. Failure
0074(testit0074).. Failure
0075(testit0075).. Failure
0076(testit0076).. Failure
0077(testit0077).. Failure
0078(testit0078).. Failure
0079(testit0079).. Failure
0080(testit0080).. Failure
0081(testit0081).. Failure
0082(testit0082).. Failure
0083(testit0083).. Failure
0084(testit0084).. Failure
0085(testit0085).. Failure
0086(testit0086).. Failure
0087(testit0087).. Failure
0088(testit0088).. Failure
0089(testit0089).. Failure
0090(testit0090)..
Command: /export/home/build/data/continuum/checkouts/514/target/maven-installation/apache-maven-2.1-SNAPSHOT/bin/mvn
-e --no-plugin-registry --batch-mode -Dmaven.repo.local=/export/home/build/.m2/repository
clean:clean test
Exit code: 1
 Failure
0092(testit0092).. Skipping (version 2.1-SNAPSHOT not in range [,2.1-SNAPSHOT))
0094(testit0094).. Failure
0095(testit0095).. Failure
0096(testit0096).. Failure
0097(testit0097).. Failure
0099(testit0099).. Failure
0100(testit0100).. Failure
0101(testit0101).. Failure
0102(testit0102).. Failure
0103(testit0103).. Failure
0104(testit0104).. Failure
0105(testit0105).. Failure
0110PluginDependenciesComeFromPluginRepos(testit0110).. Failure
0112ExtensionsThatDragDependencies(testit0112).. Failure
0113ServerAuthzAvailableToWagonMgrInPlugin(testit0113).. Failure
0114ExtensionThatProvidesResources(testit0114).. Failure
0118AttachedArtifactsInReactor(testit0118).. Failure
mng2254PomEncoding(testitMNG2254).. Failure
0115CustomArtifactHandlerAndCustomLifecycle(testit0115).. Failure
0119PluginPrefixOrder(testit0119).. Failure
Tests run: 110, Failures: 0, Errors: 106, Skipped: 0, Time elapsed: 162.866 sec <<<
FAILURE!

Results :

Tests in error: 
  testit0000(org.apache.maven.integrationtests.MavenIT0000Test)
  testit0001(org.apache.maven.integrationtests.MavenIT0001Test)
  testit0002(org.apache.maven.integrationtests.MavenIT0002Test)
  testit0003(org.apache.maven.integrationtests.MavenIT0003Test)
  testit0004(org.apache.maven.integrationtests.MavenIT0004Test)
  testit0005(org.apache.maven.integrationtests.MavenIT0005Test)
  testit0006(org.apache.maven.integrationtests.MavenIT0006Test)
  testit0007(org.apache.maven.integrationtests.MavenIT0007Test)
  testit0008(org.apache.maven.integrationtests.MavenIT0008Test)
  testit0009(org.apache.maven.integrationtests.MavenIT0009Test)
  testit0010(org.apache.maven.integrationtests.MavenIT0010Test)
  testit0011(org.apache.maven.integrationtests.MavenIT0011Test)
  testit0012(org.apache.maven.integrationtests.MavenIT0012Test)
  testit0013(org.apache.maven.integrationtests.MavenIT0013Test)
  testit0014(org.apache.maven.integrationtests.MavenIT0014Test)
  testit0016(org.apache.maven.integrationtests.MavenIT0016Test)
  testit0017(org.apache.maven.integrationtests.MavenIT0017Test)
  testit0018(org.apache.maven.integrationtests.MavenIT0018Test)
  testit0019(org.apache.maven.integrationtests.MavenIT0019Test)
  testit0020(org.apache.maven.integrationtests.MavenIT0020Test)
  testit0021(org.apache.maven.integrationtests.MavenIT0021Test)
  testit0022(org.apache.maven.integrationtests.MavenIT0022Test)
  testit0023(org.apache.maven.integrationtests.MavenIT0023Test)
  testit0024(org.apache.maven.integrationtests.MavenIT0024Test)
  testit0025(org.apache.maven.integrationtests.MavenIT0025Test)
  testit0027(org.apache.maven.integrationtests.MavenIT0027Test)
  testit0028(org.apache.maven.integrationtests.MavenIT0028Test)
  testit0029(org.apache.maven.integrationtests.MavenIT0029Test)
  testit0030(org.apache.maven.integrationtests.MavenIT0030Test)
  testit0032(org.apache.maven.integrationtests.MavenIT0032Test)
  testit0033(org.apache.maven.integrationtests.MavenIT0033Test)
  testit0034(org.apache.maven.integrationtests.MavenIT0034Test)
  testit0035(org.apache.maven.integrationtests.MavenIT0035Test)
  testit0036(org.apache.maven.integrationtests.MavenIT0036Test)
  testit0037(org.apache.maven.integrationtests.MavenIT0037Test)
  testit0038(org.apache.maven.integrationtests.MavenIT0038Test)
  testit0039(org.apache.maven.integrationtests.MavenIT0039Test)
  testit0040(org.apache.maven.integrationtests.MavenIT0040Test)
  testit0041(org.apache.maven.integrationtests.MavenIT0041Test)
  testit0042(org.apache.maven.integrationtests.MavenIT0042Test)
  testit0043(org.apache.maven.integrationtests.MavenIT0043Test)
  testit0044(org.apache.maven.integrationtests.MavenIT0044Test)
  testit0045(org.apache.maven.integrationtests.MavenIT0045Test)
  testit0046(org.apache.maven.integrationtests.MavenIT0046Test)
  testit0047(org.apache.maven.integrationtests.MavenIT0047Test)
  testit0048(org.apache.maven.integrationtests.MavenIT0048Test)
  testit0049(org.apache.maven.integrationtests.MavenIT0049Test)
  testit0050(org.apache.maven.integrationtests.MavenIT0050Test)
  testit0052(org.apache.maven.integrationtests.MavenIT0052Test)
  testit0053(org.apache.maven.integrationtests.MavenIT0053Test)
  testit0054(org.apache.maven.integrationtests.MavenIT0054Test)
  testit0055(org.apache.maven.integrationtests.MavenIT0055Test)
  testit0056(org.apache.maven.integrationtests.MavenIT0056Test)
  testit0057(org.apache.maven.integrationtests.MavenIT0057Test)
  testit0058(org.apache.maven.integrationtests.MavenIT0058Test)
  testit0059(org.apache.maven.integrationtests.MavenIT0059Test)
  testit0060(org.apache.maven.integrationtests.MavenIT0060Test)
  testit0061(org.apache.maven.integrationtests.MavenIT0061Test)
  testit0062(org.apache.maven.integrationtests.MavenIT0062Test)
  testit0063(org.apache.maven.integrationtests.MavenIT0063Test)
  testit0064(org.apache.maven.integrationtests.MavenIT0064Test)
  testit0065(org.apache.maven.integrationtests.MavenIT0065Test)
  testit0066(org.apache.maven.integrationtests.MavenIT0066Test)
  testit0067(org.apache.maven.integrationtests.MavenIT0067Test)
  testit0068(org.apache.maven.integrationtests.MavenIT0068Test)
  testit0069(org.apache.maven.integrationtests.MavenIT0069Test)
  testit0070(org.apache.maven.integrationtests.MavenIT0070Test)
  testit0071(org.apache.maven.integrationtests.MavenIT0071Test)
  testit0072(org.apache.maven.integrationtests.MavenIT0072Test)
  testit0073(org.apache.maven.integrationtests.MavenIT0073Test)
  testit0074(org.apache.maven.integrationtests.MavenIT0074Test)
  testit0075(org.apache.maven.integrationtests.MavenIT0075Test)
  testit0076(org.apache.maven.integrationtests.MavenIT0076Test)
  testit0077(org.apache.maven.integrationtests.MavenIT0077Test)
  testit0078(org.apache.maven.integrationtests.MavenIT0078Test)
  testit0079(org.apache.maven.integrationtests.MavenIT0079Test)
  testit0080(org.apache.maven.integrationtests.MavenIT0080Test)
  testit0081(org.apache.maven.integrationtests.MavenIT0081Test)
  testit0082(org.apache.maven.integrationtests.MavenIT0082Test)
  testit0083(org.apache.maven.integrationtests.MavenIT0083Test)
  testit0084(org.apache.maven.integrationtests.MavenIT0084Test)
  testit0085(org.apache.maven.integrationtests.MavenIT0085Test)
  testit0086(org.apache.maven.integrationtests.MavenIT0086Test)
  testit0087(org.apache.maven.integrationtests.MavenIT0087Test)
  testit0088(org.apache.maven.integrationtests.MavenIT0088Test)
  testit0089(org.apache.maven.integrationtests.MavenIT0089Test)
  testit0090(org.apache.maven.integrationtests.MavenIT0090Test)
  testit0094(org.apache.maven.integrationtests.MavenIT0094Test)
  testit0095(org.apache.maven.integrationtests.MavenIT0095Test)
  testit0096(org.apache.maven.integrationtests.MavenIT0096Test)
  testit0097(org.apache.maven.integrationtests.MavenIT0097Test)
  testit0099(org.apache.maven.integrationtests.MavenIT0099Test)
  testit0100(org.apache.maven.integrationtests.MavenIT0100Test)
  testit0101(org.apache.maven.integrationtests.MavenIT0101Test)
  testit0102(org.apache.maven.integrationtests.MavenIT0102Test)
  testit0103(org.apache.maven.integrationtests.MavenIT0103Test)
  testit0104(org.apache.maven.integrationtests.MavenIT0104Test)
  testit0105(org.apache.maven.integrationtests.MavenIT0105Test)
  testit0110(org.apache.maven.integrationtests.MavenIT0110PluginDependenciesComeFromPluginReposTest)
  testit0112(org.apache.maven.integrationtests.MavenIT0112ExtensionsThatDragDependencies)
  testit0113(org.apache.maven.integrationtests.MavenIT0113ServerAuthzAvailableToWagonMgrInPlugin)
  testit0114(org.apache.maven.integrationtests.MavenIT0114ExtensionThatProvidesResources)
  testit0118(org.apache.maven.integrationtests.MavenIT0118AttachedArtifactsInReactor)
  testitMNG2254(org.apache.maven.integrationtests.MavenITmng2254PomEncodingTest)
  testit0115(org.apache.maven.integrationtests.MavenIT0115CustomArtifactHandlerAndCustomLifecycleTest)
  testit0119(org.apache.maven.integrationtests.MavenIT0119PluginPrefixOrder)

Tests run: 110, Failures: 0, Errors: 106, Skipped: 0

[INFO] ------------------------------------------------------------------------
[ERROR] BUILD FAILURE
[INFO] ------------------------------------------------------------------------
[INFO] There are test failures.
[INFO] ------------------------------------------------------------------------
[INFO] For more information, run Maven with the -e switch
[INFO] ------------------------------------------------------------------------
[INFO] Total time: 3 minutes 7 seconds
[INFO] Finished at: Tue Oct 16 20:26:33 GMT+00:00 2007
[INFO] Final Memory: 13M/30M
[INFO] ------------------------------------------------------------------------

****************************************************************************



Mime
View raw message