maven-notifications mailing list archives

Site index · List index
Message view « Date » · « Thread »
Top « Date » · « Thread »
From "Continuum@maven.zones.apache.org" <contin...@maven.zones.apache.org>
Subject [continuum] BUILD FAILURE: Doxia :: XDoc Module
Date Fri, 17 Aug 2007 12:28:28 GMT
Online report : http://maven.zones.apache.org/continuum/buildResult.action?buildId=15100&projectId=327

Build statistics:
  State: Failed
  Previous State: Ok
  Started at: Fri 17 Aug 2007 12:28:12 +0000
  Finished at: Fri 17 Aug 2007 12:28:26 +0000
  Total time: 14s
  Build Trigger: Schedule
  Build Number: 28
  Exit code: 1
  Building machine hostname: maven.zones.apache.org
  Operating system : SunOS(unknown)
  Java Home version : 
          java version "1.5.0_12"
          Java(TM) 2 Runtime Environment, Standard Edition (build 1.5.0_12-b04)
          Java HotSpot(TM) Server VM (build 1.5.0_12-b04, mixed mode)
        
  Builder version :
          Maven version: 2.0.6
    
****************************************************************************
SCM Changes:
****************************************************************************
Changed: ltheussl @ Fri 17 Aug 2007 12:03:09 +0000
Comment: Use new test classes in xdoc module
Files changed:
  /maven/doxia/doxia/trunk/doxia-modules/doxia-module-xdoc/src/test/java/org/apache/maven/doxia/module/xdoc/XdocIdentityTest.java
( 567030 )
  /maven/doxia/doxia/trunk/doxia-modules/doxia-module-xdoc/src/test/java/org/apache/maven/doxia/module/xdoc/XdocParserTest.java
( 567030 )
  /maven/doxia/doxia/trunk/doxia-modules/doxia-module-xdoc/src/test/java/org/apache/maven/doxia/module/xdoc/XdocSinkTest.java
( 567030 )
  /maven/doxia/doxia/trunk/doxia-modules/doxia-module-xdoc/src/test/resources/test.xml ( 567030
)

****************************************************************************
SCM Changes since last success:
****************************************************************************
****************************************************************************
Dependencies Changes:
****************************************************************************
org.apache.maven.doxia:doxia-core:1.0-alpha-9-SNAPSHOT

org.apache.maven.doxia:doxia-core:1.0-alpha-9-SNAPSHOT

org.apache.maven.doxia:doxia-modules:1.0-alpha-9-SNAPSHOT

****************************************************************************
Test Summary:
****************************************************************************
Tests: 35
Failures: 1
Total time: 2588

****************************************************************************
Output:
****************************************************************************
[INFO] Scanning for projects...
[INFO] ----------------------------------------------------------------------------
[INFO] Building Doxia :: XDoc Module
[INFO]    task-segment: [clean, install]
[INFO] ----------------------------------------------------------------------------
[INFO] [clean:clean]
[INFO] Deleting directory /export/home/build/data/continuum/checkouts/327/target
[INFO] [plexus:descriptor {execution: default}]
[INFO] [resources:resources]
[INFO] Using default encoding to copy filtered resources.
[INFO] Copying 0 resource
[INFO] Copying 1 resource
[INFO] [plexus:merge-descriptors {execution: default}]
[INFO] [compiler:compile]
[INFO] Compiling 5 source files to /export/home/build/data/continuum/checkouts/327/target/classes
[INFO] [resources:testResources]
[INFO] Using default encoding to copy filtered resources.
[INFO] Copying 4 resources
[INFO] [compiler:testCompile]
[INFO] Compiling 3 source files to /export/home/build/data/continuum/checkouts/327/target/test-classes
[INFO] [surefire:test]
[INFO] Surefire report directory: /export/home/build/data/continuum/checkouts/327/target/surefire-reports

-------------------------------------------------------
 T E S T S
-------------------------------------------------------
Running org.apache.maven.doxia.module.xdoc.XdocIdentityTest
Tests run: 1, Failures: 0, Errors: 0, Skipped: 0, Time elapsed: 0.642 sec
Running org.apache.maven.doxia.module.xdoc.XdocSinkTest
Tests run: 30, Failures: 1, Errors: 0, Skipped: 0, Time elapsed: 1.636 sec <<< FAILURE!
Running org.apache.maven.doxia.module.xdoc.XdocParserTest
Tests run: 4, Failures: 0, Errors: 0, Skipped: 0, Time elapsed: 0.311 sec

Results :

Failed tests: 
  testTable(org.apache.maven.doxia.module.xdoc.XdocSinkTest)

Tests run: 35, Failures: 1, Errors: 0, Skipped: 0

[INFO] ------------------------------------------------------------------------
[ERROR] BUILD FAILURE
[INFO] ------------------------------------------------------------------------
[INFO] There are test failures.

Please refer to /export/home/build/data/continuum/checkouts/327/target/surefire-reports for
the individual test results.
[INFO] ------------------------------------------------------------------------
[INFO] For more information, run Maven with the -e switch
[INFO] ------------------------------------------------------------------------
[INFO] Total time: 12 seconds
[INFO] Finished at: Fri Aug 17 12:28:25 GMT+00:00 2007
[INFO] Final Memory: 10M/334M
[INFO] ------------------------------------------------------------------------

****************************************************************************



Mime
View raw message