maven-notifications mailing list archives

Site index · List index
Message view « Date » · « Thread »
Top « Date » · « Thread »
From "Continuum@maven.zones.apache.org" <contin...@maven.zones.apache.org>
Subject [continuum] BUILD FAILURE: Maven Ant Plugin
Date Thu, 23 Aug 2007 12:50:41 GMT
Online report : http://maven.zones.apache.org/continuum/buildResult.action?buildId=17007&projectId=2

Build statistics:
  State: Failed
  Previous State: Failed
  Started at: Thu 23 Aug 2007 12:47:43 +0000
  Finished at: Thu 23 Aug 2007 12:50:38 +0000
  Total time: 2m 54s
  Build Trigger: Schedule
  Build Number: 43
  Exit code: 1
  Building machine hostname: maven.zones.apache.org
  Operating system : SunOS(unknown)
  Java Home version : 
          java version "1.5.0_12"
          Java(TM) 2 Runtime Environment, Standard Edition (build 1.5.0_12-b04)
          Java HotSpot(TM) Server VM (build 1.5.0_12-b04, mixed mode)
        
  Builder version :
          Maven version: 2.0.7
          Java version: 1.5.0_12
          OS name: "sunos" version: "5.10" arch: "x86"
    
****************************************************************************
SCM Changes:
****************************************************************************
Changed: no author @ no date
Comment: no comment
Files changed:
  2/src/test/java/org/apache/maven/plugin/ant/stubs/AbstractAntTestMavenProjectStub.java ( no revision )
  2/src/test/java/org/apache/maven/plugin/ant/stubs/JavadocTestMavenProjectStub.java ( no revision )
  2/src/test/java/org/apache/maven/plugin/ant/stubs/AntNoDepTestMavenProjectStub.java ( no revision )
  2/src/test/java/org/apache/maven/plugin/ant/stubs/AntTestMavenProjectStub.java ( no revision )
  2/src/test/java/org/apache/maven/plugin/ant/stubs/SettingsStub.java ( no revision )
  2/src/test/java/org/apache/maven/plugin/ant/AntWrapper.java ( no revision )
  2/src/test/java/org/apache/maven/plugin/ant/AntMojoTest.java ( no revision )
  2/src/test/java/org/apache/maven/plugin/ant/AntBuildWriterUtilTest.java ( no revision )
  2/src/test/resources/unit/ant-test/src/test/java/org/apache/maven/plugins/ant/test/AppTest.java ( no revision )
  2/src/test/resources/unit/ant-test/src/test/resources/test.txt ( no revision )
  2/src/test/resources/unit/ant-test/src/main/java/org/apache/maven/plugins/ant/test/App.java ( no revision )
  2/src/test/resources/unit/ant-test/src/main/resources/main.txt ( no revision )
  2/src/test/resources/unit/ant-test/pom.xml ( no revision )
  2/src/test/resources/unit/ant-nodep-test/src/main/java/org/apache/maven/plugins/ant/test/App.java ( no revision )
  2/src/test/resources/unit/ant-nodep-test/src/main/resources/main.txt ( no revision )
  2/src/test/resources/unit/ant-nodep-test/pom.xml ( no revision )
  2/src/test/resources/unit/ant-javadoc-test/src/test/java/org/apache/maven/plugins/ant/test/AppTest.java ( no revision )
  2/src/test/resources/unit/ant-javadoc-test/src/test/resources/test.txt ( no revision )
  2/src/test/resources/unit/ant-javadoc-test/src/main/java/org/apache/maven/plugins/ant/test/App.java ( no revision )
  2/src/test/resources/unit/ant-javadoc-test/src/main/resources/main.txt ( no revision )
  2/src/test/resources/unit/ant-javadoc-test/pom.xml ( no revision )
  2/src/test/resources/unit/ant-war-config-test/pom.xml ( no revision )
  2/src/test/resources/unit/ant-compiler-config-test/pom.xml ( no revision )
  2/src/main/java/org/apache/maven/plugin/ant/AntBuildWriter.java ( no revision )
  2/src/main/java/org/apache/maven/plugin/ant/ArtifactResolverWrapper.java ( no revision )
  2/src/main/java/org/apache/maven/plugin/ant/AntMojo.java ( no revision )
  2/src/main/java/org/apache/maven/plugin/ant/AntCleanMojo.java ( no revision )
  2/src/main/java/org/apache/maven/plugin/ant/AntBuildWriterUtil.java ( no revision )
  2/src/site/site.xml ( no revision )
  2/src/site/apt/usage.apt ( no revision )
  2/src/site/apt/index.apt ( no revision )
  2/src/site/apt/examples/using.apt ( no revision )
  2/src/site/fml/faq.fml ( no revision )
  2/src/it/ear-it/verify.bsh ( no revision )
  2/src/it/ear-it/primary-source/pom.xml ( no revision )
  2/src/it/ear-it/ejbs/src/main/resources/META-INF/ejb-jar.xml ( no revision )
  2/src/it/ear-it/ejbs/pom.xml ( no revision )
  2/src/it/ear-it/ear/application.xml ( no revision )
  2/src/it/ear-it/ear/pom.xml ( no revision )
  2/src/it/ear-it/servlets/servlet/src/main/webapp/index.jsp ( no revision )
  2/src/it/ear-it/servlets/servlet/src/main/webapp/WEB-INF/web.xml ( no revision )
  2/src/it/ear-it/servlets/servlet/pom.xml ( no revision )
  2/src/it/ear-it/servlets/pom.xml ( no revision )
  2/src/it/ear-it/projects/logging/pom.xml ( no revision )
  2/src/it/ear-it/projects/pom.xml ( no revision )
  2/src/it/ear-it/pom.xml ( no revision )
  2/src/it/plugin-it/verify.bsh ( no revision )
  2/src/it/plugin-it/src/main/java/org/apache/maven/plugin/ant/it/TestMojo.java ( no revision )
  2/src/it/plugin-it/pom.xml ( no revision )
  2/src/it/webapp-it/verify.bsh ( no revision )
  2/src/it/webapp-it/src/main/webapp/index.jsp ( no revision )
  2/src/it/webapp-it/src/main/webapp/WEB-INF/web.xml ( no revision )
  2/src/it/webapp-it/pom.xml ( no revision )
  2/pom.xml ( no revision )

****************************************************************************
SCM Changes since last success:
****************************************************************************
Changed: no author @ no date
Comment: no comment
Files changed:
  2/src/test/java/org/apache/maven/plugin/ant/stubs/AbstractAntTestMavenProjectStub.java ( no revision )
  2/src/test/java/org/apache/maven/plugin/ant/stubs/JavadocTestMavenProjectStub.java ( no revision )
  2/src/test/java/org/apache/maven/plugin/ant/stubs/AntNoDepTestMavenProjectStub.java ( no revision )
  2/src/test/java/org/apache/maven/plugin/ant/stubs/AntTestMavenProjectStub.java ( no revision )
  2/src/test/java/org/apache/maven/plugin/ant/stubs/SettingsStub.java ( no revision )
  2/src/test/java/org/apache/maven/plugin/ant/AntWrapper.java ( no revision )
  2/src/test/java/org/apache/maven/plugin/ant/AntMojoTest.java ( no revision )
  2/src/test/java/org/apache/maven/plugin/ant/AntBuildWriterUtilTest.java ( no revision )
  2/src/test/resources/unit/ant-test/src/test/java/org/apache/maven/plugins/ant/test/AppTest.java ( no revision )
  2/src/test/resources/unit/ant-test/src/test/resources/test.txt ( no revision )
  2/src/test/resources/unit/ant-test/src/main/java/org/apache/maven/plugins/ant/test/App.java ( no revision )
  2/src/test/resources/unit/ant-test/src/main/resources/main.txt ( no revision )
  2/src/test/resources/unit/ant-test/pom.xml ( no revision )
  2/src/test/resources/unit/ant-nodep-test/src/main/java/org/apache/maven/plugins/ant/test/App.java ( no revision )
  2/src/test/resources/unit/ant-nodep-test/src/main/resources/main.txt ( no revision )
  2/src/test/resources/unit/ant-nodep-test/pom.xml ( no revision )
  2/src/test/resources/unit/ant-javadoc-test/src/test/java/org/apache/maven/plugins/ant/test/AppTest.java ( no revision )
  2/src/test/resources/unit/ant-javadoc-test/src/test/resources/test.txt ( no revision )
  2/src/test/resources/unit/ant-javadoc-test/src/main/java/org/apache/maven/plugins/ant/test/App.java ( no revision )
  2/src/test/resources/unit/ant-javadoc-test/src/main/resources/main.txt ( no revision )
  2/src/test/resources/unit/ant-javadoc-test/pom.xml ( no revision )
  2/src/test/resources/unit/ant-war-config-test/pom.xml ( no revision )
  2/src/test/resources/unit/ant-compiler-config-test/pom.xml ( no revision )
  2/src/main/java/org/apache/maven/plugin/ant/AntBuildWriter.java ( no revision )
  2/src/main/java/org/apache/maven/plugin/ant/ArtifactResolverWrapper.java ( no revision )
  2/src/main/java/org/apache/maven/plugin/ant/AntMojo.java ( no revision )
  2/src/main/java/org/apache/maven/plugin/ant/AntCleanMojo.java ( no revision )
  2/src/main/java/org/apache/maven/plugin/ant/AntBuildWriterUtil.java ( no revision )
  2/src/site/site.xml ( no revision )
  2/src/site/apt/usage.apt ( no revision )
  2/src/site/apt/index.apt ( no revision )
  2/src/site/apt/examples/using.apt ( no revision )
  2/src/site/fml/faq.fml ( no revision )
  2/src/it/ear-it/verify.bsh ( no revision )
  2/src/it/ear-it/primary-source/pom.xml ( no revision )
  2/src/it/ear-it/ejbs/src/main/resources/META-INF/ejb-jar.xml ( no revision )
  2/src/it/ear-it/ejbs/pom.xml ( no revision )
  2/src/it/ear-it/ear/application.xml ( no revision )
  2/src/it/ear-it/ear/pom.xml ( no revision )
  2/src/it/ear-it/servlets/servlet/src/main/webapp/index.jsp ( no revision )
  2/src/it/ear-it/servlets/servlet/src/main/webapp/WEB-INF/web.xml ( no revision )
  2/src/it/ear-it/servlets/servlet/pom.xml ( no revision )
  2/src/it/ear-it/servlets/pom.xml ( no revision )
  2/src/it/ear-it/projects/logging/pom.xml ( no revision )
  2/src/it/ear-it/projects/pom.xml ( no revision )
  2/src/it/ear-it/pom.xml ( no revision )
  2/src/it/plugin-it/verify.bsh ( no revision )
  2/src/it/plugin-it/src/main/java/org/apache/maven/plugin/ant/it/TestMojo.java ( no revision )
  2/src/it/plugin-it/pom.xml ( no revision )
  2/src/it/webapp-it/verify.bsh ( no revision )
  2/src/it/webapp-it/src/main/webapp/index.jsp ( no revision )
  2/src/it/webapp-it/src/main/webapp/WEB-INF/web.xml ( no revision )
  2/src/it/webapp-it/pom.xml ( no revision )
  2/pom.xml ( no revision )

Changed: no author @ no date
Comment: no comment
Files changed:
  2/src/test/java/org/apache/maven/plugin/ant/stubs/AbstractAntTestMavenProjectStub.java ( no revision )
  2/src/test/java/org/apache/maven/plugin/ant/stubs/JavadocTestMavenProjectStub.java ( no revision )
  2/src/test/java/org/apache/maven/plugin/ant/stubs/AntNoDepTestMavenProjectStub.java ( no revision )
  2/src/test/java/org/apache/maven/plugin/ant/stubs/AntTestMavenProjectStub.java ( no revision )
  2/src/test/java/org/apache/maven/plugin/ant/stubs/SettingsStub.java ( no revision )
  2/src/test/java/org/apache/maven/plugin/ant/AntWrapper.java ( no revision )
  2/src/test/java/org/apache/maven/plugin/ant/AntMojoTest.java ( no revision )
  2/src/test/java/org/apache/maven/plugin/ant/AntBuildWriterUtilTest.java ( no revision )
  2/src/test/resources/unit/ant-test/src/test/java/org/apache/maven/plugins/ant/test/AppTest.java ( no revision )
  2/src/test/resources/unit/ant-test/src/test/resources/test.txt ( no revision )
  2/src/test/resources/unit/ant-test/src/main/java/org/apache/maven/plugins/ant/test/App.java ( no revision )
  2/src/test/resources/unit/ant-test/src/main/resources/main.txt ( no revision )
  2/src/test/resources/unit/ant-test/pom.xml ( no revision )
  2/src/test/resources/unit/ant-nodep-test/src/main/java/org/apache/maven/plugins/ant/test/App.java ( no revision )
  2/src/test/resources/unit/ant-nodep-test/src/main/resources/main.txt ( no revision )
  2/src/test/resources/unit/ant-nodep-test/pom.xml ( no revision )
  2/src/test/resources/unit/ant-javadoc-test/src/test/java/org/apache/maven/plugins/ant/test/AppTest.java ( no revision )
  2/src/test/resources/unit/ant-javadoc-test/src/test/resources/test.txt ( no revision )
  2/src/test/resources/unit/ant-javadoc-test/src/main/java/org/apache/maven/plugins/ant/test/App.java ( no revision )
  2/src/test/resources/unit/ant-javadoc-test/src/main/resources/main.txt ( no revision )
  2/src/test/resources/unit/ant-javadoc-test/pom.xml ( no revision )
  2/src/test/resources/unit/ant-war-config-test/pom.xml ( no revision )
  2/src/test/resources/unit/ant-compiler-config-test/pom.xml ( no revision )
  2/src/main/java/org/apache/maven/plugin/ant/AntBuildWriter.java ( no revision )
  2/src/main/java/org/apache/maven/plugin/ant/ArtifactResolverWrapper.java ( no revision )
  2/src/main/java/org/apache/maven/plugin/ant/AntMojo.java ( no revision )
  2/src/main/java/org/apache/maven/plugin/ant/AntCleanMojo.java ( no revision )
  2/src/main/java/org/apache/maven/plugin/ant/AntBuildWriterUtil.java ( no revision )
  2/src/site/site.xml ( no revision )
  2/src/site/apt/usage.apt ( no revision )
  2/src/site/apt/index.apt ( no revision )
  2/src/site/apt/examples/using.apt ( no revision )
  2/src/site/fml/faq.fml ( no revision )
  2/src/it/ear-it/verify.bsh ( no revision )
  2/src/it/ear-it/primary-source/pom.xml ( no revision )
  2/src/it/ear-it/ejbs/src/main/resources/META-INF/ejb-jar.xml ( no revision )
  2/src/it/ear-it/ejbs/pom.xml ( no revision )
  2/src/it/ear-it/ear/application.xml ( no revision )
  2/src/it/ear-it/ear/pom.xml ( no revision )
  2/src/it/ear-it/servlets/servlet/src/main/webapp/index.jsp ( no revision )
  2/src/it/ear-it/servlets/servlet/src/main/webapp/WEB-INF/web.xml ( no revision )
  2/src/it/ear-it/servlets/servlet/pom.xml ( no revision )
  2/src/it/ear-it/servlets/pom.xml ( no revision )
  2/src/it/ear-it/projects/logging/pom.xml ( no revision )
  2/src/it/ear-it/projects/pom.xml ( no revision )
  2/src/it/ear-it/pom.xml ( no revision )
  2/src/it/plugin-it/verify.bsh ( no revision )
  2/src/it/plugin-it/src/main/java/org/apache/maven/plugin/ant/it/TestMojo.java ( no revision )
  2/src/it/plugin-it/pom.xml ( no revision )
  2/src/it/webapp-it/verify.bsh ( no revision )
  2/src/it/webapp-it/src/main/webapp/index.jsp ( no revision )
  2/src/it/webapp-it/src/main/webapp/WEB-INF/web.xml ( no revision )
  2/src/it/webapp-it/pom.xml ( no revision )
  2/pom.xml ( no revision )

Changed: no author @ no date
Comment: no comment
Files changed:
  2/src/test/java/org/apache/maven/plugin/ant/stubs/AbstractAntTestMavenProjectStub.java ( no revision )
  2/src/test/java/org/apache/maven/plugin/ant/stubs/JavadocTestMavenProjectStub.java ( no revision )
  2/src/test/java/org/apache/maven/plugin/ant/stubs/AntNoDepTestMavenProjectStub.java ( no revision )
  2/src/test/java/org/apache/maven/plugin/ant/stubs/AntTestMavenProjectStub.java ( no revision )
  2/src/test/java/org/apache/maven/plugin/ant/stubs/SettingsStub.java ( no revision )
  2/src/test/java/org/apache/maven/plugin/ant/AntWrapper.java ( no revision )
  2/src/test/java/org/apache/maven/plugin/ant/AntMojoTest.java ( no revision )
  2/src/test/java/org/apache/maven/plugin/ant/AntBuildWriterUtilTest.java ( no revision )
  2/src/test/resources/unit/ant-test/src/test/java/org/apache/maven/plugins/ant/test/AppTest.java ( no revision )
  2/src/test/resources/unit/ant-test/src/test/resources/test.txt ( no revision )
  2/src/test/resources/unit/ant-test/src/main/java/org/apache/maven/plugins/ant/test/App.java ( no revision )
  2/src/test/resources/unit/ant-test/src/main/resources/main.txt ( no revision )
  2/src/test/resources/unit/ant-test/pom.xml ( no revision )
  2/src/test/resources/unit/ant-nodep-test/src/main/java/org/apache/maven/plugins/ant/test/App.java ( no revision )
  2/src/test/resources/unit/ant-nodep-test/src/main/resources/main.txt ( no revision )
  2/src/test/resources/unit/ant-nodep-test/pom.xml ( no revision )
  2/src/test/resources/unit/ant-javadoc-test/src/test/java/org/apache/maven/plugins/ant/test/AppTest.java ( no revision )
  2/src/test/resources/unit/ant-javadoc-test/src/test/resources/test.txt ( no revision )
  2/src/test/resources/unit/ant-javadoc-test/src/main/java/org/apache/maven/plugins/ant/test/App.java ( no revision )
  2/src/test/resources/unit/ant-javadoc-test/src/main/resources/main.txt ( no revision )
  2/src/test/resources/unit/ant-javadoc-test/pom.xml ( no revision )
  2/src/test/resources/unit/ant-war-config-test/pom.xml ( no revision )
  2/src/test/resources/unit/ant-compiler-config-test/pom.xml ( no revision )
  2/src/main/java/org/apache/maven/plugin/ant/AntBuildWriter.java ( no revision )
  2/src/main/java/org/apache/maven/plugin/ant/ArtifactResolverWrapper.java ( no revision )
  2/src/main/java/org/apache/maven/plugin/ant/AntMojo.java ( no revision )
  2/src/main/java/org/apache/maven/plugin/ant/AntCleanMojo.java ( no revision )
  2/src/main/java/org/apache/maven/plugin/ant/AntBuildWriterUtil.java ( no revision )
  2/src/site/site.xml ( no revision )
  2/src/site/apt/usage.apt ( no revision )
  2/src/site/apt/index.apt ( no revision )
  2/src/site/apt/examples/using.apt ( no revision )
  2/src/site/fml/faq.fml ( no revision )
  2/src/it/ear-it/verify.bsh ( no revision )
  2/src/it/ear-it/primary-source/pom.xml ( no revision )
  2/src/it/ear-it/ejbs/src/main/resources/META-INF/ejb-jar.xml ( no revision )
  2/src/it/ear-it/ejbs/pom.xml ( no revision )
  2/src/it/ear-it/ear/application.xml ( no revision )
  2/src/it/ear-it/ear/pom.xml ( no revision )
  2/src/it/ear-it/servlets/servlet/src/main/webapp/index.jsp ( no revision )
  2/src/it/ear-it/servlets/servlet/src/main/webapp/WEB-INF/web.xml ( no revision )
  2/src/it/ear-it/servlets/servlet/pom.xml ( no revision )
  2/src/it/ear-it/servlets/pom.xml ( no revision )
  2/src/it/ear-it/projects/logging/pom.xml ( no revision )
  2/src/it/ear-it/projects/pom.xml ( no revision )
  2/src/it/ear-it/pom.xml ( no revision )
  2/src/it/plugin-it/verify.bsh ( no revision )
  2/src/it/plugin-it/src/main/java/org/apache/maven/plugin/ant/it/TestMojo.java ( no revision )
  2/src/it/plugin-it/pom.xml ( no revision )
  2/src/it/webapp-it/verify.bsh ( no revision )
  2/src/it/webapp-it/src/main/webapp/index.jsp ( no revision )
  2/src/it/webapp-it/src/main/webapp/WEB-INF/web.xml ( no revision )
  2/src/it/webapp-it/pom.xml ( no revision )
  2/pom.xml ( no revision )

Changed: no author @ no date
Comment: no comment
Files changed:
  2/src/test/java/org/apache/maven/plugin/ant/stubs/AbstractAntTestMavenProjectStub.java ( no revision )
  2/src/test/java/org/apache/maven/plugin/ant/stubs/JavadocTestMavenProjectStub.java ( no revision )
  2/src/test/java/org/apache/maven/plugin/ant/stubs/AntNoDepTestMavenProjectStub.java ( no revision )
  2/src/test/java/org/apache/maven/plugin/ant/stubs/AntTestMavenProjectStub.java ( no revision )
  2/src/test/java/org/apache/maven/plugin/ant/stubs/SettingsStub.java ( no revision )
  2/src/test/java/org/apache/maven/plugin/ant/AntWrapper.java ( no revision )
  2/src/test/java/org/apache/maven/plugin/ant/AntMojoTest.java ( no revision )
  2/src/test/java/org/apache/maven/plugin/ant/AntBuildWriterUtilTest.java ( no revision )
  2/src/test/resources/unit/ant-test/src/test/java/org/apache/maven/plugins/ant/test/AppTest.java ( no revision )
  2/src/test/resources/unit/ant-test/src/test/resources/test.txt ( no revision )
  2/src/test/resources/unit/ant-test/src/main/java/org/apache/maven/plugins/ant/test/App.java ( no revision )
  2/src/test/resources/unit/ant-test/src/main/resources/main.txt ( no revision )
  2/src/test/resources/unit/ant-test/pom.xml ( no revision )
  2/src/test/resources/unit/ant-nodep-test/src/main/java/org/apache/maven/plugins/ant/test/App.java ( no revision )
  2/src/test/resources/unit/ant-nodep-test/src/main/resources/main.txt ( no revision )
  2/src/test/resources/unit/ant-nodep-test/pom.xml ( no revision )
  2/src/test/resources/unit/ant-javadoc-test/src/test/java/org/apache/maven/plugins/ant/test/AppTest.java ( no revision )
  2/src/test/resources/unit/ant-javadoc-test/src/test/resources/test.txt ( no revision )
  2/src/test/resources/unit/ant-javadoc-test/src/main/java/org/apache/maven/plugins/ant/test/App.java ( no revision )
  2/src/test/resources/unit/ant-javadoc-test/src/main/resources/main.txt ( no revision )
  2/src/test/resources/unit/ant-javadoc-test/pom.xml ( no revision )
  2/src/test/resources/unit/ant-war-config-test/pom.xml ( no revision )
  2/src/test/resources/unit/ant-compiler-config-test/pom.xml ( no revision )
  2/src/main/java/org/apache/maven/plugin/ant/AntBuildWriter.java ( no revision )
  2/src/main/java/org/apache/maven/plugin/ant/ArtifactResolverWrapper.java ( no revision )
  2/src/main/java/org/apache/maven/plugin/ant/AntMojo.java ( no revision )
  2/src/main/java/org/apache/maven/plugin/ant/AntCleanMojo.java ( no revision )
  2/src/main/java/org/apache/maven/plugin/ant/AntBuildWriterUtil.java ( no revision )
  2/src/site/site.xml ( no revision )
  2/src/site/apt/usage.apt ( no revision )
  2/src/site/apt/index.apt ( no revision )
  2/src/site/apt/examples/using.apt ( no revision )
  2/src/site/fml/faq.fml ( no revision )
  2/src/it/ear-it/verify.bsh ( no revision )
  2/src/it/ear-it/primary-source/pom.xml ( no revision )
  2/src/it/ear-it/ejbs/src/main/resources/META-INF/ejb-jar.xml ( no revision )
  2/src/it/ear-it/ejbs/pom.xml ( no revision )
  2/src/it/ear-it/ear/application.xml ( no revision )
  2/src/it/ear-it/ear/pom.xml ( no revision )
  2/src/it/ear-it/servlets/servlet/src/main/webapp/index.jsp ( no revision )
  2/src/it/ear-it/servlets/servlet/src/main/webapp/WEB-INF/web.xml ( no revision )
  2/src/it/ear-it/servlets/servlet/pom.xml ( no revision )
  2/src/it/ear-it/servlets/pom.xml ( no revision )
  2/src/it/ear-it/projects/logging/pom.xml ( no revision )
  2/src/it/ear-it/projects/pom.xml ( no revision )
  2/src/it/ear-it/pom.xml ( no revision )
  2/src/it/plugin-it/verify.bsh ( no revision )
  2/src/it/plugin-it/src/main/java/org/apache/maven/plugin/ant/it/TestMojo.java ( no revision )
  2/src/it/plugin-it/pom.xml ( no revision )
  2/src/it/webapp-it/verify.bsh ( no revision )
  2/src/it/webapp-it/src/main/webapp/index.jsp ( no revision )
  2/src/it/webapp-it/src/main/webapp/WEB-INF/web.xml ( no revision )
  2/src/it/webapp-it/pom.xml ( no revision )
  2/pom.xml ( no revision )

Changed: no author @ no date
Comment: no comment
Files changed:
  2/src/test/java/org/apache/maven/plugin/ant/stubs/AbstractAntTestMavenProjectStub.java ( no revision )
  2/src/test/java/org/apache/maven/plugin/ant/stubs/JavadocTestMavenProjectStub.java ( no revision )
  2/src/test/java/org/apache/maven/plugin/ant/stubs/AntNoDepTestMavenProjectStub.java ( no revision )
  2/src/test/java/org/apache/maven/plugin/ant/stubs/AntTestMavenProjectStub.java ( no revision )
  2/src/test/java/org/apache/maven/plugin/ant/stubs/SettingsStub.java ( no revision )
  2/src/test/java/org/apache/maven/plugin/ant/AntWrapper.java ( no revision )
  2/src/test/java/org/apache/maven/plugin/ant/AntMojoTest.java ( no revision )
  2/src/test/java/org/apache/maven/plugin/ant/AntBuildWriterUtilTest.java ( no revision )
  2/src/test/resources/unit/ant-test/src/test/java/org/apache/maven/plugins/ant/test/AppTest.java ( no revision )
  2/src/test/resources/unit/ant-test/src/test/resources/test.txt ( no revision )
  2/src/test/resources/unit/ant-test/src/main/java/org/apache/maven/plugins/ant/test/App.java ( no revision )
  2/src/test/resources/unit/ant-test/src/main/resources/main.txt ( no revision )
  2/src/test/resources/unit/ant-test/pom.xml ( no revision )
  2/src/test/resources/unit/ant-nodep-test/src/main/java/org/apache/maven/plugins/ant/test/App.java ( no revision )
  2/src/test/resources/unit/ant-nodep-test/src/main/resources/main.txt ( no revision )
  2/src/test/resources/unit/ant-nodep-test/pom.xml ( no revision )
  2/src/test/resources/unit/ant-javadoc-test/src/test/java/org/apache/maven/plugins/ant/test/AppTest.java ( no revision )
  2/src/test/resources/unit/ant-javadoc-test/src/test/resources/test.txt ( no revision )
  2/src/test/resources/unit/ant-javadoc-test/src/main/java/org/apache/maven/plugins/ant/test/App.java ( no revision )
  2/src/test/resources/unit/ant-javadoc-test/src/main/resources/main.txt ( no revision )
  2/src/test/resources/unit/ant-javadoc-test/pom.xml ( no revision )
  2/src/test/resources/unit/ant-war-config-test/pom.xml ( no revision )
  2/src/test/resources/unit/ant-compiler-config-test/pom.xml ( no revision )
  2/src/main/java/org/apache/maven/plugin/ant/AntBuildWriter.java ( no revision )
  2/src/main/java/org/apache/maven/plugin/ant/ArtifactResolverWrapper.java ( no revision )
  2/src/main/java/org/apache/maven/plugin/ant/AntMojo.java ( no revision )
  2/src/main/java/org/apache/maven/plugin/ant/AntCleanMojo.java ( no revision )
  2/src/main/java/org/apache/maven/plugin/ant/AntBuildWriterUtil.java ( no revision )
  2/src/site/site.xml ( no revision )
  2/src/site/apt/usage.apt ( no revision )
  2/src/site/apt/index.apt ( no revision )
  2/src/site/apt/examples/using.apt ( no revision )
  2/src/site/fml/faq.fml ( no revision )
  2/src/it/ear-it/verify.bsh ( no revision )
  2/src/it/ear-it/primary-source/pom.xml ( no revision )
  2/src/it/ear-it/ejbs/src/main/resources/META-INF/ejb-jar.xml ( no revision )
  2/src/it/ear-it/ejbs/pom.xml ( no revision )
  2/src/it/ear-it/ear/application.xml ( no revision )
  2/src/it/ear-it/ear/pom.xml ( no revision )
  2/src/it/ear-it/servlets/servlet/src/main/webapp/index.jsp ( no revision )
  2/src/it/ear-it/servlets/servlet/src/main/webapp/WEB-INF/web.xml ( no revision )
  2/src/it/ear-it/servlets/servlet/pom.xml ( no revision )
  2/src/it/ear-it/servlets/pom.xml ( no revision )
  2/src/it/ear-it/projects/logging/pom.xml ( no revision )
  2/src/it/ear-it/projects/pom.xml ( no revision )
  2/src/it/ear-it/pom.xml ( no revision )
  2/src/it/plugin-it/verify.bsh ( no revision )
  2/src/it/plugin-it/src/main/java/org/apache/maven/plugin/ant/it/TestMojo.java ( no revision )
  2/src/it/plugin-it/pom.xml ( no revision )
  2/src/it/webapp-it/verify.bsh ( no revision )
  2/src/it/webapp-it/src/main/webapp/index.jsp ( no revision )
  2/src/it/webapp-it/src/main/webapp/WEB-INF/web.xml ( no revision )
  2/src/it/webapp-it/pom.xml ( no revision )
  2/pom.xml ( no revision )

Changed: no author @ no date
Comment: no comment
Files changed:
  2/src/test/java/org/apache/maven/plugin/ant/stubs/AbstractAntTestMavenProjectStub.java ( no revision )
  2/src/test/java/org/apache/maven/plugin/ant/stubs/JavadocTestMavenProjectStub.java ( no revision )
  2/src/test/java/org/apache/maven/plugin/ant/stubs/AntNoDepTestMavenProjectStub.java ( no revision )
  2/src/test/java/org/apache/maven/plugin/ant/stubs/AntTestMavenProjectStub.java ( no revision )
  2/src/test/java/org/apache/maven/plugin/ant/stubs/SettingsStub.java ( no revision )
  2/src/test/java/org/apache/maven/plugin/ant/AntWrapper.java ( no revision )
  2/src/test/java/org/apache/maven/plugin/ant/AntMojoTest.java ( no revision )
  2/src/test/java/org/apache/maven/plugin/ant/AntBuildWriterUtilTest.java ( no revision )
  2/src/test/resources/unit/ant-test/src/test/java/org/apache/maven/plugins/ant/test/AppTest.java ( no revision )
  2/src/test/resources/unit/ant-test/src/test/resources/test.txt ( no revision )
  2/src/test/resources/unit/ant-test/src/main/java/org/apache/maven/plugins/ant/test/App.java ( no revision )
  2/src/test/resources/unit/ant-test/src/main/resources/main.txt ( no revision )
  2/src/test/resources/unit/ant-test/pom.xml ( no revision )
  2/src/test/resources/unit/ant-nodep-test/src/main/java/org/apache/maven/plugins/ant/test/App.java ( no revision )
  2/src/test/resources/unit/ant-nodep-test/src/main/resources/main.txt ( no revision )
  2/src/test/resources/unit/ant-nodep-test/pom.xml ( no revision )
  2/src/test/resources/unit/ant-javadoc-test/src/test/java/org/apache/maven/plugins/ant/test/AppTest.java ( no revision )
  2/src/test/resources/unit/ant-javadoc-test/src/test/resources/test.txt ( no revision )
  2/src/test/resources/unit/ant-javadoc-test/src/main/java/org/apache/maven/plugins/ant/test/App.java ( no revision )
  2/src/test/resources/unit/ant-javadoc-test/src/main/resources/main.txt ( no revision )
  2/src/test/resources/unit/ant-javadoc-test/pom.xml ( no revision )
  2/src/test/resources/unit/ant-war-config-test/pom.xml ( no revision )
  2/src/test/resources/unit/ant-compiler-config-test/pom.xml ( no revision )
  2/src/main/java/org/apache/maven/plugin/ant/AntBuildWriter.java ( no revision )
  2/src/main/java/org/apache/maven/plugin/ant/ArtifactResolverWrapper.java ( no revision )
  2/src/main/java/org/apache/maven/plugin/ant/AntMojo.java ( no revision )
  2/src/main/java/org/apache/maven/plugin/ant/AntCleanMojo.java ( no revision )
  2/src/main/java/org/apache/maven/plugin/ant/AntBuildWriterUtil.java ( no revision )
  2/src/site/site.xml ( no revision )
  2/src/site/apt/usage.apt ( no revision )
  2/src/site/apt/index.apt ( no revision )
  2/src/site/apt/examples/using.apt ( no revision )
  2/src/site/fml/faq.fml ( no revision )
  2/src/it/ear-it/verify.bsh ( no revision )
  2/src/it/ear-it/primary-source/pom.xml ( no revision )
  2/src/it/ear-it/ejbs/src/main/resources/META-INF/ejb-jar.xml ( no revision )
  2/src/it/ear-it/ejbs/pom.xml ( no revision )
  2/src/it/ear-it/ear/application.xml ( no revision )
  2/src/it/ear-it/ear/pom.xml ( no revision )
  2/src/it/ear-it/servlets/servlet/src/main/webapp/index.jsp ( no revision )
  2/src/it/ear-it/servlets/servlet/src/main/webapp/WEB-INF/web.xml ( no revision )
  2/src/it/ear-it/servlets/servlet/pom.xml ( no revision )
  2/src/it/ear-it/servlets/pom.xml ( no revision )
  2/src/it/ear-it/projects/logging/pom.xml ( no revision )
  2/src/it/ear-it/projects/pom.xml ( no revision )
  2/src/it/ear-it/pom.xml ( no revision )
  2/src/it/plugin-it/verify.bsh ( no revision )
  2/src/it/plugin-it/src/main/java/org/apache/maven/plugin/ant/it/TestMojo.java ( no revision )
  2/src/it/plugin-it/pom.xml ( no revision )
  2/src/it/webapp-it/verify.bsh ( no revision )
  2/src/it/webapp-it/src/main/webapp/index.jsp ( no revision )
  2/src/it/webapp-it/src/main/webapp/WEB-INF/web.xml ( no revision )
  2/src/it/webapp-it/pom.xml ( no revision )
  2/pom.xml ( no revision )

Changed: no author @ no date
Comment: no comment
Files changed:
  2/src/test/java/org/apache/maven/plugin/ant/stubs/AbstractAntTestMavenProjectStub.java ( no revision )
  2/src/test/java/org/apache/maven/plugin/ant/stubs/JavadocTestMavenProjectStub.java ( no revision )
  2/src/test/java/org/apache/maven/plugin/ant/stubs/AntNoDepTestMavenProjectStub.java ( no revision )
  2/src/test/java/org/apache/maven/plugin/ant/stubs/AntTestMavenProjectStub.java ( no revision )
  2/src/test/java/org/apache/maven/plugin/ant/stubs/SettingsStub.java ( no revision )
  2/src/test/java/org/apache/maven/plugin/ant/AntWrapper.java ( no revision )
  2/src/test/java/org/apache/maven/plugin/ant/AntMojoTest.java ( no revision )
  2/src/test/java/org/apache/maven/plugin/ant/AntBuildWriterUtilTest.java ( no revision )
  2/src/test/resources/unit/ant-test/src/test/java/org/apache/maven/plugins/ant/test/AppTest.java ( no revision )
  2/src/test/resources/unit/ant-test/src/test/resources/test.txt ( no revision )
  2/src/test/resources/unit/ant-test/src/main/java/org/apache/maven/plugins/ant/test/App.java ( no revision )
  2/src/test/resources/unit/ant-test/src/main/resources/main.txt ( no revision )
  2/src/test/resources/unit/ant-test/pom.xml ( no revision )
  2/src/test/resources/unit/ant-nodep-test/src/main/java/org/apache/maven/plugins/ant/test/App.java ( no revision )
  2/src/test/resources/unit/ant-nodep-test/src/main/resources/main.txt ( no revision )
  2/src/test/resources/unit/ant-nodep-test/pom.xml ( no revision )
  2/src/test/resources/unit/ant-javadoc-test/src/test/java/org/apache/maven/plugins/ant/test/AppTest.java ( no revision )
  2/src/test/resources/unit/ant-javadoc-test/src/test/resources/test.txt ( no revision )
  2/src/test/resources/unit/ant-javadoc-test/src/main/java/org/apache/maven/plugins/ant/test/App.java ( no revision )
  2/src/test/resources/unit/ant-javadoc-test/src/main/resources/main.txt ( no revision )
  2/src/test/resources/unit/ant-javadoc-test/pom.xml ( no revision )
  2/src/test/resources/unit/ant-war-config-test/pom.xml ( no revision )
  2/src/test/resources/unit/ant-compiler-config-test/pom.xml ( no revision )
  2/src/main/java/org/apache/maven/plugin/ant/AntBuildWriter.java ( no revision )
  2/src/main/java/org/apache/maven/plugin/ant/ArtifactResolverWrapper.java ( no revision )
  2/src/main/java/org/apache/maven/plugin/ant/AntMojo.java ( no revision )
  2/src/main/java/org/apache/maven/plugin/ant/AntCleanMojo.java ( no revision )
  2/src/main/java/org/apache/maven/plugin/ant/AntBuildWriterUtil.java ( no revision )
  2/src/site/site.xml ( no revision )
  2/src/site/apt/usage.apt ( no revision )
  2/src/site/apt/index.apt ( no revision )
  2/src/site/apt/examples/using.apt ( no revision )
  2/src/site/fml/faq.fml ( no revision )
  2/src/it/ear-it/verify.bsh ( no revision )
  2/src/it/ear-it/primary-source/pom.xml ( no revision )
  2/src/it/ear-it/ejbs/src/main/resources/META-INF/ejb-jar.xml ( no revision )
  2/src/it/ear-it/ejbs/pom.xml ( no revision )
  2/src/it/ear-it/ear/application.xml ( no revision )
  2/src/it/ear-it/ear/pom.xml ( no revision )
  2/src/it/ear-it/servlets/servlet/src/main/webapp/index.jsp ( no revision )
  2/src/it/ear-it/servlets/servlet/src/main/webapp/WEB-INF/web.xml ( no revision )
  2/src/it/ear-it/servlets/servlet/pom.xml ( no revision )
  2/src/it/ear-it/servlets/pom.xml ( no revision )
  2/src/it/ear-it/projects/logging/pom.xml ( no revision )
  2/src/it/ear-it/projects/pom.xml ( no revision )
  2/src/it/ear-it/pom.xml ( no revision )
  2/src/it/plugin-it/verify.bsh ( no revision )
  2/src/it/plugin-it/src/main/java/org/apache/maven/plugin/ant/it/TestMojo.java ( no revision )
  2/src/it/plugin-it/pom.xml ( no revision )
  2/src/it/webapp-it/verify.bsh ( no revision )
  2/src/it/webapp-it/src/main/webapp/index.jsp ( no revision )
  2/src/it/webapp-it/src/main/webapp/WEB-INF/web.xml ( no revision )
  2/src/it/webapp-it/pom.xml ( no revision )
  2/pom.xml ( no revision )

Changed: no author @ no date
Comment: no comment
Files changed:
  2/src/test/java/org/apache/maven/plugin/ant/stubs/AbstractAntTestMavenProjectStub.java ( no revision )
  2/src/test/java/org/apache/maven/plugin/ant/stubs/JavadocTestMavenProjectStub.java ( no revision )
  2/src/test/java/org/apache/maven/plugin/ant/stubs/AntNoDepTestMavenProjectStub.java ( no revision )
  2/src/test/java/org/apache/maven/plugin/ant/stubs/AntTestMavenProjectStub.java ( no revision )
  2/src/test/java/org/apache/maven/plugin/ant/stubs/SettingsStub.java ( no revision )
  2/src/test/java/org/apache/maven/plugin/ant/AntWrapper.java ( no revision )
  2/src/test/java/org/apache/maven/plugin/ant/AntMojoTest.java ( no revision )
  2/src/test/java/org/apache/maven/plugin/ant/AntBuildWriterUtilTest.java ( no revision )
  2/src/test/resources/unit/ant-test/src/test/java/org/apache/maven/plugins/ant/test/AppTest.java ( no revision )
  2/src/test/resources/unit/ant-test/src/test/resources/test.txt ( no revision )
  2/src/test/resources/unit/ant-test/src/main/java/org/apache/maven/plugins/ant/test/App.java ( no revision )
  2/src/test/resources/unit/ant-test/src/main/resources/main.txt ( no revision )
  2/src/test/resources/unit/ant-test/pom.xml ( no revision )
  2/src/test/resources/unit/ant-nodep-test/src/main/java/org/apache/maven/plugins/ant/test/App.java ( no revision )
  2/src/test/resources/unit/ant-nodep-test/src/main/resources/main.txt ( no revision )
  2/src/test/resources/unit/ant-nodep-test/pom.xml ( no revision )
  2/src/test/resources/unit/ant-javadoc-test/src/test/java/org/apache/maven/plugins/ant/test/AppTest.java ( no revision )
  2/src/test/resources/unit/ant-javadoc-test/src/test/resources/test.txt ( no revision )
  2/src/test/resources/unit/ant-javadoc-test/src/main/java/org/apache/maven/plugins/ant/test/App.java ( no revision )
  2/src/test/resources/unit/ant-javadoc-test/src/main/resources/main.txt ( no revision )
  2/src/test/resources/unit/ant-javadoc-test/pom.xml ( no revision )
  2/src/test/resources/unit/ant-war-config-test/pom.xml ( no revision )
  2/src/test/resources/unit/ant-compiler-config-test/pom.xml ( no revision )
  2/src/main/java/org/apache/maven/plugin/ant/AntBuildWriter.java ( no revision )
  2/src/main/java/org/apache/maven/plugin/ant/ArtifactResolverWrapper.java ( no revision )
  2/src/main/java/org/apache/maven/plugin/ant/AntMojo.java ( no revision )
  2/src/main/java/org/apache/maven/plugin/ant/AntCleanMojo.java ( no revision )
  2/src/main/java/org/apache/maven/plugin/ant/AntBuildWriterUtil.java ( no revision )
  2/src/site/site.xml ( no revision )
  2/src/site/apt/usage.apt ( no revision )
  2/src/site/apt/index.apt ( no revision )
  2/src/site/apt/examples/using.apt ( no revision )
  2/src/site/fml/faq.fml ( no revision )
  2/src/it/ear-it/verify.bsh ( no revision )
  2/src/it/ear-it/primary-source/pom.xml ( no revision )
  2/src/it/ear-it/ejbs/src/main/resources/META-INF/ejb-jar.xml ( no revision )
  2/src/it/ear-it/ejbs/pom.xml ( no revision )
  2/src/it/ear-it/ear/application.xml ( no revision )
  2/src/it/ear-it/ear/pom.xml ( no revision )
  2/src/it/ear-it/servlets/servlet/src/main/webapp/index.jsp ( no revision )
  2/src/it/ear-it/servlets/servlet/src/main/webapp/WEB-INF/web.xml ( no revision )
  2/src/it/ear-it/servlets/servlet/pom.xml ( no revision )
  2/src/it/ear-it/servlets/pom.xml ( no revision )
  2/src/it/ear-it/projects/logging/pom.xml ( no revision )
  2/src/it/ear-it/projects/pom.xml ( no revision )
  2/src/it/ear-it/pom.xml ( no revision )
  2/src/it/plugin-it/verify.bsh ( no revision )
  2/src/it/plugin-it/src/main/java/org/apache/maven/plugin/ant/it/TestMojo.java ( no revision )
  2/src/it/plugin-it/pom.xml ( no revision )
  2/src/it/webapp-it/verify.bsh ( no revision )
  2/src/it/webapp-it/src/main/webapp/index.jsp ( no revision )
  2/src/it/webapp-it/src/main/webapp/WEB-INF/web.xml ( no revision )
  2/src/it/webapp-it/pom.xml ( no revision )
  2/pom.xml ( no revision )

Changed: no author @ no date
Comment: no comment
Files changed:
  2/src/test/java/org/apache/maven/plugin/ant/stubs/AbstractAntTestMavenProjectStub.java ( no revision )
  2/src/test/java/org/apache/maven/plugin/ant/stubs/JavadocTestMavenProjectStub.java ( no revision )
  2/src/test/java/org/apache/maven/plugin/ant/stubs/AntNoDepTestMavenProjectStub.java ( no revision )
  2/src/test/java/org/apache/maven/plugin/ant/stubs/AntTestMavenProjectStub.java ( no revision )
  2/src/test/java/org/apache/maven/plugin/ant/stubs/SettingsStub.java ( no revision )
  2/src/test/java/org/apache/maven/plugin/ant/AntWrapper.java ( no revision )
  2/src/test/java/org/apache/maven/plugin/ant/AntMojoTest.java ( no revision )
  2/src/test/java/org/apache/maven/plugin/ant/AntBuildWriterUtilTest.java ( no revision )
  2/src/test/resources/unit/ant-test/src/test/java/org/apache/maven/plugins/ant/test/AppTest.java ( no revision )
  2/src/test/resources/unit/ant-test/src/test/resources/test.txt ( no revision )
  2/src/test/resources/unit/ant-test/src/main/java/org/apache/maven/plugins/ant/test/App.java ( no revision )
  2/src/test/resources/unit/ant-test/src/main/resources/main.txt ( no revision )
  2/src/test/resources/unit/ant-test/pom.xml ( no revision )
  2/src/test/resources/unit/ant-nodep-test/src/main/java/org/apache/maven/plugins/ant/test/App.java ( no revision )
  2/src/test/resources/unit/ant-nodep-test/src/main/resources/main.txt ( no revision )
  2/src/test/resources/unit/ant-nodep-test/pom.xml ( no revision )
  2/src/test/resources/unit/ant-javadoc-test/src/test/java/org/apache/maven/plugins/ant/test/AppTest.java ( no revision )
  2/src/test/resources/unit/ant-javadoc-test/src/test/resources/test.txt ( no revision )
  2/src/test/resources/unit/ant-javadoc-test/src/main/java/org/apache/maven/plugins/ant/test/App.java ( no revision )
  2/src/test/resources/unit/ant-javadoc-test/src/main/resources/main.txt ( no revision )
  2/src/test/resources/unit/ant-javadoc-test/pom.xml ( no revision )
  2/src/test/resources/unit/ant-war-config-test/pom.xml ( no revision )
  2/src/test/resources/unit/ant-compiler-config-test/pom.xml ( no revision )
  2/src/main/java/org/apache/maven/plugin/ant/AntBuildWriter.java ( no revision )
  2/src/main/java/org/apache/maven/plugin/ant/ArtifactResolverWrapper.java ( no revision )
  2/src/main/java/org/apache/maven/plugin/ant/AntMojo.java ( no revision )
  2/src/main/java/org/apache/maven/plugin/ant/AntCleanMojo.java ( no revision )
  2/src/main/java/org/apache/maven/plugin/ant/AntBuildWriterUtil.java ( no revision )
  2/src/site/site.xml ( no revision )
  2/src/site/apt/usage.apt ( no revision )
  2/src/site/apt/index.apt ( no revision )
  2/src/site/apt/examples/using.apt ( no revision )
  2/src/site/fml/faq.fml ( no revision )
  2/src/it/ear-it/verify.bsh ( no revision )
  2/src/it/ear-it/primary-source/pom.xml ( no revision )
  2/src/it/ear-it/ejbs/src/main/resources/META-INF/ejb-jar.xml ( no revision )
  2/src/it/ear-it/ejbs/pom.xml ( no revision )
  2/src/it/ear-it/ear/application.xml ( no revision )
  2/src/it/ear-it/ear/pom.xml ( no revision )
  2/src/it/ear-it/servlets/servlet/src/main/webapp/index.jsp ( no revision )
  2/src/it/ear-it/servlets/servlet/src/main/webapp/WEB-INF/web.xml ( no revision )
  2/src/it/ear-it/servlets/servlet/pom.xml ( no revision )
  2/src/it/ear-it/servlets/pom.xml ( no revision )
  2/src/it/ear-it/projects/logging/pom.xml ( no revision )
  2/src/it/ear-it/projects/pom.xml ( no revision )
  2/src/it/ear-it/pom.xml ( no revision )
  2/src/it/plugin-it/verify.bsh ( no revision )
  2/src/it/plugin-it/src/main/java/org/apache/maven/plugin/ant/it/TestMojo.java ( no revision )
  2/src/it/plugin-it/pom.xml ( no revision )
  2/src/it/webapp-it/verify.bsh ( no revision )
  2/src/it/webapp-it/src/main/webapp/index.jsp ( no revision )
  2/src/it/webapp-it/src/main/webapp/WEB-INF/web.xml ( no revision )
  2/src/it/webapp-it/pom.xml ( no revision )
  2/pom.xml ( no revision )

****************************************************************************
Dependencies Changes:
****************************************************************************
No dependencies changed

****************************************************************************
Test Summary:
****************************************************************************
Tests: 9
Failures: 0
Total time: 6490

****************************************************************************
Output:
****************************************************************************
[INFO] Scanning for projects...
[INFO] ----------------------------------------------------------------------------
[INFO] Building Maven Ant Plugin
[INFO]    task-segment: [clean, install]
[INFO] ----------------------------------------------------------------------------
[INFO] [clean:clean]
[INFO] Deleting file-set: src/it (included: [**/target, **/build.xml, **/maven-build.xml, **/maven-build.properties], excluded: [])
[INFO] [plugin:descriptor]
[INFO] Using 2 extractors.
[INFO] Applying extractor for language: java
[INFO] Extractor for language: java found 2 mojo descriptors.
[INFO] Applying extractor for language: bsh
[INFO] Extractor for language: bsh found 0 mojo descriptors.
[INFO] [resources:resources]
[INFO] Using default encoding to copy filtered resources.
[INFO] Resource directory does not exist: /export/home/build/data/continuum/checkouts/2/src/main/resources
[INFO] [compiler:compile]
[INFO] Compiling 5 source files to /export/home/build/data/continuum/checkouts/2/target/classes
[INFO] [resources:testResources]
[INFO] Using default encoding to copy filtered resources.
[INFO] Copying 15 resources
[INFO] [compiler:testCompile]
[INFO] Compiling 8 source files to /export/home/build/data/continuum/checkouts/2/target/test-classes
[INFO] [surefire:test]
[INFO] Surefire report directory: /export/home/build/data/continuum/checkouts/2/target/surefire-reports

-------------------------------------------------------
 T E S T S
-------------------------------------------------------
Running org.apache.maven.plugin.ant.AntBuildWriterUtilTest
Tests run: 6, Failures: 0, Errors: 0, Skipped: 0, Time elapsed: 3.124 sec
Running org.apache.maven.plugin.ant.AntMojoTest
[INFO] Wrote Ant project for ant-test to /export/home/build/data/continuum/checkouts/2/target/test/unit/ant-test
[INFO] Wrote Ant project for ant-nodep-test to /export/home/build/data/continuum/checkouts/2/target/test/unit/ant-nodep-test
[INFO] Wrote Ant project for ant-test to /export/home/build/data/continuum/checkouts/2/target/test/unit/ant-javadoc-test
Tests run: 3, Failures: 0, Errors: 0, Skipped: 0, Time elapsed: 3.391 sec

Results :

Tests run: 9, Failures: 0, Errors: 0, Skipped: 0

[INFO] [jar:jar]
[INFO] Building jar: /export/home/build/data/continuum/checkouts/2/target/maven-ant-plugin-2.1-SNAPSHOT.jar
[INFO] [plugin:addPluginArtifactMetadata]
[INFO] [install:install-file {execution: it-test}]
[INFO] Layout: class org.apache.maven.artifact.repository.layout.DefaultRepositoryLayout
[INFO] Installing /export/home/build/data/continuum/checkouts/2/target/maven-ant-plugin-2.1-SNAPSHOT.jar to /export/home/build/data/continuum/checkouts/2/target/local-repo/org/apache/maven/plugins/maven-ant-plugin/2.1-SNAPSHOT/maven-ant-plugin-2.1-SNAPSHOT.jar
[INFO] Creating Checksums...
[INFO] Installing /export/home/build/data/continuum/checkouts/2/pom.xml to /export/home/build/data/continuum/checkouts/2/target/local-repo/org/apache/maven/plugins/maven-ant-plugin/2.1-SNAPSHOT/maven-ant-plugin-2.1-SNAPSHOT.pom
[INFO] Creating Checksums...
[INFO] [invoker:run {execution: integration-test}]
[INFO] Building: ear-it/pom.xml
[INFO] ...SUCCESS.
[INFO] Building: plugin-it/pom.xml
[INFO] ...SUCCESS.
[INFO] Building: webapp-it/pom.xml
[INFO] ...SUCCESS.
[INFO] 

---------------------------------------
Execution Summary:
Builds Passing: 3
Builds Failing: 0
---------------------------------------

[INFO] [antrun:run {execution: default}]
[INFO] Executing tasks

clean:

clean:

clean:
   [delete] Deleting directory /export/home/build/data/continuum/checkouts/2/src/it/ear-it/projects/logging/target

clean:
   [delete] Deleting directory /export/home/build/data/continuum/checkouts/2/src/it/ear-it/primary-source/target

clean:

clean:
   [delete] Deleting directory /export/home/build/data/continuum/checkouts/2/src/it/ear-it/servlets/servlet/target

clean:
   [delete] Deleting directory /export/home/build/data/continuum/checkouts/2/src/it/ear-it/ejbs/target

clean:
   [delete] Deleting directory /export/home/build/data/continuum/checkouts/2/src/it/ear-it/ear/target

package:

package:

test-offline:

get-deps:

compile:
    [mkdir] Created dir: /export/home/build/data/continuum/checkouts/2/src/it/ear-it/projects/logging/target/classes

test-junit-present:

junit-present:
     [echo] =================================== WARNING ===================================
     [echo]  Junit isn't present in your $ANT_HOME/lib directory. Tests not executed. 
     [echo] ===============================================================================

compile-tests:

test:

package:
      [jar] Building MANIFEST-only jar: /export/home/build/data/continuum/checkouts/2/src/it/ear-it/projects/logging/target/logging-1.0.jar

test-offline:

get-deps:

compile:
    [mkdir] Created dir: /export/home/build/data/continuum/checkouts/2/src/it/ear-it/primary-source/target/classes

test-junit-present:

junit-present:
     [echo] =================================== WARNING ===================================
     [echo]  Junit isn't present in your $ANT_HOME/lib directory. Tests not executed. 
     [echo] ===============================================================================

compile-tests:

test:

package:
      [jar] Building MANIFEST-only jar: /export/home/build/data/continuum/checkouts/2/src/it/ear-it/primary-source/target/primary-source-1.0.jar

package:

test-offline:

get-deps:

compile:
    [mkdir] Created dir: /export/home/build/data/continuum/checkouts/2/src/it/ear-it/servlets/servlet/target/classes

test-junit-present:

junit-present:
     [echo] =================================== WARNING ===================================
     [echo]  Junit isn't present in your $ANT_HOME/lib directory. Tests not executed. 
     [echo] ===============================================================================

compile-tests:

test:

package:
    [mkdir] Created dir: /export/home/build/data/continuum/checkouts/2/src/it/ear-it/servlets/servlet/target/servlet-1.0/WEB-INF/lib
      [war] Building war: /export/home/build/data/continuum/checkouts/2/src/it/ear-it/servlets/servlet/target/servlet-1.0.war
      [war] Warning: selected war files include a WEB-INF/web.xml which will be ignored (please use webxml attribute to war task)

test-offline:

get-deps:

compile:
    [mkdir] Created dir: /export/home/build/data/continuum/checkouts/2/src/it/ear-it/ejbs/target/classes
     [copy] Copying 1 file to /export/home/build/data/continuum/checkouts/2/src/it/ear-it/ejbs/target/classes

test-junit-present:

junit-present:
     [echo] =================================== WARNING ===================================
     [echo]  Junit isn't present in your $ANT_HOME/lib directory. Tests not executed. 
     [echo] ===============================================================================

compile-tests:

test:

package:
      [jar] Building jar: /export/home/build/data/continuum/checkouts/2/src/it/ear-it/ejbs/target/ejbs-1.0.jar

test-offline:

get-deps:

compile:
    [mkdir] Created dir: /export/home/build/data/continuum/checkouts/2/src/it/ear-it/ear/target/classes

test-junit-present:

junit-present:
     [echo] =================================== WARNING ===================================
     [echo]  Junit isn't present in your $ANT_HOME/lib directory. Tests not executed. 
     [echo] ===============================================================================

compile-tests:

test:

package:
    [mkdir] Created dir: /export/home/build/data/continuum/checkouts/2/src/it/ear-it/ear/target/ear-1.0
     [copy] Copying 1 file to /export/home/build/data/continuum/checkouts/2/src/it/ear-it/ear/target/ear-1.0
     [copy] Copying 1 file to /export/home/build/data/continuum/checkouts/2/src/it/ear-it/ear/target/ear-1.0
     [copy] Copying 1 file to /export/home/build/data/continuum/checkouts/2/src/it/ear-it/ear/target/ear-1.0
     [copy] Copying 1 file to /export/home/build/data/continuum/checkouts/2/src/it/ear-it/ear/target/ear-1.0
      [ear] Building ear: /export/home/build/data/continuum/checkouts/2/src/it/ear-it/ear/target/ear-1.0.ear

clean:
   [delete] Deleting directory /export/home/build/data/continuum/checkouts/2/src/it/webapp-it/target

test-offline:

get-deps:
      [get] Getting: file:/export/home/build/data/continuum/checkouts/2/src/it/webapp-it/../../../target/local-repo/junit/junit/3.8.1/junit-3.8.1.jar
      [get] To: /export/home/build/data/continuum/checkouts/2/target/local-repo/junit/junit/3.8.1/junit-3.8.1.jar
      [get] Getting: http://people.apache.org/maven-snapshot-repository/junit/junit/3.8.1/junit-3.8.1.jar
      [get] To: /export/home/build/data/continuum/checkouts/2/target/local-repo/junit/junit/3.8.1/junit-3.8.1.jar
      [get] Error opening connection java.io.FileNotFoundException: http://people.apache.org/maven-snapshot-repository/junit/junit/3.8.1/junit-3.8.1.jar
      [get] Error opening connection java.io.FileNotFoundException: http://people.apache.org/maven-snapshot-repository/junit/junit/3.8.1/junit-3.8.1.jar
      [get] Error opening connection java.io.FileNotFoundException: http://people.apache.org/maven-snapshot-repository/junit/junit/3.8.1/junit-3.8.1.jar
      [get] Can't get http://people.apache.org/maven-snapshot-repository/junit/junit/3.8.1/junit-3.8.1.jar to /export/home/build/data/continuum/checkouts/2/target/local-repo/junit/junit/3.8.1/junit-3.8.1.jar
      [get] Getting: http://repo1.maven.org/maven2/junit/junit/3.8.1/junit-3.8.1.jar
      [get] To: /export/home/build/data/continuum/checkouts/2/target/local-repo/junit/junit/3.8.1/junit-3.8.1.jar
      [get] Not modified - so not downloaded

compile:
    [mkdir] Created dir: /export/home/build/data/continuum/checkouts/2/src/it/webapp-it/target/classes

test-junit-present:

junit-present:
     [echo] =================================== WARNING ===================================
     [echo]  Junit isn't present in your $ANT_HOME/lib directory. Tests not executed. 
     [echo] ===============================================================================

compile-tests:

test:

package:
    [mkdir] Created dir: /export/home/build/data/continuum/checkouts/2/src/it/webapp-it/target/ant-webapp-test/WEB-INF/lib
      [war] Building war: /export/home/build/data/continuum/checkouts/2/src/it/webapp-it/target/ant-webapp-test.war
      [war] Warning: selected war files include a WEB-INF/web.xml which will be ignored (please use webxml attribute to war task)

clean:
   [delete] Deleting directory /export/home/build/data/continuum/checkouts/2/src/it/plugin-it/target

test-offline:

get-deps:
      [get] Getting: file:/export/home/build/data/continuum/checkouts/2/src/it/plugin-it/../../../target/local-repo/org/apache/maven/maven-plugin-api/2.0.1/maven-plugin-api-2.0.1.jar
      [get] To: /export/home/build/data/continuum/checkouts/2/target/local-repo/org/apache/maven/maven-plugin-api/2.0.1/maven-plugin-api-2.0.1.jar
      [get] Getting: http://people.apache.org/maven-snapshot-repository/org/apache/maven/maven-plugin-api/2.0.1/maven-plugin-api-2.0.1.jar
      [get] To: /export/home/build/data/continuum/checkouts/2/target/local-repo/org/apache/maven/maven-plugin-api/2.0.1/maven-plugin-api-2.0.1.jar
      [get] Error opening connection java.io.FileNotFoundException: http://people.apache.org/maven-snapshot-repository/org/apache/maven/maven-plugin-api/2.0.1/maven-plugin-api-2.0.1.jar
      [get] Error opening connection java.io.FileNotFoundException: http://people.apache.org/maven-snapshot-repository/org/apache/maven/maven-plugin-api/2.0.1/maven-plugin-api-2.0.1.jar
      [get] Error opening connection java.io.FileNotFoundException: http://people.apache.org/maven-snapshot-repository/org/apache/maven/maven-plugin-api/2.0.1/maven-plugin-api-2.0.1.jar
      [get] Can't get http://people.apache.org/maven-snapshot-repository/org/apache/maven/maven-plugin-api/2.0.1/maven-plugin-api-2.0.1.jar to /export/home/build/data/continuum/checkouts/2/target/local-repo/org/apache/maven/maven-plugin-api/2.0.1/maven-plugin-api-2.0.1.jar
      [get] Getting: http://repo1.maven.org/maven2/org/apache/maven/maven-plugin-api/2.0.1/maven-plugin-api-2.0.1.jar
      [get] To: /export/home/build/data/continuum/checkouts/2/target/local-repo/org/apache/maven/maven-plugin-api/2.0.1/maven-plugin-api-2.0.1.jar
      [get] Not modified - so not downloaded
      [get] Getting: http://repo1.maven.org/maven2/org/apache/maven/maven-plugin-api/2.0.1/maven-plugin-api-2.0.1.jar
      [get] To: /export/home/build/data/continuum/checkouts/2/target/local-repo/org/apache/maven/maven-plugin-api/2.0.1/maven-plugin-api-2.0.1.jar
      [get] Not modified - so not downloaded

compile:
    [mkdir] Created dir: /export/home/build/data/continuum/checkouts/2/src/it/plugin-it/target/classes
    [javac] Compiling 1 source file to /export/home/build/data/continuum/checkouts/2/src/it/plugin-it/target/classes
    [javac] error: error reading /export/home/build/data/continuum/checkouts/2/target/local-repo/org/apache/maven/maven-plugin-api/2.0.1/maven-plugin-api-2.0.1.jar; error in opening zip file
    [javac] /export/home/build/data/continuum/checkouts/2/src/it/plugin-it/src/main/java/org/apache/maven/plugin/ant/it/TestMojo.java:19: cannot find symbol
    [javac] symbol  : class AbstractMojo
    [javac] location: package org.apache.maven.plugin
    [javac] import org.apache.maven.plugin.AbstractMojo;
    [javac]                                ^
    [javac] /export/home/build/data/continuum/checkouts/2/src/it/plugin-it/src/main/java/org/apache/maven/plugin/ant/it/TestMojo.java:28: cannot find symbol
    [javac] symbol: class AbstractMojo
    [javac]     extends AbstractMojo
    [javac]             ^
    [javac] 3 errors
[INFO] ------------------------------------------------------------------------
[ERROR] BUILD ERROR
[INFO] ------------------------------------------------------------------------
[INFO] Error executing ant tasks

Embedded error: The following error occurred while executing this line:
/export/home/build/data/continuum/checkouts/2/src/it/plugin-it/maven-build.xml:77: Compile failed; see the compiler error output for details.
[INFO] ------------------------------------------------------------------------
[INFO] For more information, run Maven with the -e switch
[INFO] ------------------------------------------------------------------------
[INFO] Total time: 2 minutes 47 seconds
[INFO] Finished at: Thu Aug 23 12:50:37 GMT+00:00 2007
[INFO] Final Memory: 14M/334M
[INFO] ------------------------------------------------------------------------

****************************************************************************



Mime
View raw message