maven-notifications mailing list archives

Site index · List index
Message view « Date » · « Thread »
Top « Date » · « Thread »
From "Continuum@maven.zones.apache.org" <contin...@maven.zones.apache.org>
Subject [continuum] BUILD FAILURE: Maven AntRun Plugin
Date Wed, 22 Aug 2007 18:56:01 GMT
Online report : http://maven.zones.apache.org/continuum/buildResult.action?buildId=16853&projectId=4

Build statistics:
  State: Failed
  Previous State: Failed
  Started at: Wed 22 Aug 2007 18:54:53 +0000
  Finished at: Wed 22 Aug 2007 18:56:00 +0000
  Total time: 1m 7s
  Build Trigger: Schedule
  Build Number: 0
  Exit code: 1
  Building machine hostname: maven.zones.apache.org
  Operating system : SunOS(unknown)
  Java Home version : 
          java version "1.5.0_12"
          Java(TM) 2 Runtime Environment, Standard Edition (build 1.5.0_12-b04)
          Java HotSpot(TM) Server VM (build 1.5.0_12-b04, mixed mode)
        
  Builder version :
          Maven version: 2.0.7
          Java version: 1.5.0_12
          OS name: "sunos" version: "5.10" arch: "x86"
    
****************************************************************************
SCM Changes:
****************************************************************************
Changed: no author @ no date
Comment: no comment
Files changed:
  4/src/test/java/org/apache/maven/plugin/antrun/AntRunMojoTest.java ( no revision )
  4/src/test/resources/unit/antrun-default-test/antrun-default-test-plugin-config.xml ( no
revision )
  4/src/test/resources/unit/tasksattributes-test/tasksattributes-test-plugin-config.xml (
no revision )
  4/src/main/java/org/apache/maven/plugin/antrun/components/AntTargetConverter.java ( no revision
)
  4/src/main/java/org/apache/maven/plugin/antrun/AntPropertyHelper.java ( no revision )
  4/src/main/java/org/apache/maven/plugin/antrun/AbstractAntMojo.java ( no revision )
  4/src/main/java/org/apache/maven/plugin/antrun/AntRunMojo.java ( no revision )
  4/src/main/resources/META-INF/plexus/components.xml ( no revision )
  4/src/site/site.xml ( no revision )
  4/src/site/apt/usage.apt ( no revision )
  4/src/site/apt/classpaths.apt ( no revision )
  4/src/site/apt/index.apt ( no revision )
  4/src/site/apt/examples/tasksAttributes.apt ( no revision )
  4/src/site/apt/examples/classpaths.apt ( no revision )
  4/src/site/fml/faq.fml ( no revision )
  4/src/it/test1/src/main/java/Test.java ( no revision )
  4/src/it/test1/pom.xml ( no revision )
  4/src/it/test1/build.xml ( no revision )
  4/src/it/test2/pom.xml ( no revision )
  4/src/it/test3/pom.xml ( no revision )
  4/src/it/test3/build.xml ( no revision )
  4/src/it/test4/pom.xml ( no revision )
  4/src/it/test4/build.xml ( no revision )
  4/src/it/test5/src/main/java/TestTask.java ( no revision )
  4/src/it/test5/pom.xml ( no revision )
  4/src/it/test5/build.xml ( no revision )
  4/src/it/test6/calc.g ( no revision )
  4/src/it/test6/pom.xml ( no revision )
  4/src/it/test6/build.xml ( no revision )
  4/src/it/pom.xml ( no revision )
  4/pom.xml ( no revision )

****************************************************************************
SCM Changes since last success:
****************************************************************************
Changed: no author @ no date
Comment: no comment
Files changed:
  4/src/test/java/org/apache/maven/plugin/antrun/AntRunMojoTest.java ( no revision )
  4/src/test/resources/unit/antrun-default-test/antrun-default-test-plugin-config.xml ( no
revision )
  4/src/test/resources/unit/tasksattributes-test/tasksattributes-test-plugin-config.xml (
no revision )
  4/src/main/java/org/apache/maven/plugin/antrun/components/AntTargetConverter.java ( no revision
)
  4/src/main/java/org/apache/maven/plugin/antrun/AntPropertyHelper.java ( no revision )
  4/src/main/java/org/apache/maven/plugin/antrun/AbstractAntMojo.java ( no revision )
  4/src/main/java/org/apache/maven/plugin/antrun/AntRunMojo.java ( no revision )
  4/src/main/resources/META-INF/plexus/components.xml ( no revision )
  4/src/site/site.xml ( no revision )
  4/src/site/apt/usage.apt ( no revision )
  4/src/site/apt/classpaths.apt ( no revision )
  4/src/site/apt/index.apt ( no revision )
  4/src/site/apt/examples/tasksAttributes.apt ( no revision )
  4/src/site/apt/examples/classpaths.apt ( no revision )
  4/src/site/fml/faq.fml ( no revision )
  4/src/it/test1/src/main/java/Test.java ( no revision )
  4/src/it/test1/pom.xml ( no revision )
  4/src/it/test1/build.xml ( no revision )
  4/src/it/test2/pom.xml ( no revision )
  4/src/it/test3/pom.xml ( no revision )
  4/src/it/test3/build.xml ( no revision )
  4/src/it/test4/pom.xml ( no revision )
  4/src/it/test4/build.xml ( no revision )
  4/src/it/test5/src/main/java/TestTask.java ( no revision )
  4/src/it/test5/pom.xml ( no revision )
  4/src/it/test5/build.xml ( no revision )
  4/src/it/test6/calc.g ( no revision )
  4/src/it/test6/pom.xml ( no revision )
  4/src/it/test6/build.xml ( no revision )
  4/src/it/pom.xml ( no revision )
  4/pom.xml ( no revision )

Changed: no author @ no date
Comment: no comment
Files changed:
  4/src/test/java/org/apache/maven/plugin/antrun/AntRunMojoTest.java ( no revision )
  4/src/test/resources/unit/antrun-default-test/antrun-default-test-plugin-config.xml ( no
revision )
  4/src/test/resources/unit/tasksattributes-test/tasksattributes-test-plugin-config.xml (
no revision )
  4/src/main/java/org/apache/maven/plugin/antrun/components/AntTargetConverter.java ( no revision
)
  4/src/main/java/org/apache/maven/plugin/antrun/AntPropertyHelper.java ( no revision )
  4/src/main/java/org/apache/maven/plugin/antrun/AbstractAntMojo.java ( no revision )
  4/src/main/java/org/apache/maven/plugin/antrun/AntRunMojo.java ( no revision )
  4/src/main/resources/META-INF/plexus/components.xml ( no revision )
  4/src/site/site.xml ( no revision )
  4/src/site/apt/usage.apt ( no revision )
  4/src/site/apt/classpaths.apt ( no revision )
  4/src/site/apt/index.apt ( no revision )
  4/src/site/apt/examples/tasksAttributes.apt ( no revision )
  4/src/site/apt/examples/classpaths.apt ( no revision )
  4/src/site/fml/faq.fml ( no revision )
  4/src/it/test1/src/main/java/Test.java ( no revision )
  4/src/it/test1/pom.xml ( no revision )
  4/src/it/test1/build.xml ( no revision )
  4/src/it/test2/pom.xml ( no revision )
  4/src/it/test3/pom.xml ( no revision )
  4/src/it/test3/build.xml ( no revision )
  4/src/it/test4/pom.xml ( no revision )
  4/src/it/test4/build.xml ( no revision )
  4/src/it/test5/src/main/java/TestTask.java ( no revision )
  4/src/it/test5/pom.xml ( no revision )
  4/src/it/test5/build.xml ( no revision )
  4/src/it/test6/calc.g ( no revision )
  4/src/it/test6/pom.xml ( no revision )
  4/src/it/test6/build.xml ( no revision )
  4/src/it/pom.xml ( no revision )
  4/pom.xml ( no revision )

Changed: no author @ no date
Comment: no comment
Files changed:
  4/src/test/java/org/apache/maven/plugin/antrun/AntRunMojoTest.java ( no revision )
  4/src/test/resources/unit/antrun-default-test/antrun-default-test-plugin-config.xml ( no
revision )
  4/src/test/resources/unit/tasksattributes-test/tasksattributes-test-plugin-config.xml (
no revision )
  4/src/main/java/org/apache/maven/plugin/antrun/components/AntTargetConverter.java ( no revision
)
  4/src/main/java/org/apache/maven/plugin/antrun/AntPropertyHelper.java ( no revision )
  4/src/main/java/org/apache/maven/plugin/antrun/AbstractAntMojo.java ( no revision )
  4/src/main/java/org/apache/maven/plugin/antrun/AntRunMojo.java ( no revision )
  4/src/main/resources/META-INF/plexus/components.xml ( no revision )
  4/src/site/site.xml ( no revision )
  4/src/site/apt/usage.apt ( no revision )
  4/src/site/apt/classpaths.apt ( no revision )
  4/src/site/apt/index.apt ( no revision )
  4/src/site/apt/examples/tasksAttributes.apt ( no revision )
  4/src/site/apt/examples/classpaths.apt ( no revision )
  4/src/site/fml/faq.fml ( no revision )
  4/src/it/test1/src/main/java/Test.java ( no revision )
  4/src/it/test1/pom.xml ( no revision )
  4/src/it/test1/build.xml ( no revision )
  4/src/it/test2/pom.xml ( no revision )
  4/src/it/test3/pom.xml ( no revision )
  4/src/it/test3/build.xml ( no revision )
  4/src/it/test4/pom.xml ( no revision )
  4/src/it/test4/build.xml ( no revision )
  4/src/it/test5/src/main/java/TestTask.java ( no revision )
  4/src/it/test5/pom.xml ( no revision )
  4/src/it/test5/build.xml ( no revision )
  4/src/it/test6/calc.g ( no revision )
  4/src/it/test6/pom.xml ( no revision )
  4/src/it/test6/build.xml ( no revision )
  4/src/it/pom.xml ( no revision )
  4/pom.xml ( no revision )

Changed: no author @ no date
Comment: no comment
Files changed:
  4/src/test/java/org/apache/maven/plugin/antrun/AntRunMojoTest.java ( no revision )
  4/src/test/resources/unit/antrun-default-test/antrun-default-test-plugin-config.xml ( no
revision )
  4/src/test/resources/unit/tasksattributes-test/tasksattributes-test-plugin-config.xml (
no revision )
  4/src/main/java/org/apache/maven/plugin/antrun/components/AntTargetConverter.java ( no revision
)
  4/src/main/java/org/apache/maven/plugin/antrun/AntPropertyHelper.java ( no revision )
  4/src/main/java/org/apache/maven/plugin/antrun/AbstractAntMojo.java ( no revision )
  4/src/main/java/org/apache/maven/plugin/antrun/AntRunMojo.java ( no revision )
  4/src/main/resources/META-INF/plexus/components.xml ( no revision )
  4/src/site/site.xml ( no revision )
  4/src/site/apt/usage.apt ( no revision )
  4/src/site/apt/classpaths.apt ( no revision )
  4/src/site/apt/index.apt ( no revision )
  4/src/site/apt/examples/tasksAttributes.apt ( no revision )
  4/src/site/apt/examples/classpaths.apt ( no revision )
  4/src/site/fml/faq.fml ( no revision )
  4/src/it/test1/src/main/java/Test.java ( no revision )
  4/src/it/test1/pom.xml ( no revision )
  4/src/it/test1/build.xml ( no revision )
  4/src/it/test2/pom.xml ( no revision )
  4/src/it/test3/pom.xml ( no revision )
  4/src/it/test3/build.xml ( no revision )
  4/src/it/test4/pom.xml ( no revision )
  4/src/it/test4/build.xml ( no revision )
  4/src/it/test5/src/main/java/TestTask.java ( no revision )
  4/src/it/test5/pom.xml ( no revision )
  4/src/it/test5/build.xml ( no revision )
  4/src/it/test6/calc.g ( no revision )
  4/src/it/test6/pom.xml ( no revision )
  4/src/it/test6/build.xml ( no revision )
  4/src/it/pom.xml ( no revision )
  4/pom.xml ( no revision )

Changed: no author @ no date
Comment: no comment
Files changed:
  4/src/test/java/org/apache/maven/plugin/antrun/AntRunMojoTest.java ( no revision )
  4/src/test/resources/unit/antrun-default-test/antrun-default-test-plugin-config.xml ( no
revision )
  4/src/test/resources/unit/tasksattributes-test/tasksattributes-test-plugin-config.xml (
no revision )
  4/src/main/java/org/apache/maven/plugin/antrun/components/AntTargetConverter.java ( no revision
)
  4/src/main/java/org/apache/maven/plugin/antrun/AntPropertyHelper.java ( no revision )
  4/src/main/java/org/apache/maven/plugin/antrun/AbstractAntMojo.java ( no revision )
  4/src/main/java/org/apache/maven/plugin/antrun/AntRunMojo.java ( no revision )
  4/src/main/resources/META-INF/plexus/components.xml ( no revision )
  4/src/site/site.xml ( no revision )
  4/src/site/apt/usage.apt ( no revision )
  4/src/site/apt/classpaths.apt ( no revision )
  4/src/site/apt/index.apt ( no revision )
  4/src/site/apt/examples/tasksAttributes.apt ( no revision )
  4/src/site/apt/examples/classpaths.apt ( no revision )
  4/src/site/fml/faq.fml ( no revision )
  4/src/it/test1/src/main/java/Test.java ( no revision )
  4/src/it/test1/pom.xml ( no revision )
  4/src/it/test1/build.xml ( no revision )
  4/src/it/test2/pom.xml ( no revision )
  4/src/it/test3/pom.xml ( no revision )
  4/src/it/test3/build.xml ( no revision )
  4/src/it/test4/pom.xml ( no revision )
  4/src/it/test4/build.xml ( no revision )
  4/src/it/test5/src/main/java/TestTask.java ( no revision )
  4/src/it/test5/pom.xml ( no revision )
  4/src/it/test5/build.xml ( no revision )
  4/src/it/test6/calc.g ( no revision )
  4/src/it/test6/pom.xml ( no revision )
  4/src/it/test6/build.xml ( no revision )
  4/src/it/pom.xml ( no revision )
  4/pom.xml ( no revision )

Changed: no author @ no date
Comment: no comment
Files changed:
  4/src/test/java/org/apache/maven/plugin/antrun/AntRunMojoTest.java ( no revision )
  4/src/test/resources/unit/antrun-default-test/antrun-default-test-plugin-config.xml ( no
revision )
  4/src/test/resources/unit/tasksattributes-test/tasksattributes-test-plugin-config.xml (
no revision )
  4/src/main/java/org/apache/maven/plugin/antrun/components/AntTargetConverter.java ( no revision
)
  4/src/main/java/org/apache/maven/plugin/antrun/AntPropertyHelper.java ( no revision )
  4/src/main/java/org/apache/maven/plugin/antrun/AbstractAntMojo.java ( no revision )
  4/src/main/java/org/apache/maven/plugin/antrun/AntRunMojo.java ( no revision )
  4/src/main/resources/META-INF/plexus/components.xml ( no revision )
  4/src/site/site.xml ( no revision )
  4/src/site/apt/usage.apt ( no revision )
  4/src/site/apt/classpaths.apt ( no revision )
  4/src/site/apt/index.apt ( no revision )
  4/src/site/apt/examples/tasksAttributes.apt ( no revision )
  4/src/site/apt/examples/classpaths.apt ( no revision )
  4/src/site/fml/faq.fml ( no revision )
  4/src/it/test1/src/main/java/Test.java ( no revision )
  4/src/it/test1/pom.xml ( no revision )
  4/src/it/test1/build.xml ( no revision )
  4/src/it/test2/pom.xml ( no revision )
  4/src/it/test3/pom.xml ( no revision )
  4/src/it/test3/build.xml ( no revision )
  4/src/it/test4/pom.xml ( no revision )
  4/src/it/test4/build.xml ( no revision )
  4/src/it/test5/src/main/java/TestTask.java ( no revision )
  4/src/it/test5/pom.xml ( no revision )
  4/src/it/test5/build.xml ( no revision )
  4/src/it/test6/calc.g ( no revision )
  4/src/it/test6/pom.xml ( no revision )
  4/src/it/test6/build.xml ( no revision )
  4/src/it/pom.xml ( no revision )
  4/pom.xml ( no revision )

Changed: no author @ no date
Comment: no comment
Files changed:
  src/main/java/org/apache/maven/plugin/antrun/AbstractAntMojo.java ( no revision )
  src/main/java/org/apache/maven/plugin/antrun/AntRunMojo.java ( no revision )

Changed: no author @ no date
Comment: no comment
Files changed:
  pom.xml ( no revision )

****************************************************************************
Dependencies Changes:
****************************************************************************
No dependencies changed

****************************************************************************
Test Summary:
****************************************************************************
Tests: 2
Failures: 0
Total time: 17199

****************************************************************************
Output:
****************************************************************************
[INFO] Scanning for projects...
[INFO] ----------------------------------------------------------------------------
[INFO] Building Maven AntRun Plugin
[INFO]    task-segment: [clean, install]
[INFO] ----------------------------------------------------------------------------
[INFO] [clean:clean]
[INFO] [plugin:descriptor]
[INFO] Using 2 extractors.
[INFO] Applying extractor for language: java
[INFO] Extractor for language: java found 1 mojo descriptors.
[INFO] Applying extractor for language: bsh
[INFO] Extractor for language: bsh found 0 mojo descriptors.
[INFO] [resources:resources]
[INFO] Using default encoding to copy filtered resources.
[INFO] Copying 1 resource
[INFO] [compiler:compile]
[INFO] Compiling 4 source files to /export/home/build/data/continuum/checkouts/4/target/classes
[INFO] [resources:testResources]
[INFO] Using default encoding to copy filtered resources.
[INFO] Copying 2 resources
[INFO] [compiler:testCompile]
[INFO] Compiling 1 source file to /export/home/build/data/continuum/checkouts/4/target/test-classes
[INFO] [surefire:test]
[INFO] Surefire report directory: /export/home/build/data/continuum/checkouts/4/target/surefire-reports

-------------------------------------------------------
 T E S T S
-------------------------------------------------------
Running org.apache.maven.plugin.antrun.AntRunMojoTest
Tests run: 2, Failures: 0, Errors: 0, Skipped: 0, Time elapsed: 17.21 sec

Results :

Tests run: 2, Failures: 0, Errors: 0, Skipped: 0

[INFO] [jar:jar]
[INFO] Building jar: /export/home/build/data/continuum/checkouts/4/target/maven-antrun-plugin-1.2-SNAPSHOT.jar
[INFO] [plugin:addPluginArtifactMetadata]
[INFO] [invoker:run {execution: integration-test}]
[INFO] Building: test1/pom.xml
[INFO] ...FAILED[code=1]. See /export/home/build/data/continuum/checkouts/4/src/it/test1/build.log
for details.
[INFO] Building: test2/pom.xml
[INFO] ...SUCCESS.
[INFO] Building: test3/pom.xml
[INFO] ...FAILED[code=1]. See /export/home/build/data/continuum/checkouts/4/src/it/test3/build.log
for details.
[INFO] Building: test4/pom.xml
[INFO] ...SUCCESS.
[INFO] Building: test5/pom.xml
[INFO] ...SUCCESS.
[INFO] Building: test6/pom.xml
[INFO] ...FAILED[code=1]. See /export/home/build/data/continuum/checkouts/4/src/it/test6/build.log
for details.
[INFO] Building: pom.xml
[INFO] ...FAILED[code=1]. See /export/home/build/data/continuum/checkouts/4/src/it/build.log
for details.
[INFO] 

---------------------------------------
Execution Summary:
Builds Passing: 3
Builds Failing: 4
---------------------------------------

The following builds failed:

*  test1/pom.xml
*  test3/pom.xml
*  test6/pom.xml
*  pom.xml

[INFO] ------------------------------------------------------------------------
[ERROR] BUILD FAILURE
[INFO] ------------------------------------------------------------------------
[INFO] : org.apache.maven.plugin.invoker.InvokerMojo@1e45a5c
4 builds failed.

4 builds failed.
[INFO] ------------------------------------------------------------------------
[INFO] For more information, run Maven with the -e switch
[INFO] ------------------------------------------------------------------------
[INFO] Total time: 1 minute 5 seconds
[INFO] Finished at: Wed Aug 22 18:55:59 GMT+00:00 2007
[INFO] Final Memory: 11M/334M
[INFO] ------------------------------------------------------------------------

****************************************************************************



Mime
View raw message