maven-notifications mailing list archives

Site index · List index
Message view « Date » · « Thread »
Top « Date » · « Thread »
From "Continuum@maven.zones.apache.org" <contin...@maven.zones.apache.org>
Subject [continuum] BUILD FAILURE: Maven AntRun Plugin
Date Wed, 04 Jul 2007 02:16:08 GMT
Online report : http://maven.zones.apache.org/continuum/buildResult.action?buildId=11064&projectId=4
Build statistics:
  State: Failed
  Previous State: Failed
  Started at: Wed 4 Jul 2007 02:14:00 +0000
  Finished at: Wed 4 Jul 2007 02:16:07 +0000
  Total time: 2m 6s
  Build Trigger: Forced
  Build Number: 0
  Exit code: 1
  Building machine hostname: maven.zones.apache.org
  Operating system : SunOS(unknown)
  Java version : 1.5.0_12(Sun Microsystems Inc.)

****************************************************************************
SCM Changes:
****************************************************************************
No files changed

****************************************************************************
Dependencies Changes:
****************************************************************************
No dependencies changed

****************************************************************************
Test Summary:
****************************************************************************
Tests: 2
Failures: 0
Total time: 33059

****************************************************************************
Output:
****************************************************************************
[INFO] Scanning for projects...
[INFO] ----------------------------------------------------------------------------
[INFO] Building Maven AntRun Plugin
[INFO]    task-segment: [clean, install]
[INFO] ----------------------------------------------------------------------------
[INFO] [clean:clean]
[INFO] Deleting directory /export/home/build/data/continuum/checkouts/4/target
[INFO] [plugin:descriptor]
[INFO] Using 2 extractors.
[INFO] Applying extractor for language: java
[INFO] Extractor for language: java found 1 mojo descriptors.
[INFO] Applying extractor for language: bsh
[INFO] Extractor for language: bsh found 0 mojo descriptors.
[INFO] [resources:resources]
[INFO] Using default encoding to copy filtered resources.
[INFO] Copying 1 resource
[INFO] [compiler:compile]
[INFO] Compiling 4 source files to /export/home/build/data/continuum/checkouts/4/target/classes
[INFO] [resources:testResources]
[INFO] Using default encoding to copy filtered resources.
[INFO] Copying 2 resources
[INFO] [compiler:testCompile]
[INFO] Compiling 1 source file to /export/home/build/data/continuum/checkouts/4/target/test-classes
[INFO] [surefire:test]
[INFO] Surefire report directory: /export/home/build/data/continuum/checkouts/4/target/surefire-reports

-------------------------------------------------------
 T E S T S
-------------------------------------------------------
Running org.apache.maven.plugin.antrun.AntRunMojoTest
Tests run: 2, Failures: 0, Errors: 0, Skipped: 0, Time elapsed: 33.071 sec

Results :

Tests run: 2, Failures: 0, Errors: 0, Skipped: 0

[INFO] [jar:jar]
[INFO] Building jar: /export/home/build/data/continuum/checkouts/4/target/maven-antrun-plugin-1.2-SNAPSHOT.jar
[INFO] [plugin:addPluginArtifactMetadata]
[INFO] [invoker:run {execution: integration-test}]
[INFO] Building: test1/pom.xml
[INFO] ...FAILED[code=1]. See /export/home/build/data/continuum/checkouts/4/src/it/test1/build.log
for details.
[INFO] Building: test2/pom.xml
[INFO] ...SUCCESS.
[INFO] Building: test3/pom.xml
[INFO] ...FAILED[code=1]. See /export/home/build/data/continuum/checkouts/4/src/it/test3/build.log
for details.
[INFO] Building: test4/pom.xml
[INFO] ...SUCCESS.
[INFO] Building: test5/pom.xml
[INFO] ...SUCCESS.
[INFO] Building: test6/pom.xml
[INFO] ...FAILED[code=1]. See /export/home/build/data/continuum/checkouts/4/src/it/test6/build.log
for details.
[INFO] Building: pom.xml
[INFO] ...FAILED[code=1]. See /export/home/build/data/continuum/checkouts/4/src/it/build.log
for details.
[INFO] 

---------------------------------------
Execution Summary:
Builds Passing: 3
Builds Failing: 4
---------------------------------------

The following builds failed:

*  test1/pom.xml
*  test3/pom.xml
*  test6/pom.xml
*  pom.xml

[INFO] ------------------------------------------------------------------------
[ERROR] BUILD FAILURE
[INFO] ------------------------------------------------------------------------
[INFO] : org.apache.maven.plugin.invoker.InvokerMojo@135605a
4 builds failed.

4 builds failed.
[INFO] ------------------------------------------------------------------------
[INFO] For more information, run Maven with the -e switch
[INFO] ------------------------------------------------------------------------
[INFO] Total time: 2 minutes 3 seconds
[INFO] Finished at: Wed Jul 04 02:16:06 GMT 2007
[INFO] Final Memory: 16M/331M
[INFO] ------------------------------------------------------------------------

****************************************************************************



Mime
View raw message