maven-notifications mailing list archives

Site index · List index
Message view « Date » · « Thread »
Top « Date » · « Thread »
From "Continuum@maven.zones.apache.org" <contin...@maven.zones.apache.org>
Subject [continuum] BUILD FAILURE: Doxia Site Renderer Component
Date Thu, 19 Jul 2007 10:18:59 GMT
Online report : http://maven.zones.apache.org/continuum/buildResult.action?buildId=12381&projectId=332
Build statistics:
  State: Failed
  Previous State: Failed
  Started at: Thu 19 Jul 2007 10:18:34 +0000
  Finished at: Thu 19 Jul 2007 10:18:58 +0000
  Total time: 24s
  Build Trigger: Schedule
  Build Number: 9
  Exit code: 1
  Building machine hostname: maven.zones.apache.org
  Operating system : SunOS(unknown)
  Java version : 1.5.0_12(Sun Microsystems Inc.)

****************************************************************************
SCM Changes:
****************************************************************************
No files changed

****************************************************************************
SCM Changes since last success:
****************************************************************************
****************************************************************************
Dependencies Changes:
****************************************************************************
org.apache.maven.doxia:doxia-core:1.0-alpha-9-SNAPSHOT

org.apache.maven.doxia:doxia-sink-api:1.0-alpha-9-SNAPSHOT

org.apache.maven.doxia:doxia-module-apt:1.0-alpha-9-SNAPSHOT

org.apache.maven.doxia:doxia-module-fml:1.0-alpha-9-SNAPSHOT

org.apache.maven.doxia:doxia-module-xdoc:1.0-alpha-9-SNAPSHOT

org.apache.maven.doxia:doxia-module-xhtml:1.0-alpha-9-SNAPSHOT

****************************************************************************
Test Summary:
****************************************************************************
Tests: 1
Failures: 1
Total time: 3191

****************************************************************************
Output:
****************************************************************************
[INFO] Scanning for projects...
[INFO] ----------------------------------------------------------------------------
[INFO] Building Doxia Site Renderer Component
[INFO]    task-segment: [clean, install]
[INFO] ----------------------------------------------------------------------------
[INFO] [clean:clean]
[INFO] Deleting directory /export/home/build/data/continuum/checkouts/332/target
[INFO] [plexus:descriptor {execution: default}]
[INFO] [resources:resources]
[INFO] Using default encoding to copy filtered resources.
[INFO] Copying 20 resources
[INFO] Copying 1 resource
[INFO] [compiler:compile]
[INFO] Compiling 8 source files to /export/home/build/data/continuum/checkouts/332/target/classes
[INFO] [resources:testResources]
[INFO] Using default encoding to copy filtered resources.
[INFO] Copying 3 resources
[INFO] [compiler:testCompile]
[INFO] Compiling 1 source file to /export/home/build/data/continuum/checkouts/332/target/test-classes
[INFO] [surefire:test]
[INFO] Surefire report directory: /export/home/build/data/continuum/checkouts/332/target/surefire-reports

-------------------------------------------------------
 T E S T S
-------------------------------------------------------
Running org.apache.maven.doxia.siterenderer.DefaultSiteRendererTest
Setting property: classpath.resource.loader.class => 'org.codehaus.plexus.velocity.ContextClassLoaderResourceLoader'.
Setting property: site.resource.loader.class => 'org.codehaus.plexus.velocity.SiteResourceLoader'.
Setting property: velocimacro.messages.on => 'false'.
Setting property: resource.loader => 'classpath,site'.
Setting property: runtime.log.invalid.references => 'false'.
Setting property: resource.manager.logwhenfound => 'false'.
Setting property: velocimacro.permissions.allow.inline.to.replace.global => 'true'.
Tests run: 1, Failures: 0, Errors: 1, Skipped: 0, Time elapsed: 3.19 sec <<< FAILURE!

Results :

Tests in error: 
  testRender(org.apache.maven.doxia.siterenderer.DefaultSiteRendererTest)

Tests run: 1, Failures: 0, Errors: 1, Skipped: 0

[INFO] ------------------------------------------------------------------------
[ERROR] BUILD FAILURE
[INFO] ------------------------------------------------------------------------
[INFO] There are test failures.

Please refer to /export/home/build/data/continuum/checkouts/332/target/surefire-reports for
the individual test results.
[INFO] ------------------------------------------------------------------------
[INFO] For more information, run Maven with the -e switch
[INFO] ------------------------------------------------------------------------
[INFO] Total time: 22 seconds
[INFO] Finished at: Thu Jul 19 10:18:58 GMT 2007
[INFO] Final Memory: 13M/333M
[INFO] ------------------------------------------------------------------------

****************************************************************************



Mime
View raw message