maven-notifications mailing list archives: June 2007

Site index · List index
Message list1 · 2 · 3 · 4 · 5 · 6 · 7 · 8 · 9 · 10 · 11 · 12 · 13 · 14 · 15 · 16 · 17 · 18 · 19 · 20 · 21 · 22 · 23 · Next »Thread · Author · Date
Contin...@maven.zones.apache.org [continuum] BUILD ERROR: Maven JXR Wed, 13 Jun, 16:35
Contin...@maven.zones.apache.org [continuum] BUILD ERROR: Maven JXR Wed, 13 Jun, 16:47
Contin...@maven.zones.apache.org [continuum] BUILD ERROR: Maven JXR Wed, 13 Jun, 16:55
Contin...@maven.zones.apache.org [continuum] BUILD ERROR: Maven JXR Wed, 13 Jun, 16:59
Contin...@maven.zones.apache.org [continuum] BUILD ERROR: Apache Maven Wed, 13 Jun, 17:00
Contin...@maven.zones.apache.org [continuum] BUILD ERROR: Apache Maven Wed, 13 Jun, 17:00
Contin...@maven.zones.apache.org [continuum] BUILD ERROR: Apache Maven Wed, 13 Jun, 17:00
Contin...@maven.zones.apache.org [continuum] BUILD ERROR: Apache Maven Wed, 13 Jun, 17:00
Contin...@maven.zones.apache.org [continuum] BUILD ERROR: Maven JXR Parent Wed, 13 Jun, 17:21
Contin...@maven.zones.apache.org [continuum] BUILD ERROR: Maven JXR Parent Wed, 13 Jun, 17:28
Contin...@maven.zones.apache.org [continuum] BUILD SUCCESSFUL: Maven JXR Parent Wed, 13 Jun, 17:38
Contin...@maven.zones.apache.org [continuum] BUILD SUCCESSFUL: Apache Resource Bundles Wed, 13 Jun, 18:00
Contin...@maven.zones.apache.org [continuum] BUILD SUCCESSFUL: Apache Incubator Disclaimer Resource Bundle Wed, 13 Jun, 18:00
Contin...@maven.zones.apache.org [continuum] BUILD SUCCESSFUL: Apache License Header Resource Bundle Wed, 13 Jun, 18:01
Contin...@maven.zones.apache.org [continuum] BUILD SUCCESSFUL: Apache Maven Wed, 13 Jun, 18:01
Contin...@maven.zones.apache.org [continuum] BUILD SUCCESSFUL: Apache Maven Wed, 13 Jun, 18:01
Contin...@maven.zones.apache.org [continuum] BUILD SUCCESSFUL: Apache Maven Wed, 13 Jun, 18:02
Contin...@maven.zones.apache.org [continuum] BUILD SUCCESSFUL: Apache Maven Wed, 13 Jun, 18:02
Contin...@maven.zones.apache.org [continuum] BUILD ERROR: Archiva Applet Wed, 13 Jun, 18:05
Contin...@maven.zones.apache.org [continuum] BUILD ERROR: Archiva Applet Wed, 13 Jun, 18:05
Contin...@maven.zones.apache.org [continuum] BUILD ERROR: Archiva Artifact Discoverer Wed, 13 Jun, 18:05
Contin...@maven.zones.apache.org [continuum] BUILD ERROR: Archiva Artifact Discoverer Wed, 13 Jun, 18:05
Contin...@maven.zones.apache.org [continuum] BUILD ERROR: Archiva Configuration Wed, 13 Jun, 18:05
Contin...@maven.zones.apache.org [continuum] BUILD ERROR: Archiva Configuration Wed, 13 Jun, 18:05
Contin...@maven.zones.apache.org [continuum] BUILD ERROR: Archiva Repository Interface Layer Wed, 13 Jun, 18:05
Contin...@maven.zones.apache.org [continuum] BUILD ERROR: Archiva Repository Interface Layer Wed, 13 Jun, 18:05
Contin...@maven.zones.apache.org [continuum] BUILD ERROR: Archiva Repository Indexer Wed, 13 Jun, 18:05
Contin...@maven.zones.apache.org [continuum] BUILD ERROR: Archiva Repository Indexer Wed, 13 Jun, 18:05
Contin...@maven.zones.apache.org [continuum] BUILD ERROR: Archiva Standard Reports Wed, 13 Jun, 18:05
Contin...@maven.zones.apache.org [continuum] BUILD ERROR: Archiva Standard Reports Wed, 13 Jun, 18:05
Contin...@maven.zones.apache.org [continuum] BUILD ERROR: Archiva Proxy Wed, 13 Jun, 18:05
Contin...@maven.zones.apache.org [continuum] BUILD ERROR: Archiva Proxy Wed, 13 Jun, 18:05
Contin...@maven.zones.apache.org [continuum] BUILD ERROR: Archiva Repository Converter Wed, 13 Jun, 18:05
Contin...@maven.zones.apache.org [continuum] BUILD ERROR: Archiva Repository Converter Wed, 13 Jun, 18:05
Contin...@maven.zones.apache.org [continuum] BUILD ERROR: Archiva Core Wed, 13 Jun, 18:06
Contin...@maven.zones.apache.org [continuum] BUILD ERROR: Archiva Core Wed, 13 Jun, 18:06
Contin...@maven.zones.apache.org [continuum] BUILD FAILURE: Archiva Command Line Client Wed, 13 Jun, 18:06
Contin...@maven.zones.apache.org [continuum] BUILD FAILURE: Archiva Command Line Client Wed, 13 Jun, 18:06
Contin...@maven.zones.apache.org [continuum] BUILD SUCCESSFUL: Maven Shared Application Configuration Model Wed, 13 Jun, 18:07
Contin...@maven.zones.apache.org [continuum] BUILD SUCCESSFUL: Maven Shared Application Configuration Model Wed, 13 Jun, 18:07
Contin...@maven.zones.apache.org [continuum] BUILD ERROR: Archiva Security Configuration Wed, 13 Jun, 18:07
Contin...@maven.zones.apache.org [continuum] BUILD ERROR: Archiva Security Configuration Wed, 13 Jun, 18:07
Contin...@maven.zones.apache.org [continuum] BUILD ERROR: Archiva Web Application Wed, 13 Jun, 18:07
Contin...@maven.zones.apache.org [continuum] BUILD ERROR: Archiva Web Application Wed, 13 Jun, 18:07
Contin...@maven.zones.apache.org [continuum] BUILD ERROR: Archiva Plexus Application Wed, 13 Jun, 18:07
Contin...@maven.zones.apache.org [continuum] BUILD ERROR: Archiva Plexus Application Wed, 13 Jun, 18:07
Contin...@maven.zones.apache.org [continuum] BUILD ERROR: Archiva Runtime Generator Wed, 13 Jun, 18:07
Contin...@maven.zones.apache.org [continuum] BUILD ERROR: Archiva Runtime Generator Wed, 13 Jun, 18:07
Contin...@maven.zones.apache.org [continuum] BUILD FAILURE: Continuum Model Wed, 13 Jun, 18:08
Contin...@maven.zones.apache.org [continuum] BUILD FAILURE: Continuum Model Wed, 13 Jun, 18:08
Contin...@maven.zones.apache.org [continuum] BUILD FAILURE: Continuum API Wed, 13 Jun, 18:09
Contin...@maven.zones.apache.org [continuum] BUILD FAILURE: Continuum API Wed, 13 Jun, 18:09
Contin...@maven.zones.apache.org [continuum] BUILD FAILURE: Continuum Test Wed, 13 Jun, 18:09
Contin...@maven.zones.apache.org [continuum] BUILD FAILURE: Continuum Test Wed, 13 Jun, 18:09
Contin...@maven.zones.apache.org [continuum] BUILD FAILURE: Continuum Notifier API Wed, 13 Jun, 18:09
Contin...@maven.zones.apache.org [continuum] BUILD FAILURE: Continuum Notifier API Wed, 13 Jun, 18:09
Contin...@maven.zones.apache.org [continuum] BUILD SUCCESSFUL: Maven SCM Bazaar Provider Wed, 13 Jun, 18:15
Contin...@maven.zones.apache.org [continuum] BUILD SUCCESSFUL: Maven SCM Bazaar Provider Wed, 13 Jun, 18:15
Contin...@maven.zones.apache.org [continuum] BUILD FAILURE: Continuum Release System Wed, 13 Jun, 18:19
Contin...@maven.zones.apache.org [continuum] BUILD FAILURE: Continuum Release System Wed, 13 Jun, 18:19
Contin...@maven.zones.apache.org [continuum] BUILD FAILURE: Continuum Store Wed, 13 Jun, 18:20
Contin...@maven.zones.apache.org [continuum] BUILD FAILURE: Continuum Store Wed, 13 Jun, 18:20
Contin...@maven.zones.apache.org [continuum] BUILD FAILURE: Continuum Core Wed, 13 Jun, 18:21
Contin...@maven.zones.apache.org [continuum] BUILD FAILURE: Continuum Core Wed, 13 Jun, 18:21
Contin...@maven.zones.apache.org [continuum] BUILD FAILURE: Continuum Wagon Notifier Wed, 13 Jun, 18:21
Contin...@maven.zones.apache.org [continuum] BUILD FAILURE: Continuum Wagon Notifier Wed, 13 Jun, 18:21
Contin...@maven.zones.apache.org [continuum] BUILD FAILURE: Continuum MSN Notifier Wed, 13 Jun, 18:21
Contin...@maven.zones.apache.org [continuum] BUILD FAILURE: Continuum MSN Notifier Wed, 13 Jun, 18:21
Contin...@maven.zones.apache.org [continuum] BUILD FAILURE: Continuum IRC Notifier Wed, 13 Jun, 18:21
Contin...@maven.zones.apache.org [continuum] BUILD FAILURE: Continuum IRC Notifier Wed, 13 Jun, 18:21
Contin...@maven.zones.apache.org [continuum] BUILD SUCCESSFUL: Continuum XMLRPC :: Parent Wed, 13 Jun, 18:21
Contin...@maven.zones.apache.org [continuum] BUILD SUCCESSFUL: Continuum XMLRPC :: Parent Wed, 13 Jun, 18:21
Contin...@maven.zones.apache.org [continuum] BUILD FAILURE: Continuum Jabber Notifier Wed, 13 Jun, 18:22
Contin...@maven.zones.apache.org [continuum] BUILD FAILURE: Continuum Jabber Notifier Wed, 13 Jun, 18:22
Contin...@maven.zones.apache.org [continuum] BUILD FAILURE: Continuum Web APP Wed, 13 Jun, 18:23
Contin...@maven.zones.apache.org [continuum] BUILD FAILURE: Continuum Web APP Wed, 13 Jun, 18:23
Contin...@maven.zones.apache.org [continuum] BUILD FAILURE: Continuum Application Wed, 13 Jun, 18:23
Contin...@maven.zones.apache.org [continuum] BUILD FAILURE: Continuum Application Wed, 13 Jun, 18:23
Contin...@maven.zones.apache.org [continuum] BUILD SUCCESSFUL: Unnamed - org.apache.maven.continuum:continuum-data-management:pom:1.1-SNAPSHOT Wed, 13 Jun, 18:23
Contin...@maven.zones.apache.org [continuum] BUILD SUCCESSFUL: Unnamed - org.apache.maven.continuum:continuum-data-management:pom:1.1-SNAPSHOT Wed, 13 Jun, 18:23
Contin...@maven.zones.apache.org [continuum] BUILD FAILURE: Continuum Plexus Runtime Wed, 13 Jun, 18:24
Contin...@maven.zones.apache.org [continuum] BUILD FAILURE: Continuum Plexus Runtime Wed, 13 Jun, 18:24
Contin...@maven.zones.apache.org [continuum] BUILD ERROR: Continuum client XML-RPC Wed, 13 Jun, 18:24
Contin...@maven.zones.apache.org [continuum] BUILD ERROR: Continuum client XML-RPC Wed, 13 Jun, 18:24
Contin...@maven.zones.apache.org [continuum] BUILD ERROR: Doxia Wed, 13 Jun, 18:24
Contin...@maven.zones.apache.org [continuum] BUILD ERROR: Doxia Wed, 13 Jun, 18:24
Contin...@maven.zones.apache.org [continuum] BUILD ERROR: Doxia Core Wed, 13 Jun, 18:24
Contin...@maven.zones.apache.org [continuum] BUILD ERROR: Doxia Core Wed, 13 Jun, 18:24
Contin...@maven.zones.apache.org [continuum] BUILD ERROR: Doxia Modules Wed, 13 Jun, 18:24
Contin...@maven.zones.apache.org [continuum] BUILD ERROR: Doxia Modules Wed, 13 Jun, 18:24
Contin...@maven.zones.apache.org [continuum] BUILD ERROR: Doxia Confluence Module Wed, 13 Jun, 18:24
Contin...@maven.zones.apache.org [continuum] BUILD ERROR: Doxia Confluence Module Wed, 13 Jun, 18:24
Contin...@maven.zones.apache.org [continuum] BUILD ERROR: Doxia Decoration Model Wed, 13 Jun, 18:24
Contin...@maven.zones.apache.org [continuum] BUILD ERROR: Doxia Decoration Model Wed, 13 Jun, 18:24
Contin...@maven.zones.apache.org [continuum] BUILD ERROR: Doxia Docbook Simple Module Wed, 13 Jun, 18:24
Contin...@maven.zones.apache.org [continuum] BUILD ERROR: Doxia Docbook Simple Module Wed, 13 Jun, 18:24
Contin...@maven.zones.apache.org [continuum] BUILD ERROR: Doxia iText Module Wed, 13 Jun, 18:24
Contin...@maven.zones.apache.org [continuum] BUILD ERROR: Doxia iText Module Wed, 13 Jun, 18:24
Contin...@maven.zones.apache.org [continuum] BUILD ERROR: Doxia Document Renderer Component Wed, 13 Jun, 18:24
Contin...@maven.zones.apache.org [continuum] BUILD ERROR: Doxia Document Renderer Component Wed, 13 Jun, 18:24
Message list1 · 2 · 3 · 4 · 5 · 6 · 7 · 8 · 9 · 10 · 11 · 12 · 13 · 14 · 15 · 16 · 17 · 18 · 19 · 20 · 21 · 22 · 23 · Next »Thread · Author · Date
Box list
Oct 2014299
Sep 2014304
Aug 2014246
Jul 2014317
Jun 2014341
May 2014161
Apr 2014146
Mar 2014336
Feb 2014308
Jan 2014189
Dec 2013319
Nov 2013274
Oct 2013167
Sep 2013486
Aug 2013263
Jul 2013726
Jun 2013722
May 2013378
Apr 2013313
Mar 2013467
Feb 2013520
Jan 20131437
Dec 20121778
Nov 2012775
Oct 20121224
Sep 2012791
Aug 2012362
Jul 2012232
Jun 2012149
May 2012189
Apr 2012115
Mar 201257
Feb 2012155
Jan 2012170
Dec 2011244
Nov 2011187
Oct 2011139
Sep 2011190
Aug 2011276
Jul 201194
Jun 20114
Apr 201162
Mar 201176
Feb 201154
Jan 201185
Dec 201079
Nov 201061
Oct 201058
Sep 20101
Aug 201057
Jul 201037
Jun 201020
May 201075
Apr 201053
Mar 201012
Feb 201030
Jan 201071
Dec 2009104
Nov 200919
Oct 200931
Sep 2009193
Aug 2009268
Jul 2009193
Jun 2009147
May 200975
Apr 200979
Mar 2009134
Feb 2009657
Jan 200983
Dec 2008349
Nov 2008288
Oct 2008986
Sep 2008842
Aug 2008707
Jul 2008887
Jun 2008167
May 200821
Apr 2008231
Mar 2008438
Feb 2008317
Jan 2008205
Dec 2007185
Nov 2007532
Oct 2007439
Sep 2007699
Aug 20071294
Jul 2007351
Jun 20072211
May 2007273
Apr 2007262
Mar 2007534
Feb 20071648
Jan 20072359
Dec 2006575
Nov 2006357
Oct 2006642
Sep 2006660
Aug 20061662
Jul 20061320
Jun 2006473
May 20064700
Apr 20061113
Mar 20061048