maven-notifications mailing list archives

Site index · List index
Message view « Date » · « Thread »
Top « Date » · « Thread »
From "Continuum@maven.zones.apache.org" <contin...@maven.zones.apache.org>
Subject [continuum] BUILD SUCCESSFUL: Archiva Base :: Proxy
Date Thu, 14 Jun 2007 02:09:01 GMT
Online report : http://maven.zones.apache.org/continuum/buildResult.action?buildId=8392&projectId=282
Build statistics:
  State: Ok
  Previous State: Failed
  Started at: Thu 14 Jun 2007 02:08:39 +0000
  Finished at: Thu 14 Jun 2007 02:08:55 +0000
  Total time: 16s
  Build Trigger: Schedule
  Build Number: 1
  Exit code: 0
  Building machine hostname: maven.zones.apache.org
  Operating system : SunOS(unknown)
  Java version : 1.5.0_11(Sun Microsystems Inc.)

****************************************************************************
SCM Changes:
****************************************************************************
No files changed

****************************************************************************
SCM Changes since last success:
****************************************************************************
****************************************************************************
Dependencies Changes:
****************************************************************************
org.apache.maven.archiva:archiva-repository-layer:1.0-alpha-2-SNAPSHOT

****************************************************************************
Test Summary:
****************************************************************************
Tests: 112
Failures: 0
Total time: 5335

****************************************************************************
Output:
****************************************************************************
[INFO] Scanning for projects...
[INFO] ----------------------------------------------------------------------------
[INFO] Building Archiva Base :: Proxy
[INFO]    task-segment: [clean, install]
[INFO] ----------------------------------------------------------------------------
[INFO] [clean:clean]
[INFO] Deleting directory /export/home/build/data/continuum/checkouts/282/target
[INFO] Deleting directory /export/home/build/data/continuum/checkouts/282/target/classes
[INFO] Deleting directory /export/home/build/data/continuum/checkouts/282/target/test-classes
[INFO] Deleting directory /export/home/build/data/continuum/checkouts/282/target/site
[INFO] [plexus:descriptor {execution: generate}]
[INFO] Setting property: classpath.resource.loader.class => 'org.codehaus.plexus.velocity.ContextClassLoaderResourceLoader'.
[INFO] Setting property: velocimacro.messages.on => 'false'.
[INFO] Setting property: resource.loader => 'classpath'.
[INFO] Setting property: resource.manager.logwhenfound => 'false'.
[INFO] [remote-resources:process {execution: default}]
[INFO] [resources:resources]
[INFO] Using default encoding to copy filtered resources.
[INFO] Resource directory does not exist: /export/home/build/data/continuum/checkouts/282/src/main/resources
[INFO] Copying 1 resource
[INFO] Copying 2 resources
[INFO] [compiler:compile]
[INFO] Compiling 4 source files to /export/home/build/data/continuum/checkouts/282/target/classes
[INFO] [resources:testResources]
[INFO] Using default encoding to copy filtered resources.
[INFO] Copying 8 resources
[INFO] Copying 2 resources
[INFO] [compiler:testCompile]
[INFO] Compiling 11 source files to /export/home/build/data/continuum/checkouts/282/target/test-classes
[INFO] [surefire:test]
[INFO] Surefire report directory: /export/home/build/data/continuum/checkouts/282/target/surefire-reports

-------------------------------------------------------
 T E S T S
-------------------------------------------------------
Running org.apache.maven.archiva.proxy.ManagedLegacyTransferTest
DEBUG|main|    1|Registry:commons-configuration - Creating a default configuration - no configuration was provided
DEBUG|main|  430|CacheManager                   - Creating new CacheManager with default config
DEBUG|main|  432|CacheManager                   - Configuring ehcache from classpath.
 WARN|main|  436|ConfigurationFactory           - No configuration found. Configuring ehcache from ehcache-failsafe.xml  found in the classpath: jar:file:/export/home/build/.m2/repository/net/sf/ehcache/ehcache/1.2.4/ehcache-1.2.4.jar!/ehcache-failsafe.xml
DEBUG|main|  436|ConfigurationFactory           - Configuring ehcache from URL: jar:file:/export/home/build/.m2/repository/net/sf/ehcache/ehcache/1.2.4/ehcache-1.2.4.jar!/ehcache-failsafe.xml
DEBUG|main|  437|ConfigurationFactory           - Configuring ehcache from InputStream
DEBUG|main|  448|DiskStoreConfiguration         - Disk Store Path: /var/tmp/
DEBUG|main|  463|ConfigurationHelper            - No CacheManagerEventListenerFactory class specified. Skipping...
DEBUG|main|  463|ConfigurationHelper            - No CachePeerListenerFactoryConfiguration specified. Not configuring a CacheManagerPeerListener.
DEBUG|main|  464|ConfigurationHelper            - No CachePeerProviderFactoryConfiguration specified. Not configuring a CacheManagerPeerProvider.
DEBUG|main|  730|ConfigurationHelper            - No BootstrapCacheLoaderFactory class specified. Skipping...
DEBUG|main|  736|MemoryStore                    - Initialized net.sf.ehcache.store.LruMemoryStore for cache
DEBUG|main|  737|LruMemoryStore                 - cache Cache: Using SpoolingLinkedHashMap implementation
DEBUG|main|  738|Cache                          - Initialised cache: cache

.\ testLegacyManagedRepoGetNotPresent() \._________________________________________

DEBUG|main|  813|RepositoryProxyConnectors:default - Attempting connector: ProxyConnector[
  source:ArchivaRepository[legacy-managed-repository,file:/export/home/build/data/continuum/checkouts/282/target/test-repository/legacy-managed/]
  target:ArchivaRepository[proxied1,file:/export/home/build/data/continuum/checkouts/282/src/test/repositories/proxied1/]
  proxyId:null
  policy[releases]:ignored
  policy[snapshots]:ignored
  policy[cache-failures]:ignored
  policy[checksum]:fix
]
DEBUG|main|  813|RepositoryProxyConnectors:default - Using target repository: proxied1 - layout: default - targetPath: org/apache/maven/test/get-default-layout/1.0/get-default-layout-1.0.jar
DEBUG|main|  814|RepositoryProxyConnectors:default - Applying [releases] policy with [ignored]
DEBUG|main|  814|PreDownloadPolicy:releases     - OK to update, releases policy set to IGNORED.
DEBUG|main|  814|RepositoryProxyConnectors:default - Applying [snapshots] policy with [ignored]
DEBUG|main|  814|PreDownloadPolicy:snapshots    - OK to update, snapshots policy set to IGNORED.
DEBUG|main|  814|RepositoryProxyConnectors:default - Applying [cache-failures] policy with [ignored]
DEBUG|main|  814|PreDownloadPolicy:cache-failures - OK to fetch, check-failures policy set to IGNORED.
DEBUG|main|  816|RepositoryProxyConnectors:default - Retrieving org/apache/maven/test/get-default-layout/1.0/get-default-layout-1.0.jar from Proxied Repository 1 if updated
DEBUG|main|  820|RepositoryProxyConnectors:default - Downloaded successfully.
DEBUG|main|  820|RepositoryProxyConnectors:default - Retrieving org/apache/maven/test/get-default-layout/1.0/get-default-layout-1.0.jar.sha1 from Proxied Repository 1 if updated
 WARN|main|  821|RepositoryProxyConnectors:default - Resource does not exist: File: /export/home/build/data/continuum/checkouts/282/src/test/repositories/proxied1/org/apache/maven/test/get-default-layout/1.0/get-default-layout-1.0.jar.sha1 does not exist
DEBUG|main|  821|RepositoryProxyConnectors:default - Checksum.sha1 Not Download: File: /export/home/build/data/continuum/checkouts/282/src/test/repositories/proxied1/org/apache/maven/test/get-default-layout/1.0/get-default-layout-1.0.jar.sha1 does not exist
DEBUG|main|  821|RepositoryProxyConnectors:default - Retrieving org/apache/maven/test/get-default-layout/1.0/get-default-layout-1.0.jar.md5 from Proxied Repository 1 if updated
 WARN|main|  821|RepositoryProxyConnectors:default - Resource does not exist: File: /export/home/build/data/continuum/checkouts/282/src/test/repositories/proxied1/org/apache/maven/test/get-default-layout/1.0/get-default-layout-1.0.jar.md5 does not exist
DEBUG|main|  821|RepositoryProxyConnectors:default - Checksum.md5 Not Download: File: /export/home/build/data/continuum/checkouts/282/src/test/repositories/proxied1/org/apache/maven/test/get-default-layout/1.0/get-default-layout-1.0.jar.md5 does not exist
DEBUG|main|  821|RepositoryProxyConnectors:default - Applying [checksum] policy with [fix]
 INFO|main|  829|RepositoryProxyConnectors:default - Successfully transfered: /export/home/build/data/continuum/checkouts/282/target/test-repository/legacy-managed/org.apache.maven.test/jars/get-default-layout-1.0.jar
 INFO|main|  836|Cache:url-failures-cache       - Disposing cache: [  name = cache status = STATUS_ALIVE eternal = false overflowToDisk = false maxElementsInMemory = 1000 maxElementsOnDisk = 0 memoryStoreEvictionPolicy = LRU timeToLiveSeconds = 1800 timeToIdleSeconds = 2700 diskPersistent = true diskExpiryThreadIntervalSeconds = 600 cacheEventListeners:  hitCount = 0 memoryStoreHitCount = 0 diskStoreHitCount = 0 missCountNotFound = 0 missCountExpired = 0 ]
DEBUG|main|  903|Registry:commons-configuration - Creating a default configuration - no configuration was provided
DEBUG|main|  982|CacheManager                   - Attempting to create an existing singleton. Existing singleton returned.
DEBUG|main|  982|MemoryStore                    - Initialized net.sf.ehcache.store.LruMemoryStore for cache
DEBUG|main|  982|LruMemoryStore                 - cache Cache: Using SpoolingLinkedHashMap implementation
DEBUG|main|  983|Cache                          - Initialised cache: cache

.\ testLegacyManagedRepoGetAlreadyPresent() \._________________________________________

DEBUG|main|  988|RepositoryProxyConnectors:default - Attempting connector: ProxyConnector[
  source:ArchivaRepository[legacy-managed-repository,file:/export/home/build/data/continuum/checkouts/282/target/test-repository/legacy-managed/]
  target:ArchivaRepository[proxied1,file:/export/home/build/data/continuum/checkouts/282/src/test/repositories/proxied1/]
  proxyId:null
  policy[releases]:ignored
  policy[snapshots]:ignored
  policy[cache-failures]:ignored
  policy[checksum]:fix
]
DEBUG|main|  989|RepositoryProxyConnectors:default - Using target repository: proxied1 - layout: default - targetPath: org/apache/maven/test/get-default-layout-present/1.0/get-default-layout-present-1.0.jar
DEBUG|main|  989|RepositoryProxyConnectors:default - Applying [releases] policy with [ignored]
DEBUG|main|  989|PreDownloadPolicy:releases     - OK to update, releases policy set to IGNORED.
DEBUG|main|  989|RepositoryProxyConnectors:default - Applying [snapshots] policy with [ignored]
DEBUG|main|  989|PreDownloadPolicy:snapshots    - OK to update, snapshots policy set to IGNORED.
DEBUG|main|  989|RepositoryProxyConnectors:default - Applying [cache-failures] policy with [ignored]
DEBUG|main|  989|PreDownloadPolicy:cache-failures - OK to fetch, check-failures policy set to IGNORED.
DEBUG|main|  989|RepositoryProxyConnectors:default - Retrieving org/apache/maven/test/get-default-layout-present/1.0/get-default-layout-present-1.0.jar from Proxied Repository 1
DEBUG|main|  991|RepositoryProxyConnectors:default - Downloaded successfully.
DEBUG|main|  992|RepositoryProxyConnectors:default - Retrieving org/apache/maven/test/get-default-layout-present/1.0/get-default-layout-present-1.0.jar.sha1 from Proxied Repository 1 if updated
 WARN|main|  992|RepositoryProxyConnectors:default - Resource does not exist: File: /export/home/build/data/continuum/checkouts/282/src/test/repositories/proxied1/org/apache/maven/test/get-default-layout-present/1.0/get-default-layout-present-1.0.jar.sha1 does not exist
DEBUG|main|  993|RepositoryProxyConnectors:default - Checksum.sha1 Not Download: File: /export/home/build/data/continuum/checkouts/282/src/test/repositories/proxied1/org/apache/maven/test/get-default-layout-present/1.0/get-default-layout-present-1.0.jar.sha1 does not exist
DEBUG|main|  993|RepositoryProxyConnectors:default - Retrieving org/apache/maven/test/get-default-layout-present/1.0/get-default-layout-present-1.0.jar.md5 from Proxied Repository 1
 WARN|main|  994|RepositoryProxyConnectors:default - Resource does not exist: File: /export/home/build/data/continuum/checkouts/282/src/test/repositories/proxied1/org/apache/maven/test/get-default-layout-present/1.0/get-default-layout-present-1.0.jar.md5 does not exist
DEBUG|main|  994|RepositoryProxyConnectors:default - Checksum.md5 Not Download: File: /export/home/build/data/continuum/checkouts/282/src/test/repositories/proxied1/org/apache/maven/test/get-default-layout-present/1.0/get-default-layout-present-1.0.jar.md5 does not exist
DEBUG|main|  994|RepositoryProxyConnectors:default - Applying [checksum] policy with [fix]
DEBUG|main|  997|PostDownloadPolicy:checksum    - Not valid checksum: /export/home/build/data/continuum/checkouts/282/target/test-repository/legacy-managed/org.apache.maven.test/jars/get-default-layout-present-1.0.jar.md5
 INFO|main|  997|RepositoryProxyConnectors:default - Successfully transfered: /export/home/build/data/continuum/checkouts/282/target/test-repository/legacy-managed/org.apache.maven.test/jars/get-default-layout-present-1.0.jar
 INFO|main|  998|Cache:url-failures-cache       - Disposing cache: [  name = cache status = STATUS_ALIVE eternal = false overflowToDisk = false maxElementsInMemory = 1000 maxElementsOnDisk = 0 memoryStoreEvictionPolicy = LRU timeToLiveSeconds = 1800 timeToIdleSeconds = 2700 diskPersistent = true diskExpiryThreadIntervalSeconds = 600 cacheEventListeners:  hitCount = 0 memoryStoreHitCount = 0 diskStoreHitCount = 0 missCountNotFound = 0 missCountExpired = 0 ]
DEBUG|main| 1034|Registry:commons-configuration - Creating a default configuration - no configuration was provided
DEBUG|main| 1084|CacheManager                   - Attempting to create an existing singleton. Existing singleton returned.
DEBUG|main| 1085|MemoryStore                    - Initialized net.sf.ehcache.store.LruMemoryStore for cache
DEBUG|main| 1085|LruMemoryStore                 - cache Cache: Using SpoolingLinkedHashMap implementation
DEBUG|main| 1085|Cache                          - Initialised cache: cache

.\ testLegacyManagedAndProxyRepoGetNotPresent() \._________________________________________

DEBUG|main| 1091|RepositoryProxyConnectors:default - Attempting connector: ProxyConnector[
  source:ArchivaRepository[legacy-managed-repository,file:/export/home/build/data/continuum/checkouts/282/target/test-repository/legacy-managed/]
  target:ArchivaRepository[legacy-proxied,file:/export/home/build/data/continuum/checkouts/282/src/test/repositories/legacy-proxied/]
  proxyId:null
  policy[releases]:ignored
  policy[snapshots]:ignored
  policy[cache-failures]:ignored
  policy[checksum]:ignored
]
DEBUG|main| 1091|RepositoryProxyConnectors:default - Using target repository: legacy-proxied - layout: legacy - targetPath: org.apache.maven.test/jars/get-default-layout-1.0.jar
DEBUG|main| 1091|RepositoryProxyConnectors:default - Applying [releases] policy with [ignored]
DEBUG|main| 1091|PreDownloadPolicy:releases     - OK to update, releases policy set to IGNORED.
DEBUG|main| 1091|RepositoryProxyConnectors:default - Applying [snapshots] policy with [ignored]
DEBUG|main| 1091|PreDownloadPolicy:snapshots    - OK to update, snapshots policy set to IGNORED.
DEBUG|main| 1091|RepositoryProxyConnectors:default - Applying [cache-failures] policy with [ignored]
DEBUG|main| 1091|PreDownloadPolicy:cache-failures - OK to fetch, check-failures policy set to IGNORED.
DEBUG|main| 1092|RepositoryProxyConnectors:default - Retrieving org.apache.maven.test/jars/get-default-layout-1.0.jar from Proxied Legacy Repository if updated
DEBUG|main| 1092|RepositoryProxyConnectors:default - Downloaded successfully.
DEBUG|main| 1093|RepositoryProxyConnectors:default - Retrieving org.apache.maven.test/jars/get-default-layout-1.0.jar.sha1 from Proxied Legacy Repository if updated
 WARN|main| 1093|RepositoryProxyConnectors:default - Resource does not exist: File: /export/home/build/data/continuum/checkouts/282/src/test/repositories/legacy-proxied/org.apache.maven.test/jars/get-default-layout-1.0.jar.sha1 does not exist
DEBUG|main| 1093|RepositoryProxyConnectors:default - Checksum.sha1 Not Download: File: /export/home/build/data/continuum/checkouts/282/src/test/repositories/legacy-proxied/org.apache.maven.test/jars/get-default-layout-1.0.jar.sha1 does not exist
DEBUG|main| 1093|RepositoryProxyConnectors:default - Retrieving org.apache.maven.test/jars/get-default-layout-1.0.jar.md5 from Proxied Legacy Repository if updated
 WARN|main| 1094|RepositoryProxyConnectors:default - Resource does not exist: File: /export/home/build/data/continuum/checkouts/282/src/test/repositories/legacy-proxied/org.apache.maven.test/jars/get-default-layout-1.0.jar.md5 does not exist
DEBUG|main| 1094|RepositoryProxyConnectors:default - Checksum.md5 Not Download: File: /export/home/build/data/continuum/checkouts/282/src/test/repositories/legacy-proxied/org.apache.maven.test/jars/get-default-layout-1.0.jar.md5 does not exist
DEBUG|main| 1094|RepositoryProxyConnectors:default - Applying [checksum] policy with [ignored]
 INFO|main| 1094|RepositoryProxyConnectors:default - Successfully transfered: /export/home/build/data/continuum/checkouts/282/target/test-repository/legacy-managed/org.apache.maven.test/jars/get-default-layout-1.0.jar
 INFO|main| 1095|Cache:url-failures-cache       - Disposing cache: [  name = cache status = STATUS_ALIVE eternal = false overflowToDisk = false maxElementsInMemory = 1000 maxElementsOnDisk = 0 memoryStoreEvictionPolicy = LRU timeToLiveSeconds = 1800 timeToIdleSeconds = 2700 diskPersistent = true diskExpiryThreadIntervalSeconds = 600 cacheEventListeners:  hitCount = 0 memoryStoreHitCount = 0 diskStoreHitCount = 0 missCountNotFound = 0 missCountExpired = 0 ]
DEBUG|main| 1127|Registry:commons-configuration - Creating a default configuration - no configuration was provided
DEBUG|main| 1166|CacheManager                   - Attempting to create an existing singleton. Existing singleton returned.
DEBUG|main| 1166|MemoryStore                    - Initialized net.sf.ehcache.store.LruMemoryStore for cache
DEBUG|main| 1166|LruMemoryStore                 - cache Cache: Using SpoolingLinkedHashMap implementation
DEBUG|main| 1166|Cache                          - Initialised cache: cache

.\ testLegacyManagedAndProxyRepoGetAlreadyPresent() \._________________________________________

DEBUG|main| 1172|RepositoryProxyConnectors:default - Attempting connector: ProxyConnector[
  source:ArchivaRepository[legacy-managed-repository,file:/export/home/build/data/continuum/checkouts/282/target/test-repository/legacy-managed/]
  target:ArchivaRepository[legacy-proxied,file:/export/home/build/data/continuum/checkouts/282/src/test/repositories/legacy-proxied/]
  proxyId:null
  policy[releases]:ignored
  policy[snapshots]:ignored
  policy[cache-failures]:ignored
  policy[checksum]:ignored
]
DEBUG|main| 1172|RepositoryProxyConnectors:default - Using target repository: legacy-proxied - layout: legacy - targetPath: org.apache.maven.test/jars/get-default-layout-present-1.0.jar
DEBUG|main| 1173|RepositoryProxyConnectors:default - Applying [releases] policy with [ignored]
DEBUG|main| 1173|PreDownloadPolicy:releases     - OK to update, releases policy set to IGNORED.
DEBUG|main| 1173|RepositoryProxyConnectors:default - Applying [snapshots] policy with [ignored]
DEBUG|main| 1173|PreDownloadPolicy:snapshots    - OK to update, snapshots policy set to IGNORED.
DEBUG|main| 1173|RepositoryProxyConnectors:default - Applying [cache-failures] policy with [ignored]
DEBUG|main| 1173|PreDownloadPolicy:cache-failures - OK to fetch, check-failures policy set to IGNORED.
DEBUG|main| 1174|RepositoryProxyConnectors:default - Retrieving org.apache.maven.test/jars/get-default-layout-present-1.0.jar from Proxied Legacy Repository
DEBUG|main| 1180|RepositoryProxyConnectors:default - Downloaded successfully.
DEBUG|main| 1180|RepositoryProxyConnectors:default - Retrieving org.apache.maven.test/jars/get-default-layout-present-1.0.jar.sha1 from Proxied Legacy Repository if updated
 WARN|main| 1180|RepositoryProxyConnectors:default - Resource does not exist: File: /export/home/build/data/continuum/checkouts/282/src/test/repositories/legacy-proxied/org.apache.maven.test/jars/get-default-layout-present-1.0.jar.sha1 does not exist
DEBUG|main| 1180|RepositoryProxyConnectors:default - Checksum.sha1 Not Download: File: /export/home/build/data/continuum/checkouts/282/src/test/repositories/legacy-proxied/org.apache.maven.test/jars/get-default-layout-present-1.0.jar.sha1 does not exist
DEBUG|main| 1180|RepositoryProxyConnectors:default - Retrieving org.apache.maven.test/jars/get-default-layout-present-1.0.jar.md5 from Proxied Legacy Repository
 WARN|main| 1187|RepositoryProxyConnectors:default - Resource does not exist: File: /export/home/build/data/continuum/checkouts/282/src/test/repositories/legacy-proxied/org.apache.maven.test/jars/get-default-layout-present-1.0.jar.md5 does not exist
DEBUG|main| 1187|RepositoryProxyConnectors:default - Checksum.md5 Not Download: File: /export/home/build/data/continuum/checkouts/282/src/test/repositories/legacy-proxied/org.apache.maven.test/jars/get-default-layout-present-1.0.jar.md5 does not exist
DEBUG|main| 1188|RepositoryProxyConnectors:default - Applying [checksum] policy with [ignored]
 INFO|main| 1188|RepositoryProxyConnectors:default - Successfully transfered: /export/home/build/data/continuum/checkouts/282/target/test-repository/legacy-managed/org.apache.maven.test/jars/get-default-layout-present-1.0.jar
 INFO|main| 1188|Cache:url-failures-cache       - Disposing cache: [  name = cache status = STATUS_ALIVE eternal = false overflowToDisk = false maxElementsInMemory = 1000 maxElementsOnDisk = 0 memoryStoreEvictionPolicy = LRU timeToLiveSeconds = 1800 timeToIdleSeconds = 2700 diskPersistent = true diskExpiryThreadIntervalSeconds = 600 cacheEventListeners:  hitCount = 0 memoryStoreHitCount = 0 diskStoreHitCount = 0 missCountNotFound = 0 missCountExpired = 0 ]
DEBUG|main| 1231|Registry:commons-configuration - Creating a default configuration - no configuration was provided
DEBUG|main| 1276|CacheManager                   - Attempting to create an existing singleton. Existing singleton returned.
DEBUG|main| 1276|MemoryStore                    - Initialized net.sf.ehcache.store.LruMemoryStore for cache
DEBUG|main| 1276|LruMemoryStore                 - cache Cache: Using SpoolingLinkedHashMap implementation
DEBUG|main| 1276|Cache                          - Initialised cache: cache

.\ testDefaultRequestConvertedToLegacyPathInManagedRepo() \._________________________________________

DEBUG|main| 1297|RepositoryProxyConnectors:default - Attempting connector: ProxyConnector[
  source:ArchivaRepository[legacy-managed-repository,file:/export/home/build/data/continuum/checkouts/282/target/test-repository/legacy-managed/]
  target:ArchivaRepository[proxied1,file:/export/home/build/data/continuum/checkouts/282/src/test/repositories/proxied1/]
  proxyId:null
  policy[releases]:ignored
  policy[snapshots]:ignored
  policy[cache-failures]:ignored
  policy[checksum]:ignored
]
DEBUG|main| 1297|RepositoryProxyConnectors:default - Using target repository: proxied1 - layout: default - targetPath: org/apache/maven/test/get-default-layout-present/1.0/get-default-layout-present-1.0.jar
DEBUG|main| 1297|RepositoryProxyConnectors:default - Applying [releases] policy with [ignored]
DEBUG|main| 1298|PreDownloadPolicy:releases     - OK to update, releases policy set to IGNORED.
DEBUG|main| 1298|RepositoryProxyConnectors:default - Applying [snapshots] policy with [ignored]
DEBUG|main| 1298|PreDownloadPolicy:snapshots    - OK to update, snapshots policy set to IGNORED.
DEBUG|main| 1298|RepositoryProxyConnectors:default - Applying [cache-failures] policy with [ignored]
DEBUG|main| 1298|PreDownloadPolicy:cache-failures - OK to fetch, check-failures policy set to IGNORED.
DEBUG|main| 1298|RepositoryProxyConnectors:default - Retrieving org/apache/maven/test/get-default-layout-present/1.0/get-default-layout-present-1.0.jar from Proxied Repository 1 if updated
DEBUG|main| 1299|RepositoryProxyConnectors:default - Downloaded successfully.
DEBUG|main| 1299|RepositoryProxyConnectors:default - Retrieving org/apache/maven/test/get-default-layout-present/1.0/get-default-layout-present-1.0.jar.sha1 from Proxied Repository 1 if updated
 WARN|main| 1300|RepositoryProxyConnectors:default - Resource does not exist: File: /export/home/build/data/continuum/checkouts/282/src/test/repositories/proxied1/org/apache/maven/test/get-default-layout-present/1.0/get-default-layout-present-1.0.jar.sha1 does not exist
DEBUG|main| 1300|RepositoryProxyConnectors:default - Checksum.sha1 Not Download: File: /export/home/build/data/continuum/checkouts/282/src/test/repositories/proxied1/org/apache/maven/test/get-default-layout-present/1.0/get-default-layout-present-1.0.jar.sha1 does not exist
DEBUG|main| 1300|RepositoryProxyConnectors:default - Retrieving org/apache/maven/test/get-default-layout-present/1.0/get-default-layout-present-1.0.jar.md5 from Proxied Repository 1
 WARN|main| 1300|RepositoryProxyConnectors:default - Resource does not exist: File: /export/home/build/data/continuum/checkouts/282/src/test/repositories/proxied1/org/apache/maven/test/get-default-layout-present/1.0/get-default-layout-present-1.0.jar.md5 does not exist
DEBUG|main| 1300|RepositoryProxyConnectors:default - Checksum.md5 Not Download: File: /export/home/build/data/continuum/checkouts/282/src/test/repositories/proxied1/org/apache/maven/test/get-default-layout-present/1.0/get-default-layout-present-1.0.jar.md5 does not exist
DEBUG|main| 1300|RepositoryProxyConnectors:default - Applying [checksum] policy with [ignored]
 INFO|main| 1302|RepositoryProxyConnectors:default - Successfully transfered: /export/home/build/data/continuum/checkouts/282/target/test-repository/legacy-managed/org.apache.maven.test/jars/get-default-layout-present-1.0.jar
 INFO|main| 1320|Cache:url-failures-cache       - Disposing cache: [  name = cache status = STATUS_ALIVE eternal = false overflowToDisk = false maxElementsInMemory = 1000 maxElementsOnDisk = 0 memoryStoreEvictionPolicy = LRU timeToLiveSeconds = 1800 timeToIdleSeconds = 2700 diskPersistent = true diskExpiryThreadIntervalSeconds = 600 cacheEventListeners:  hitCount = 0 memoryStoreHitCount = 0 diskStoreHitCount = 0 missCountNotFound = 0 missCountExpired = 0 ]
Tests run: 5, Failures: 0, Errors: 0, Skipped: 0, Time elapsed: 2.17 sec
Running org.apache.maven.archiva.proxy.CacheFailuresTransferTest
DEBUG|main| 1382|Registry:commons-configuration - Creating a default configuration - no configuration was provided
DEBUG|main| 1428|CacheManager                   - Attempting to create an existing singleton. Existing singleton returned.
DEBUG|main| 1428|MemoryStore                    - Initialized net.sf.ehcache.store.LruMemoryStore for cache
DEBUG|main| 1428|LruMemoryStore                 - cache Cache: Using SpoolingLinkedHashMap implementation
DEBUG|main| 1428|Cache                          - Initialised cache: cache

.\ testGetWithCacheFailuresOn() \._________________________________________

DEBUG|main| 1441|RepositoryProxyConnectors:default - Attempting connector: ProxyConnector[
  source:ArchivaRepository[default-managed-repository,file:/export/home/build/data/continuum/checkouts/282/target/test-repository/managed/]
  target:ArchivaRepository[badproxied1,test://bad.machine.com/repo/]
  proxyId:null
  policy[releases]:ignored
  policy[snapshots]:ignored
  policy[cache-failures]:cached
  policy[checksum]:fix
]
DEBUG|main| 1441|RepositoryProxyConnectors:default - Using target repository: badproxied1 - layout: default - targetPath: org/apache/maven/test/get-in-second-proxy/1.0/get-in-second-proxy-1.0.jar
DEBUG|main| 1442|RepositoryProxyConnectors:default - Applying [releases] policy with [ignored]
DEBUG|main| 1442|PreDownloadPolicy:releases     - OK to update, releases policy set to IGNORED.
DEBUG|main| 1442|RepositoryProxyConnectors:default - Applying [snapshots] policy with [ignored]
DEBUG|main| 1442|PreDownloadPolicy:snapshots    - OK to update, snapshots policy set to IGNORED.
DEBUG|main| 1442|RepositoryProxyConnectors:default - Applying [cache-failures] policy with [cached]
DEBUG|main| 1442|PreDownloadPolicy:cache-failures - OK to fetch, check-failures detected no issues.
DEBUG|main| 1443|RepositoryProxyConnectors:default - Retrieving org/apache/maven/test/get-in-second-proxy/1.0/get-in-second-proxy-1.0.jar from Bad Proxied 1 if updated
DEBUG|main| 1443|Wagon:test                     - .getIfNewer(org/apache/maven/test/get-in-second-proxy/1.0/get-in-second-proxy-1.0.jar, /export/home/build/data/continuum/checkouts/282/target/test-repository/managed/org/apache/maven/test/get-in-second-proxy/1.0/get-in-second-proxy-1.0.jar.tmp, 0)
 WARN|main| 1445|RepositoryProxyConnectors:default - Download failure:transfer failed
org.apache.maven.wagon.TransferFailedException: transfer failed
	at org.easymock.MockControl$4.invoke(MockControl.java:150)
	at org.easymock.internal.ObjectMethodsFilter.invoke(ObjectMethodsFilter.java:44)
	at $Proxy2.getIfNewer(Unknown Source)
	at org.apache.maven.archiva.proxy.WagonDelegate.getIfNewer(WagonDelegate.java:66)
	at org.apache.maven.archiva.proxy.DefaultRepositoryProxyConnectors.transferSimpleFile(DefaultRepositoryProxyConnectors.java:463)
	at org.apache.maven.archiva.proxy.DefaultRepositoryProxyConnectors.transferFile(DefaultRepositoryProxyConnectors.java:357)
	at org.apache.maven.archiva.proxy.DefaultRepositoryProxyConnectors.fetchFromProxies(DefaultRepositoryProxyConnectors.java:150)
	at org.apache.maven.archiva.proxy.CacheFailuresTransferTest.testGetWithCacheFailuresOn(CacheFailuresTransferTest.java:69)
	at sun.reflect.NativeMethodAccessorImpl.invoke0(Native Method)
	at sun.reflect.NativeMethodAccessorImpl.invoke(NativeMethodAccessorImpl.java:39)
	at sun.reflect.DelegatingMethodAccessorImpl.invoke(DelegatingMethodAccessorImpl.java:25)
	at java.lang.reflect.Method.invoke(Method.java:585)
	at junit.framework.TestCase.runTest(TestCase.java:154)
	at junit.framework.TestCase.runBare(TestCase.java:127)
	at junit.framework.TestResult$1.protect(TestResult.java:106)
	at junit.framework.TestResult.runProtected(TestResult.java:124)
	at junit.framework.TestResult.run(TestResult.java:109)
	at junit.framework.TestCase.run(TestCase.java:118)
	at junit.framework.TestSuite.runTest(TestSuite.java:208)
	at junit.framework.TestSuite.run(TestSuite.java:203)
	at sun.reflect.NativeMethodAccessorImpl.invoke0(Native Method)
	at sun.reflect.NativeMethodAccessorImpl.invoke(NativeMethodAccessorImpl.java:39)
	at sun.reflect.DelegatingMethodAccessorImpl.invoke(DelegatingMethodAccessorImpl.java:25)
	at java.lang.reflect.Method.invoke(Method.java:585)
	at org.apache.maven.surefire.junit.JUnitTestSet.execute(JUnitTestSet.java:210)
	at org.apache.maven.surefire.suite.AbstractDirectoryTestSuite.executeTestSet(AbstractDirectoryTestSuite.java:135)
	at org.apache.maven.surefire.suite.AbstractDirectoryTestSuite.execute(AbstractDirectoryTestSuite.java:122)
	at org.apache.maven.surefire.Surefire.run(Surefire.java:129)
	at sun.reflect.NativeMethodAccessorImpl.invoke0(Native Method)
	at sun.reflect.NativeMethodAccessorImpl.invoke(NativeMethodAccessorImpl.java:39)
	at sun.reflect.DelegatingMethodAccessorImpl.invoke(DelegatingMethodAccessorImpl.java:25)
	at java.lang.reflect.Method.invoke(Method.java:585)
	at org.apache.maven.surefire.booter.SurefireBooter.runSuitesInProcess(SurefireBooter.java:225)
	at org.apache.maven.surefire.booter.SurefireBooter.main(SurefireBooter.java:747)
DEBUG|main| 1456|RepositoryProxyConnectors:default - Attempting connector: ProxyConnector[
  source:ArchivaRepository[default-managed-repository,file:/export/home/build/data/continuum/checkouts/282/target/test-repository/managed/]
  target:ArchivaRepository[badproxied2,test://bad.machine.com/repo/]
  proxyId:null
  policy[releases]:ignored
  policy[snapshots]:ignored
  policy[cache-failures]:cached
  policy[checksum]:fix
]
DEBUG|main| 1456|RepositoryProxyConnectors:default - Using target repository: badproxied2 - layout: default - targetPath: org/apache/maven/test/get-in-second-proxy/1.0/get-in-second-proxy-1.0.jar
DEBUG|main| 1456|RepositoryProxyConnectors:default - Applying [releases] policy with [ignored]
DEBUG|main| 1456|PreDownloadPolicy:releases     - OK to update, releases policy set to IGNORED.
DEBUG|main| 1456|RepositoryProxyConnectors:default - Applying [snapshots] policy with [ignored]
DEBUG|main| 1456|PreDownloadPolicy:snapshots    - OK to update, snapshots policy set to IGNORED.
DEBUG|main| 1456|RepositoryProxyConnectors:default - Applying [cache-failures] policy with [cached]
DEBUG|main| 1456|PreDownloadPolicy:cache-failures - NO to fetch, check-failures detected previous failure on url: test://bad.machine.com/repo/org/apache/maven/test/get-in-second-proxy/1.0/get-in-second-proxy-1.0.jar
DEBUG|main| 1456|RepositoryProxyConnectors:default - Didn't pass the [cache-failures] policy.
 INFO|main| 1456|RepositoryProxyConnectors:default - Failed pre-download policies - /export/home/build/data/continuum/checkouts/282/target/test-repository/managed/org/apache/maven/test/get-in-second-proxy/1.0/get-in-second-proxy-1.0.jar
 INFO|main| 1459|Cache:url-failures-cache       - Disposing cache: [  name = cache status = STATUS_ALIVE eternal = false overflowToDisk = false maxElementsInMemory = 1000 maxElementsOnDisk = 0 memoryStoreEvictionPolicy = LRU timeToLiveSeconds = 1800 timeToIdleSeconds = 2700 diskPersistent = false diskExpiryThreadIntervalSeconds = 600 cacheEventListeners:  hitCount = 0 memoryStoreHitCount = 0 diskStoreHitCount = 0 missCountNotFound = 0 missCountExpired = 0 ]
DEBUG|main| 1513|Registry:commons-configuration - Creating a default configuration - no configuration was provided
DEBUG|main| 1576|CacheManager                   - Attempting to create an existing singleton. Existing singleton returned.
DEBUG|main| 1576|MemoryStore                    - Initialized net.sf.ehcache.store.LruMemoryStore for cache
DEBUG|main| 1576|LruMemoryStore                 - cache Cache: Using SpoolingLinkedHashMap implementation
DEBUG|main| 1576|Cache                          - Initialised cache: cache

.\ testGetWithCacheFailuresOff() \._________________________________________

DEBUG|main| 1580|RepositoryProxyConnectors:default - Attempting connector: ProxyConnector[
  source:ArchivaRepository[default-managed-repository,file:/export/home/build/data/continuum/checkouts/282/target/test-repository/managed/]
  target:ArchivaRepository[badproxied1,test://bad.machine.com/repo/]
  proxyId:null
  policy[releases]:ignored
  policy[snapshots]:ignored
  policy[cache-failures]:ignored
  policy[checksum]:fix
]
DEBUG|main| 1580|RepositoryProxyConnectors:default - Using target repository: badproxied1 - layout: default - targetPath: org/apache/maven/test/get-in-second-proxy/1.0/get-in-second-proxy-1.0.jar
DEBUG|main| 1580|RepositoryProxyConnectors:default - Applying [releases] policy with [ignored]
DEBUG|main| 1581|PreDownloadPolicy:releases     - OK to update, releases policy set to IGNORED.
DEBUG|main| 1581|RepositoryProxyConnectors:default - Applying [snapshots] policy with [ignored]
DEBUG|main| 1581|PreDownloadPolicy:snapshots    - OK to update, snapshots policy set to IGNORED.
DEBUG|main| 1581|RepositoryProxyConnectors:default - Applying [cache-failures] policy with [ignored]
DEBUG|main| 1581|PreDownloadPolicy:cache-failures - OK to fetch, check-failures policy set to IGNORED.
DEBUG|main| 1581|RepositoryProxyConnectors:default - Retrieving org/apache/maven/test/get-in-second-proxy/1.0/get-in-second-proxy-1.0.jar from Bad Proxied 1 if updated
DEBUG|main| 1581|Wagon:test                     - .getIfNewer(org/apache/maven/test/get-in-second-proxy/1.0/get-in-second-proxy-1.0.jar, /export/home/build/data/continuum/checkouts/282/target/test-repository/managed/org/apache/maven/test/get-in-second-proxy/1.0/get-in-second-proxy-1.0.jar.tmp, 0)
 WARN|main| 1581|RepositoryProxyConnectors:default - Download failure:transfer failed
org.apache.maven.wagon.TransferFailedException: transfer failed
	at org.easymock.MockControl$4.invoke(MockControl.java:150)
	at org.easymock.internal.ObjectMethodsFilter.invoke(ObjectMethodsFilter.java:44)
	at $Proxy2.getIfNewer(Unknown Source)
	at org.apache.maven.archiva.proxy.WagonDelegate.getIfNewer(WagonDelegate.java:66)
	at org.apache.maven.archiva.proxy.DefaultRepositoryProxyConnectors.transferSimpleFile(DefaultRepositoryProxyConnectors.java:463)
	at org.apache.maven.archiva.proxy.DefaultRepositoryProxyConnectors.transferFile(DefaultRepositoryProxyConnectors.java:357)
	at org.apache.maven.archiva.proxy.DefaultRepositoryProxyConnectors.fetchFromProxies(DefaultRepositoryProxyConnectors.java:150)
	at org.apache.maven.archiva.proxy.CacheFailuresTransferTest.testGetWithCacheFailuresOff(CacheFailuresTransferTest.java:103)
	at sun.reflect.NativeMethodAccessorImpl.invoke0(Native Method)
	at sun.reflect.NativeMethodAccessorImpl.invoke(NativeMethodAccessorImpl.java:39)
	at sun.reflect.DelegatingMethodAccessorImpl.invoke(DelegatingMethodAccessorImpl.java:25)
	at java.lang.reflect.Method.invoke(Method.java:585)
	at junit.framework.TestCase.runTest(TestCase.java:154)
	at junit.framework.TestCase.runBare(TestCase.java:127)
	at junit.framework.TestResult$1.protect(TestResult.java:106)
	at junit.framework.TestResult.runProtected(TestResult.java:124)
	at junit.framework.TestResult.run(TestResult.java:109)
	at junit.framework.TestCase.run(TestCase.java:118)
	at junit.framework.TestSuite.runTest(TestSuite.java:208)
	at junit.framework.TestSuite.run(TestSuite.java:203)
	at sun.reflect.NativeMethodAccessorImpl.invoke0(Native Method)
	at sun.reflect.NativeMethodAccessorImpl.invoke(NativeMethodAccessorImpl.java:39)
	at sun.reflect.DelegatingMethodAccessorImpl.invoke(DelegatingMethodAccessorImpl.java:25)
	at java.lang.reflect.Method.invoke(Method.java:585)
	at org.apache.maven.surefire.junit.JUnitTestSet.execute(JUnitTestSet.java:210)
	at org.apache.maven.surefire.suite.AbstractDirectoryTestSuite.executeTestSet(AbstractDirectoryTestSuite.java:135)
	at org.apache.maven.surefire.suite.AbstractDirectoryTestSuite.execute(AbstractDirectoryTestSuite.java:122)
	at org.apache.maven.surefire.Surefire.run(Surefire.java:129)
	at sun.reflect.NativeMethodAccessorImpl.invoke0(Native Method)
	at sun.reflect.NativeMethodAccessorImpl.invoke(NativeMethodAccessorImpl.java:39)
	at sun.reflect.DelegatingMethodAccessorImpl.invoke(DelegatingMethodAccessorImpl.java:25)
	at java.lang.reflect.Method.invoke(Method.java:585)
	at org.apache.maven.surefire.booter.SurefireBooter.runSuitesInProcess(SurefireBooter.java:225)
	at org.apache.maven.surefire.booter.SurefireBooter.main(SurefireBooter.java:747)
DEBUG|main| 1582|RepositoryProxyConnectors:default - Attempting connector: ProxyConnector[
  source:ArchivaRepository[default-managed-repository,file:/export/home/build/data/continuum/checkouts/282/target/test-repository/managed/]
  target:ArchivaRepository[badproxied2,test://bad.machine.com/repo/]
  proxyId:null
  policy[releases]:ignored
  policy[snapshots]:ignored
  policy[cache-failures]:ignored
  policy[checksum]:fix
]
DEBUG|main| 1582|RepositoryProxyConnectors:default - Using target repository: badproxied2 - layout: default - targetPath: org/apache/maven/test/get-in-second-proxy/1.0/get-in-second-proxy-1.0.jar
DEBUG|main| 1582|RepositoryProxyConnectors:default - Applying [releases] policy with [ignored]
DEBUG|main| 1582|PreDownloadPolicy:releases     - OK to update, releases policy set to IGNORED.
DEBUG|main| 1583|RepositoryProxyConnectors:default - Applying [snapshots] policy with [ignored]
DEBUG|main| 1583|PreDownloadPolicy:snapshots    - OK to update, snapshots policy set to IGNORED.
DEBUG|main| 1583|RepositoryProxyConnectors:default - Applying [cache-failures] policy with [ignored]
DEBUG|main| 1583|PreDownloadPolicy:cache-failures - OK to fetch, check-failures policy set to IGNORED.
DEBUG|main| 1583|RepositoryProxyConnectors:default - Retrieving org/apache/maven/test/get-in-second-proxy/1.0/get-in-second-proxy-1.0.jar from Bad Proxied 2 if updated
DEBUG|main| 1583|Wagon:test                     - .getIfNewer(org/apache/maven/test/get-in-second-proxy/1.0/get-in-second-proxy-1.0.jar, /export/home/build/data/continuum/checkouts/282/target/test-repository/managed/org/apache/maven/test/get-in-second-proxy/1.0/get-in-second-proxy-1.0.jar.tmp, 0)
DEBUG|main| 1584|RepositoryProxyConnectors:default - Not downloaded, as local file is newer than remote side: /export/home/build/data/continuum/checkouts/282/target/test-repository/managed/org/apache/maven/test/get-in-second-proxy/1.0/get-in-second-proxy-1.0.jar
DEBUG|main| 1584|RepositoryProxyConnectors:default - Retrieving org/apache/maven/test/get-in-second-proxy/1.0/get-in-second-proxy-1.0.jar.sha1 from Bad Proxied 2 if updated
DEBUG|main| 1584|Wagon:test                     - .getIfNewer(org/apache/maven/test/get-in-second-proxy/1.0/get-in-second-proxy-1.0.jar.sha1, /export/home/build/data/continuum/checkouts/282/target/test-repository/managed/org/apache/maven/test/get-in-second-proxy/1.0/get-in-second-proxy-1.0.jar.sha1.tmp, 0)
DEBUG|main| 1584|RepositoryProxyConnectors:default - Not downloaded, as local file is newer than remote side: /export/home/build/data/continuum/checkouts/282/target/test-repository/managed/org/apache/maven/test/get-in-second-proxy/1.0/get-in-second-proxy-1.0.jar.sha1
DEBUG|main| 1584|RepositoryProxyConnectors:default - Checksum.sha1 Downloaded: /export/home/build/data/continuum/checkouts/282/target/test-repository/managed/org/apache/maven/test/get-in-second-proxy/1.0/get-in-second-proxy-1.0.jar.sha1
DEBUG|main| 1585|RepositoryProxyConnectors:default - Retrieving org/apache/maven/test/get-in-second-proxy/1.0/get-in-second-proxy-1.0.jar.md5 from Bad Proxied 2 if updated
DEBUG|main| 1585|Wagon:test                     - .getIfNewer(org/apache/maven/test/get-in-second-proxy/1.0/get-in-second-proxy-1.0.jar.md5, /export/home/build/data/continuum/checkouts/282/target/test-repository/managed/org/apache/maven/test/get-in-second-proxy/1.0/get-in-second-proxy-1.0.jar.md5.tmp, 0)
DEBUG|main| 1585|RepositoryProxyConnectors:default - Not downloaded, as local file is newer than remote side: /export/home/build/data/continuum/checkouts/282/target/test-repository/managed/org/apache/maven/test/get-in-second-proxy/1.0/get-in-second-proxy-1.0.jar.md5
DEBUG|main| 1591|RepositoryProxyConnectors:default - Checksum.md5 Downloaded: /export/home/build/data/continuum/checkouts/282/target/test-repository/managed/org/apache/maven/test/get-in-second-proxy/1.0/get-in-second-proxy-1.0.jar.md5
DEBUG|main| 1591|RepositoryProxyConnectors:default - Applying [checksum] policy with [fix]
DEBUG|main| 1591|PostDownloadPolicy:checksum    - Local file /export/home/build/data/continuum/checkouts/282/target/test-repository/managed/org/apache/maven/test/get-in-second-proxy/1.0/get-in-second-proxy-1.0.jar does not exist.
DEBUG|main| 1592|RepositoryProxyConnectors:default - Didn't pass the [checksum] policy.
 INFO|main| 1592|RepositoryProxyConnectors:default - Failed post-download policies - /export/home/build/data/continuum/checkouts/282/target/test-repository/managed/org/apache/maven/test/get-in-second-proxy/1.0/get-in-second-proxy-1.0.jar
 INFO|main| 1592|Cache:url-failures-cache       - Disposing cache: [  name = cache status = STATUS_ALIVE eternal = false overflowToDisk = false maxElementsInMemory = 1000 maxElementsOnDisk = 0 memoryStoreEvictionPolicy = LRU timeToLiveSeconds = 1800 timeToIdleSeconds = 2700 diskPersistent = false diskExpiryThreadIntervalSeconds = 600 cacheEventListeners:  hitCount = 0 memoryStoreHitCount = 0 diskStoreHitCount = 0 missCountNotFound = 0 missCountExpired = 0 ]
DEBUG|main| 1645|Registry:commons-configuration - Creating a default configuration - no configuration was provided
DEBUG|main| 1680|CacheManager                   - Attempting to create an existing singleton. Existing singleton returned.
DEBUG|main| 1681|MemoryStore                    - Initialized net.sf.ehcache.store.LruMemoryStore for cache
DEBUG|main| 1681|LruMemoryStore                 - cache Cache: Using SpoolingLinkedHashMap implementation
DEBUG|main| 1681|Cache                          - Initialised cache: cache

.\ testGetWhenInBothProxiedButFirstCacheFailure() \._________________________________________

DEBUG|main| 1687|RepositoryProxyConnectors:default - Attempting connector: ProxyConnector[
  source:ArchivaRepository[default-managed-repository,file:/export/home/build/data/continuum/checkouts/282/target/test-repository/managed/]
  target:ArchivaRepository[proxied1,file:/export/home/build/data/continuum/checkouts/282/src/test/repositories/proxied1/]
  proxyId:null
  policy[releases]:ignored
  policy[snapshots]:ignored
  policy[cache-failures]:cached
  policy[checksum]:fix
]
DEBUG|main| 1687|RepositoryProxyConnectors:default - Using target repository: proxied1 - layout: default - targetPath: org/apache/maven/test/get-in-second-proxy/1.0/get-in-second-proxy-1.0.jar
DEBUG|main| 1687|RepositoryProxyConnectors:default - Applying [releases] policy with [ignored]
DEBUG|main| 1687|PreDownloadPolicy:releases     - OK to update, releases policy set to IGNORED.
DEBUG|main| 1690|RepositoryProxyConnectors:default - Applying [snapshots] policy with [ignored]
DEBUG|main| 1690|PreDownloadPolicy:snapshots    - OK to update, snapshots policy set to IGNORED.
DEBUG|main| 1690|RepositoryProxyConnectors:default - Applying [cache-failures] policy with [cached]
DEBUG|main| 1690|PreDownloadPolicy:cache-failures - NO to fetch, check-failures detected previous failure on url: file:/export/home/build/data/continuum/checkouts/282/src/test/repositories/proxied1/org/apache/maven/test/get-in-second-proxy/1.0/get-in-second-proxy-1.0.jar
DEBUG|main| 1690|RepositoryProxyConnectors:default - Didn't pass the [cache-failures] policy.
 INFO|main| 1690|RepositoryProxyConnectors:default - Failed pre-download policies - /export/home/build/data/continuum/checkouts/282/target/test-repository/managed/org/apache/maven/test/get-in-second-proxy/1.0/get-in-second-proxy-1.0.jar
DEBUG|main| 1690|RepositoryProxyConnectors:default - Attempting connector: ProxyConnector[
  source:ArchivaRepository[default-managed-repository,file:/export/home/build/data/continuum/checkouts/282/target/test-repository/managed/]
  target:ArchivaRepository[proxied2,file:/export/home/build/data/continuum/checkouts/282/src/test/repositories/proxied2/]
  proxyId:null
  policy[releases]:ignored
  policy[snapshots]:ignored
  policy[cache-failures]:cached
  policy[checksum]:fix
]
DEBUG|main| 1691|RepositoryProxyConnectors:default - Using target repository: proxied2 - layout: default - targetPath: org/apache/maven/test/get-in-second-proxy/1.0/get-in-second-proxy-1.0.jar
DEBUG|main| 1691|RepositoryProxyConnectors:default - Applying [releases] policy with [ignored]
DEBUG|main| 1691|PreDownloadPolicy:releases     - OK to update, releases policy set to IGNORED.
DEBUG|main| 1691|RepositoryProxyConnectors:default - Applying [snapshots] policy with [ignored]
DEBUG|main| 1692|PreDownloadPolicy:snapshots    - OK to update, snapshots policy set to IGNORED.
DEBUG|main| 1692|RepositoryProxyConnectors:default - Applying [cache-failures] policy with [cached]
DEBUG|main| 1692|PreDownloadPolicy:cache-failures - OK to fetch, check-failures detected no issues.
DEBUG|main| 1692|RepositoryProxyConnectors:default - Retrieving org/apache/maven/test/get-in-second-proxy/1.0/get-in-second-proxy-1.0.jar from Proxied Repository 2 if updated
DEBUG|main| 1703|RepositoryProxyConnectors:default - Downloaded successfully.
DEBUG|main| 1707|RepositoryProxyConnectors:default - Retrieving org/apache/maven/test/get-in-second-proxy/1.0/get-in-second-proxy-1.0.jar.sha1 from Proxied Repository 2 if updated
 WARN|main| 1708|RepositoryProxyConnectors:default - Resource does not exist: File: /export/home/build/data/continuum/checkouts/282/src/test/repositories/proxied2/org/apache/maven/test/get-in-second-proxy/1.0/get-in-second-proxy-1.0.jar.sha1 does not exist
DEBUG|main| 1708|RepositoryProxyConnectors:default - Checksum.sha1 Not Download: File: /export/home/build/data/continuum/checkouts/282/src/test/repositories/proxied2/org/apache/maven/test/get-in-second-proxy/1.0/get-in-second-proxy-1.0.jar.sha1 does not exist
DEBUG|main| 1708|RepositoryProxyConnectors:default - Retrieving org/apache/maven/test/get-in-second-proxy/1.0/get-in-second-proxy-1.0.jar.md5 from Proxied Repository 2 if updated
 WARN|main| 1709|RepositoryProxyConnectors:default - Resource does not exist: File: /export/home/build/data/continuum/checkouts/282/src/test/repositories/proxied2/org/apache/maven/test/get-in-second-proxy/1.0/get-in-second-proxy-1.0.jar.md5 does not exist
DEBUG|main| 1709|RepositoryProxyConnectors:default - Checksum.md5 Not Download: File: /export/home/build/data/continuum/checkouts/282/src/test/repositories/proxied2/org/apache/maven/test/get-in-second-proxy/1.0/get-in-second-proxy-1.0.jar.md5 does not exist
DEBUG|main| 1709|RepositoryProxyConnectors:default - Applying [checksum] policy with [fix]
 INFO|main| 1710|RepositoryProxyConnectors:default - Successfully transfered: /export/home/build/data/continuum/checkouts/282/target/test-repository/managed/org/apache/maven/test/get-in-second-proxy/1.0/get-in-second-proxy-1.0.jar
 INFO|main| 1710|Cache:url-failures-cache       - Disposing cache: [  name = cache status = STATUS_ALIVE eternal = false overflowToDisk = false maxElementsInMemory = 1000 maxElementsOnDisk = 0 memoryStoreEvictionPolicy = LRU timeToLiveSeconds = 1800 timeToIdleSeconds = 2700 diskPersistent = false diskExpiryThreadIntervalSeconds = 600 cacheEventListeners:  hitCount = 0 memoryStoreHitCount = 0 diskStoreHitCount = 0 missCountNotFound = 0 missCountExpired = 0 ]
Tests run: 3, Failures: 0, Errors: 0, Skipped: 0, Time elapsed: 0.372 sec
Running org.apache.maven.archiva.proxy.SnapshotTransferTest
DEBUG|main| 1745|Registry:commons-configuration - Creating a default configuration - no configuration was provided
DEBUG|main| 1777|CacheManager                   - Attempting to create an existing singleton. Existing singleton returned.
DEBUG|main| 1777|MemoryStore                    - Initialized net.sf.ehcache.store.LruMemoryStore for cache
DEBUG|main| 1777|LruMemoryStore                 - cache Cache: Using SpoolingLinkedHashMap implementation
DEBUG|main| 1777|Cache                          - Initialised cache: cache

.\ testSnapshotNonExistant() \._________________________________________

DEBUG|main| 1783|RepositoryProxyConnectors:default - Attempting connector: ProxyConnector[
  source:ArchivaRepository[default-managed-repository,file:/export/home/build/data/continuum/checkouts/282/target/test-repository/managed/]
  target:ArchivaRepository[proxied1,file:/export/home/build/data/continuum/checkouts/282/src/test/repositories/proxied1/]
  proxyId:null
  policy[releases]:ignored
  policy[snapshots]:ignored
  policy[cache-failures]:ignored
  policy[checksum]:ignored
]
DEBUG|main| 1783|RepositoryProxyConnectors:default - Using target repository: proxied1 - layout: default - targetPath: org/apache/maven/test/does-not-exist/1.0-SNAPSHOT/does-not-exist-1.0-SNAPSHOT.jar
DEBUG|main| 1783|RepositoryProxyConnectors:default - Applying [releases] policy with [ignored]
DEBUG|main| 1784|PreDownloadPolicy:releases     - OK to update, releases policy set to IGNORED.
DEBUG|main| 1784|RepositoryProxyConnectors:default - Applying [snapshots] policy with [ignored]
DEBUG|main| 1784|PreDownloadPolicy:snapshots    - OK to update, snapshots policy set to IGNORED.
DEBUG|main| 1784|RepositoryProxyConnectors:default - Applying [cache-failures] policy with [ignored]
DEBUG|main| 1784|PreDownloadPolicy:cache-failures - OK to fetch, check-failures policy set to IGNORED.
DEBUG|main| 1784|RepositoryProxyConnectors:default - Retrieving org/apache/maven/test/does-not-exist/1.0-SNAPSHOT/does-not-exist-1.0-SNAPSHOT.jar from Proxied Repository 1 if updated
 WARN|main| 1784|RepositoryProxyConnectors:default - Resource does not exist: File: /export/home/build/data/continuum/checkouts/282/src/test/repositories/proxied1/org/apache/maven/test/does-not-exist/1.0-SNAPSHOT/does-not-exist-1.0-SNAPSHOT.jar does not exist
 INFO|main| 1785|Cache:url-failures-cache       - Disposing cache: [  name = cache status = STATUS_ALIVE eternal = false overflowToDisk = false maxElementsInMemory = 1000 maxElementsOnDisk = 0 memoryStoreEvictionPolicy = LRU timeToLiveSeconds = 1800 timeToIdleSeconds = 2700 diskPersistent = true diskExpiryThreadIntervalSeconds = 600 cacheEventListeners:  hitCount = 0 memoryStoreHitCount = 0 diskStoreHitCount = 0 missCountNotFound = 0 missCountExpired = 0 ]
DEBUG|main| 1809|Registry:commons-configuration - Creating a default configuration - no configuration was provided
DEBUG|main| 1871|CacheManager                   - Attempting to create an existing singleton. Existing singleton returned.
DEBUG|main| 1871|MemoryStore                    - Initialized net.sf.ehcache.store.LruMemoryStore for cache
DEBUG|main| 1871|LruMemoryStore                 - cache Cache: Using SpoolingLinkedHashMap implementation
DEBUG|main| 1871|Cache                          - Initialised cache: cache

.\ testTimestampDrivenSnapshotNotPresentAlready() \._________________________________________

DEBUG|main| 1875|RepositoryProxyConnectors:default - Attempting connector: ProxyConnector[
  source:ArchivaRepository[default-managed-repository,file:/export/home/build/data/continuum/checkouts/282/target/test-repository/managed/]
  target:ArchivaRepository[proxied1,file:/export/home/build/data/continuum/checkouts/282/src/test/repositories/proxied1/]
  proxyId:null
  policy[releases]:ignored
  policy[snapshots]:ignored
  policy[cache-failures]:ignored
  policy[checksum]:ignored
]
DEBUG|main| 1875|RepositoryProxyConnectors:default - Using target repository: proxied1 - layout: default - targetPath: org/apache/maven/test/get-timestamped-snapshot/1.0-SNAPSHOT/get-timestamped-snapshot-1.0-SNAPSHOT.jar
DEBUG|main| 1875|RepositoryProxyConnectors:default - Applying [releases] policy with [ignored]
DEBUG|main| 1875|PreDownloadPolicy:releases     - OK to update, releases policy set to IGNORED.
DEBUG|main| 1876|RepositoryProxyConnectors:default - Applying [snapshots] policy with [ignored]
DEBUG|main| 1876|PreDownloadPolicy:snapshots    - OK to update, snapshots policy set to IGNORED.
DEBUG|main| 1876|RepositoryProxyConnectors:default - Applying [cache-failures] policy with [ignored]
DEBUG|main| 1876|PreDownloadPolicy:cache-failures - OK to fetch, check-failures policy set to IGNORED.
DEBUG|main| 1876|RepositoryProxyConnectors:default - Retrieving org/apache/maven/test/get-timestamped-snapshot/1.0-SNAPSHOT/get-timestamped-snapshot-1.0-SNAPSHOT.jar from Proxied Repository 1 if updated
DEBUG|main| 1878|RepositoryProxyConnectors:default - Downloaded successfully.
DEBUG|main| 1878|RepositoryProxyConnectors:default - Retrieving org/apache/maven/test/get-timestamped-snapshot/1.0-SNAPSHOT/get-timestamped-snapshot-1.0-SNAPSHOT.jar.sha1 from Proxied Repository 1 if updated
 WARN|main| 1878|RepositoryProxyConnectors:default - Resource does not exist: File: /export/home/build/data/continuum/checkouts/282/src/test/repositories/proxied1/org/apache/maven/test/get-timestamped-snapshot/1.0-SNAPSHOT/get-timestamped-snapshot-1.0-SNAPSHOT.jar.sha1 does not exist
DEBUG|main| 1879|RepositoryProxyConnectors:default - Checksum.sha1 Not Download: File: /export/home/build/data/continuum/checkouts/282/src/test/repositories/proxied1/org/apache/maven/test/get-timestamped-snapshot/1.0-SNAPSHOT/get-timestamped-snapshot-1.0-SNAPSHOT.jar.sha1 does not exist
DEBUG|main| 1879|RepositoryProxyConnectors:default - Retrieving org/apache/maven/test/get-timestamped-snapshot/1.0-SNAPSHOT/get-timestamped-snapshot-1.0-SNAPSHOT.jar.md5 from Proxied Repository 1 if updated
 WARN|main| 1879|RepositoryProxyConnectors:default - Resource does not exist: File: /export/home/build/data/continuum/checkouts/282/src/test/repositories/proxied1/org/apache/maven/test/get-timestamped-snapshot/1.0-SNAPSHOT/get-timestamped-snapshot-1.0-SNAPSHOT.jar.md5 does not exist
DEBUG|main| 1879|RepositoryProxyConnectors:default - Checksum.md5 Not Download: File: /export/home/build/data/continuum/checkouts/282/src/test/repositories/proxied1/org/apache/maven/test/get-timestamped-snapshot/1.0-SNAPSHOT/get-timestamped-snapshot-1.0-SNAPSHOT.jar.md5 does not exist
DEBUG|main| 1879|RepositoryProxyConnectors:default - Applying [checksum] policy with [ignored]
 INFO|main| 1879|RepositoryProxyConnectors:default - Successfully transfered: /export/home/build/data/continuum/checkouts/282/target/test-repository/managed/org/apache/maven/test/get-timestamped-snapshot/1.0-SNAPSHOT/get-timestamped-snapshot-1.0-SNAPSHOT.jar
 INFO|main| 1880|Cache:url-failures-cache       - Disposing cache: [  name = cache status = STATUS_ALIVE eternal = false overflowToDisk = false maxElementsInMemory = 1000 maxElementsOnDisk = 0 memoryStoreEvictionPolicy = LRU timeToLiveSeconds = 1800 timeToIdleSeconds = 2700 diskPersistent = true diskExpiryThreadIntervalSeconds = 600 cacheEventListeners:  hitCount = 0 memoryStoreHitCount = 0 diskStoreHitCount = 0 missCountNotFound = 0 missCountExpired = 0 ]
DEBUG|main| 1903|Registry:commons-configuration - Creating a default configuration - no configuration was provided
DEBUG|main| 1933|CacheManager                   - Attempting to create an existing singleton. Existing singleton returned.
DEBUG|main| 1934|MemoryStore                    - Initialized net.sf.ehcache.store.LruMemoryStore for cache
DEBUG|main| 1934|LruMemoryStore                 - cache Cache: Using SpoolingLinkedHashMap implementation
DEBUG|main| 1934|Cache                          - Initialised cache: cache

.\ testNewerTimestampDrivenSnapshotOnFirstRepo() \._________________________________________

DEBUG|main| 1942|RepositoryProxyConnectors:default - Attempting connector: ProxyConnector[
  source:ArchivaRepository[default-managed-repository,file:/export/home/build/data/continuum/checkouts/282/target/test-repository/managed/]
  target:ArchivaRepository[proxied1,file:/export/home/build/data/continuum/checkouts/282/src/test/repositories/proxied1/]
  proxyId:null
  policy[releases]:ignored
  policy[snapshots]:ignored
  policy[cache-failures]:ignored
  policy[checksum]:ignored
]
DEBUG|main| 1942|RepositoryProxyConnectors:default - Using target repository: proxied1 - layout: default - targetPath: org/apache/maven/test/get-present-timestamped-snapshot/1.0-SNAPSHOT/get-present-timestamped-snapshot-1.0-SNAPSHOT.jar
DEBUG|main| 1942|RepositoryProxyConnectors:default - Applying [releases] policy with [ignored]
DEBUG|main| 1942|PreDownloadPolicy:releases     - OK to update, releases policy set to IGNORED.
DEBUG|main| 1942|RepositoryProxyConnectors:default - Applying [snapshots] policy with [ignored]
DEBUG|main| 1942|PreDownloadPolicy:snapshots    - OK to update, snapshots policy set to IGNORED.
DEBUG|main| 1942|RepositoryProxyConnectors:default - Applying [cache-failures] policy with [ignored]
DEBUG|main| 1943|PreDownloadPolicy:cache-failures - OK to fetch, check-failures policy set to IGNORED.
DEBUG|main| 1943|RepositoryProxyConnectors:default - Retrieving org/apache/maven/test/get-present-timestamped-snapshot/1.0-SNAPSHOT/get-present-timestamped-snapshot-1.0-SNAPSHOT.jar from Proxied Repository 1
DEBUG|main| 1944|RepositoryProxyConnectors:default - Downloaded successfully.
DEBUG|main| 1944|RepositoryProxyConnectors:default - Retrieving org/apache/maven/test/get-present-timestamped-snapshot/1.0-SNAPSHOT/get-present-timestamped-snapshot-1.0-SNAPSHOT.jar.sha1 from Proxied Repository 1 if updated
 WARN|main| 1944|RepositoryProxyConnectors:default - Resource does not exist: File: /export/home/build/data/continuum/checkouts/282/src/test/repositories/proxied1/org/apache/maven/test/get-present-timestamped-snapshot/1.0-SNAPSHOT/get-present-timestamped-snapshot-1.0-SNAPSHOT.jar.sha1 does not exist
DEBUG|main| 1944|RepositoryProxyConnectors:default - Checksum.sha1 Not Download: File: /export/home/build/data/continuum/checkouts/282/src/test/repositories/proxied1/org/apache/maven/test/get-present-timestamped-snapshot/1.0-SNAPSHOT/get-present-timestamped-snapshot-1.0-SNAPSHOT.jar.sha1 does not exist
DEBUG|main| 1944|RepositoryProxyConnectors:default - Retrieving org/apache/maven/test/get-present-timestamped-snapshot/1.0-SNAPSHOT/get-present-timestamped-snapshot-1.0-SNAPSHOT.jar.md5 from Proxied Repository 1 if updated
 WARN|main| 1945|RepositoryProxyConnectors:default - Resource does not exist: File: /export/home/build/data/continuum/checkouts/282/src/test/repositories/proxied1/org/apache/maven/test/get-present-timestamped-snapshot/1.0-SNAPSHOT/get-present-timestamped-snapshot-1.0-SNAPSHOT.jar.md5 does not exist
DEBUG|main| 1945|RepositoryProxyConnectors:default - Checksum.md5 Not Download: File: /export/home/build/data/continuum/checkouts/282/src/test/repositories/proxied1/org/apache/maven/test/get-present-timestamped-snapshot/1.0-SNAPSHOT/get-present-timestamped-snapshot-1.0-SNAPSHOT.jar.md5 does not exist
DEBUG|main| 1945|RepositoryProxyConnectors:default - Applying [checksum] policy with [ignored]
 INFO|main| 1945|RepositoryProxyConnectors:default - Successfully transfered: /export/home/build/data/continuum/checkouts/282/target/test-repository/managed/org/apache/maven/test/get-present-timestamped-snapshot/1.0-SNAPSHOT/get-present-timestamped-snapshot-1.0-SNAPSHOT.jar
 INFO|main| 1945|Cache:url-failures-cache       - Disposing cache: [  name = cache status = STATUS_ALIVE eternal = false overflowToDisk = false maxElementsInMemory = 1000 maxElementsOnDisk = 0 memoryStoreEvictionPolicy = LRU timeToLiveSeconds = 1800 timeToIdleSeconds = 2700 diskPersistent = true diskExpiryThreadIntervalSeconds = 600 cacheEventListeners:  hitCount = 0 memoryStoreHitCount = 0 diskStoreHitCount = 0 missCountNotFound = 0 missCountExpired = 0 ]
DEBUG|main| 1965|Registry:commons-configuration - Creating a default configuration - no configuration was provided
DEBUG|main| 1996|CacheManager                   - Attempting to create an existing singleton. Existing singleton returned.
DEBUG|main| 1996|MemoryStore                    - Initialized net.sf.ehcache.store.LruMemoryStore for cache
DEBUG|main| 1996|LruMemoryStore                 - cache Cache: Using SpoolingLinkedHashMap implementation
DEBUG|main| 1996|Cache                          - Initialised cache: cache

.\ testOlderTimestampDrivenSnapshotOnFirstRepo() \._________________________________________

DEBUG|main| 2004|RepositoryProxyConnectors:default - Attempting connector: ProxyConnector[
  source:ArchivaRepository[default-managed-repository,file:/export/home/build/data/continuum/checkouts/282/target/test-repository/managed/]
  target:ArchivaRepository[proxied1,file:/export/home/build/data/continuum/checkouts/282/src/test/repositories/proxied1/]
  proxyId:null
  policy[releases]:ignored
  policy[snapshots]:ignored
  policy[cache-failures]:ignored
  policy[checksum]:ignored
]
DEBUG|main| 2004|RepositoryProxyConnectors:default - Using target repository: proxied1 - layout: default - targetPath: org/apache/maven/test/get-present-timestamped-snapshot/1.0-SNAPSHOT/get-present-timestamped-snapshot-1.0-SNAPSHOT.jar
DEBUG|main| 2004|RepositoryProxyConnectors:default - Applying [releases] policy with [ignored]
DEBUG|main| 2004|PreDownloadPolicy:releases     - OK to update, releases policy set to IGNORED.
DEBUG|main| 2005|RepositoryProxyConnectors:default - Applying [snapshots] policy with [ignored]
DEBUG|main| 2006|PreDownloadPolicy:snapshots    - OK to update, snapshots policy set to IGNORED.
DEBUG|main| 2007|RepositoryProxyConnectors:default - Applying [cache-failures] policy with [ignored]
DEBUG|main| 2007|PreDownloadPolicy:cache-failures - OK to fetch, check-failures policy set to IGNORED.
DEBUG|main| 2007|RepositoryProxyConnectors:default - Retrieving org/apache/maven/test/get-present-timestamped-snapshot/1.0-SNAPSHOT/get-present-timestamped-snapshot-1.0-SNAPSHOT.jar from Proxied Repository 1
DEBUG|main| 2009|RepositoryProxyConnectors:default - Downloaded successfully.
DEBUG|main| 2009|RepositoryProxyConnectors:default - Retrieving org/apache/maven/test/get-present-timestamped-snapshot/1.0-SNAPSHOT/get-present-timestamped-snapshot-1.0-SNAPSHOT.jar.sha1 from Proxied Repository 1 if updated
 WARN|main| 2010|RepositoryProxyConnectors:default - Resource does not exist: File: /export/home/build/data/continuum/checkouts/282/src/test/repositories/proxied1/org/apache/maven/test/get-present-timestamped-snapshot/1.0-SNAPSHOT/get-present-timestamped-snapshot-1.0-SNAPSHOT.jar.sha1 does not exist
DEBUG|main| 2011|RepositoryProxyConnectors:default - Checksum.sha1 Not Download: File: /export/home/build/data/continuum/checkouts/282/src/test/repositories/proxied1/org/apache/maven/test/get-present-timestamped-snapshot/1.0-SNAPSHOT/get-present-timestamped-snapshot-1.0-SNAPSHOT.jar.sha1 does not exist
DEBUG|main| 2011|RepositoryProxyConnectors:default - Retrieving org/apache/maven/test/get-present-timestamped-snapshot/1.0-SNAPSHOT/get-present-timestamped-snapshot-1.0-SNAPSHOT.jar.md5 from Proxied Repository 1 if updated
 WARN|main| 2011|RepositoryProxyConnectors:default - Resource does not exist: File: /export/home/build/data/continuum/checkouts/282/src/test/repositories/proxied1/org/apache/maven/test/get-present-timestamped-snapshot/1.0-SNAPSHOT/get-present-timestamped-snapshot-1.0-SNAPSHOT.jar.md5 does not exist
DEBUG|main| 2012|RepositoryProxyConnectors:default - Checksum.md5 Not Download: File: /export/home/build/data/continuum/checkouts/282/src/test/repositories/proxied1/org/apache/maven/test/get-present-timestamped-snapshot/1.0-SNAPSHOT/get-present-timestamped-snapshot-1.0-SNAPSHOT.jar.md5 does not exist
DEBUG|main| 2012|RepositoryProxyConnectors:default - Applying [checksum] policy with [ignored]
 INFO|main| 2012|RepositoryProxyConnectors:default - Successfully transfered: /export/home/build/data/continuum/checkouts/282/target/test-repository/managed/org/apache/maven/test/get-present-timestamped-snapshot/1.0-SNAPSHOT/get-present-timestamped-snapshot-1.0-SNAPSHOT.jar
 INFO|main| 2014|Cache:url-failures-cache       - Disposing cache: [  name = cache status = STATUS_ALIVE eternal = false overflowToDisk = false maxElementsInMemory = 1000 maxElementsOnDisk = 0 memoryStoreEvictionPolicy = LRU timeToLiveSeconds = 1800 timeToIdleSeconds = 2700 diskPersistent = true diskExpiryThreadIntervalSeconds = 600 cacheEventListeners:  hitCount = 0 memoryStoreHitCount = 0 diskStoreHitCount = 0 missCountNotFound = 0 missCountExpired = 0 ]
DEBUG|main| 2040|Registry:commons-configuration - Creating a default configuration - no configuration was provided
DEBUG|main| 2076|CacheManager                   - Attempting to create an existing singleton. Existing singleton returned.
DEBUG|main| 2076|MemoryStore                    - Initialized net.sf.ehcache.store.LruMemoryStore for cache
DEBUG|main| 2077|LruMemoryStore                 - cache Cache: Using SpoolingLinkedHashMap implementation
DEBUG|main| 2077|Cache                          - Initialised cache: cache

.\ testTimestampDrivenSnapshotNotExpired() \._________________________________________

DEBUG|main| 2080|RepositoryProxyConnectors:default - Attempting connector: ProxyConnector[
  source:ArchivaRepository[default-managed-repository,file:/export/home/build/data/continuum/checkouts/282/target/test-repository/managed/]
  target:ArchivaRepository[proxied1,file:/export/home/build/data/continuum/checkouts/282/src/test/repositories/proxied1/]
  proxyId:null
  policy[releases]:ignored
  policy[snapshots]:ignored
  policy[cache-failures]:ignored
  policy[checksum]:ignored
]
DEBUG|main| 2080|RepositoryProxyConnectors:default - Using target repository: proxied1 - layout: default - targetPath: org/apache/maven/test/get-present-timestamped-snapshot/1.0-SNAPSHOT/get-present-timestamped-snapshot-1.0-SNAPSHOT.jar
DEBUG|main| 2080|RepositoryProxyConnectors:default - Applying [releases] policy with [ignored]
DEBUG|main| 2080|PreDownloadPolicy:releases     - OK to update, releases policy set to IGNORED.
DEBUG|main| 2080|RepositoryProxyConnectors:default - Applying [snapshots] policy with [ignored]
DEBUG|main| 2080|PreDownloadPolicy:snapshots    - OK to update, snapshots policy set to IGNORED.
DEBUG|main| 2080|RepositoryProxyConnectors:default - Applying [cache-failures] policy with [ignored]
DEBUG|main| 2080|PreDownloadPolicy:cache-failures - OK to fetch, check-failures policy set to IGNORED.
DEBUG|main| 2081|RepositoryProxyConnectors:default - Retrieving org/apache/maven/test/get-present-timestamped-snapshot/1.0-SNAPSHOT/get-present-timestamped-snapshot-1.0-SNAPSHOT.jar from Proxied Repository 1
DEBUG|main| 2081|RepositoryProxyConnectors:default - Downloaded successfully.
DEBUG|main| 2082|RepositoryProxyConnectors:default - Retrieving org/apache/maven/test/get-present-timestamped-snapshot/1.0-SNAPSHOT/get-present-timestamped-snapshot-1.0-SNAPSHOT.jar.sha1 from Proxied Repository 1 if updated
 WARN|main| 2082|RepositoryProxyConnectors:default - Resource does not exist: File: /export/home/build/data/continuum/checkouts/282/src/test/repositories/proxied1/org/apache/maven/test/get-present-timestamped-snapshot/1.0-SNAPSHOT/get-present-timestamped-snapshot-1.0-SNAPSHOT.jar.sha1 does not exist
DEBUG|main| 2082|RepositoryProxyConnectors:default - Checksum.sha1 Not Download: File: /export/home/build/data/continuum/checkouts/282/src/test/repositories/proxied1/org/apache/maven/test/get-present-timestamped-snapshot/1.0-SNAPSHOT/get-present-timestamped-snapshot-1.0-SNAPSHOT.jar.sha1 does not exist
DEBUG|main| 2082|RepositoryProxyConnectors:default - Retrieving org/apache/maven/test/get-present-timestamped-snapshot/1.0-SNAPSHOT/get-present-timestamped-snapshot-1.0-SNAPSHOT.jar.md5 from Proxied Repository 1 if updated
 WARN|main| 2082|RepositoryProxyConnectors:default - Resource does not exist: File: /export/home/build/data/continuum/checkouts/282/src/test/repositories/proxied1/org/apache/maven/test/get-present-timestamped-snapshot/1.0-SNAPSHOT/get-present-timestamped-snapshot-1.0-SNAPSHOT.jar.md5 does not exist
DEBUG|main| 2082|RepositoryProxyConnectors:default - Checksum.md5 Not Download: File: /export/home/build/data/continuum/checkouts/282/src/test/repositories/proxied1/org/apache/maven/test/get-present-timestamped-snapshot/1.0-SNAPSHOT/get-present-timestamped-snapshot-1.0-SNAPSHOT.jar.md5 does not exist
DEBUG|main| 2082|RepositoryProxyConnectors:default - Applying [checksum] policy with [ignored]
 INFO|main| 2082|RepositoryProxyConnectors:default - Successfully transfered: /export/home/build/data/continuum/checkouts/282/target/test-repository/managed/org/apache/maven/test/get-present-timestamped-snapshot/1.0-SNAPSHOT/get-present-timestamped-snapshot-1.0-SNAPSHOT.jar
 INFO|main| 2084|Cache:url-failures-cache       - Disposing cache: [  name = cache status = STATUS_ALIVE eternal = false overflowToDisk = false maxElementsInMemory = 1000 maxElementsOnDisk = 0 memoryStoreEvictionPolicy = LRU timeToLiveSeconds = 1800 timeToIdleSeconds = 2700 diskPersistent = true diskExpiryThreadIntervalSeconds = 600 cacheEventListeners:  hitCount = 0 memoryStoreHitCount = 0 diskStoreHitCount = 0 missCountNotFound = 0 missCountExpired = 0 ]
DEBUG|main| 2113|Registry:commons-configuration - Creating a default configuration - no configuration was provided
DEBUG|main| 2153|CacheManager                   - Attempting to create an existing singleton. Existing singleton returned.
DEBUG|main| 2153|MemoryStore                    - Initialized net.sf.ehcache.store.LruMemoryStore for cache
DEBUG|main| 2153|LruMemoryStore                 - cache Cache: Using SpoolingLinkedHashMap implementation
DEBUG|main| 2153|Cache                          - Initialised cache: cache

.\ testTimestampDrivenSnapshotNotUpdated() \._________________________________________

DEBUG|main| 2156|RepositoryProxyConnectors:default - Attempting connector: ProxyConnector[
  source:ArchivaRepository[default-managed-repository,file:/export/home/build/data/continuum/checkouts/282/target/test-repository/managed/]
  target:ArchivaRepository[proxied1,file:/export/home/build/data/continuum/checkouts/282/src/test/repositories/proxied1/]
  proxyId:null
  policy[releases]:ignored
  policy[snapshots]:ignored
  policy[cache-failures]:ignored
  policy[checksum]:ignored
]
DEBUG|main| 2156|RepositoryProxyConnectors:default - Using target repository: proxied1 - layout: default - targetPath: org/apache/maven/test/get-present-timestamped-snapshot/1.0-SNAPSHOT/get-present-timestamped-snapshot-1.0-SNAPSHOT.jar
DEBUG|main| 2156|RepositoryProxyConnectors:default - Applying [releases] policy with [ignored]
DEBUG|main| 2156|PreDownloadPolicy:releases     - OK to update, releases policy set to IGNORED.
DEBUG|main| 2156|RepositoryProxyConnectors:default - Applying [snapshots] policy with [ignored]
DEBUG|main| 2156|PreDownloadPolicy:snapshots    - OK to update, snapshots policy set to IGNORED.
DEBUG|main| 2156|RepositoryProxyConnectors:default - Applying [cache-failures] policy with [ignored]
DEBUG|main| 2156|PreDownloadPolicy:cache-failures - OK to fetch, check-failures policy set to IGNORED.
DEBUG|main| 2156|RepositoryProxyConnectors:default - Retrieving org/apache/maven/test/get-present-timestamped-snapshot/1.0-SNAPSHOT/get-present-timestamped-snapshot-1.0-SNAPSHOT.jar from Proxied Repository 1
DEBUG|main| 2158|RepositoryProxyConnectors:default - Downloaded successfully.
DEBUG|main| 2159|RepositoryProxyConnectors:default - Retrieving org/apache/maven/test/get-present-timestamped-snapshot/1.0-SNAPSHOT/get-present-timestamped-snapshot-1.0-SNAPSHOT.jar.sha1 from Proxied Repository 1 if updated
 WARN|main| 2159|RepositoryProxyConnectors:default - Resource does not exist: File: /export/home/build/data/continuum/checkouts/282/src/test/repositories/proxied1/org/apache/maven/test/get-present-timestamped-snapshot/1.0-SNAPSHOT/get-present-timestamped-snapshot-1.0-SNAPSHOT.jar.sha1 does not exist
DEBUG|main| 2159|RepositoryProxyConnectors:default - Checksum.sha1 Not Download: File: /export/home/build/data/continuum/checkouts/282/src/test/repositories/proxied1/org/apache/maven/test/get-present-timestamped-snapshot/1.0-SNAPSHOT/get-present-timestamped-snapshot-1.0-SNAPSHOT.jar.sha1 does not exist
DEBUG|main| 2159|RepositoryProxyConnectors:default - Retrieving org/apache/maven/test/get-present-timestamped-snapshot/1.0-SNAPSHOT/get-present-timestamped-snapshot-1.0-SNAPSHOT.jar.md5 from Proxied Repository 1 if updated
 WARN|main| 2159|RepositoryProxyConnectors:default - Resource does not exist: File: /export/home/build/data/continuum/checkouts/282/src/test/repositories/proxied1/org/apache/maven/test/get-present-timestamped-snapshot/1.0-SNAPSHOT/get-present-timestamped-snapshot-1.0-SNAPSHOT.jar.md5 does not exist
DEBUG|main| 2159|RepositoryProxyConnectors:default - Checksum.md5 Not Download: File: /export/home/build/data/continuum/checkouts/282/src/test/repositories/proxied1/org/apache/maven/test/get-present-timestamped-snapshot/1.0-SNAPSHOT/get-present-timestamped-snapshot-1.0-SNAPSHOT.jar.md5 does not exist
DEBUG|main| 2159|RepositoryProxyConnectors:default - Applying [checksum] policy with [ignored]
 INFO|main| 2159|RepositoryProxyConnectors:default - Successfully transfered: /export/home/build/data/continuum/checkouts/282/target/test-repository/managed/org/apache/maven/test/get-present-timestamped-snapshot/1.0-SNAPSHOT/get-present-timestamped-snapshot-1.0-SNAPSHOT.jar
 INFO|main| 2160|Cache:url-failures-cache       - Disposing cache: [  name = cache status = STATUS_ALIVE eternal = false overflowToDisk = false maxElementsInMemory = 1000 maxElementsOnDisk = 0 memoryStoreEvictionPolicy = LRU timeToLiveSeconds = 1800 timeToIdleSeconds = 2700 diskPersistent = true diskExpiryThreadIntervalSeconds = 600 cacheEventListeners:  hitCount = 0 memoryStoreHitCount = 0 diskStoreHitCount = 0 missCountNotFound = 0 missCountExpired = 0 ]
DEBUG|main| 2188|Registry:commons-configuration - Creating a default configuration - no configuration was provided
DEBUG|main| 2224|CacheManager                   - Attempting to create an existing singleton. Existing singleton returned.
DEBUG|main| 2224|MemoryStore                    - Initialized net.sf.ehcache.store.LruMemoryStore for cache
DEBUG|main| 2224|LruMemoryStore                 - cache Cache: Using SpoolingLinkedHashMap implementation
DEBUG|main| 2224|Cache                          - Initialised cache: cache

.\ testTimestampDrivenSnapshotNotPresentAlreadyExpiredCacheFailure() \._________________________________________

DEBUG|main| 2228|RepositoryProxyConnectors:default - Attempting connector: ProxyConnector[
  source:ArchivaRepository[default-managed-repository,file:/export/home/build/data/continuum/checkouts/282/target/test-repository/managed/]
  target:ArchivaRepository[proxied1,file:/export/home/build/data/continuum/checkouts/282/src/test/repositories/proxied1/]
  proxyId:null
  policy[releases]:ignored
  policy[snapshots]:ignored
  policy[cache-failures]:cached
  policy[checksum]:ignored
]
DEBUG|main| 2229|RepositoryProxyConnectors:default - Using target repository: proxied1 - layout: default - targetPath: org/apache/maven/test/get-timestamped-snapshot/1.0-SNAPSHOT/get-timestamped-snapshot-1.0-SNAPSHOT.jar
DEBUG|main| 2229|RepositoryProxyConnectors:default - Applying [releases] policy with [ignored]
DEBUG|main| 2229|PreDownloadPolicy:releases     - OK to update, releases policy set to IGNORED.
DEBUG|main| 2229|RepositoryProxyConnectors:default - Applying [snapshots] policy with [ignored]
DEBUG|main| 2229|PreDownloadPolicy:snapshots    - OK to update, snapshots policy set to IGNORED.
DEBUG|main| 2229|RepositoryProxyConnectors:default - Applying [cache-failures] policy with [cached]
DEBUG|main| 2229|PreDownloadPolicy:cache-failures - OK to fetch, check-failures detected no issues.
DEBUG|main| 2230|RepositoryProxyConnectors:default - Retrieving org/apache/maven/test/get-timestamped-snapshot/1.0-SNAPSHOT/get-timestamped-snapshot-1.0-SNAPSHOT.jar from Proxied Repository 1 if updated
DEBUG|main| 2230|RepositoryProxyConnectors:default - Downloaded successfully.
DEBUG|main| 2231|RepositoryProxyConnectors:default - Retrieving org/apache/maven/test/get-timestamped-snapshot/1.0-SNAPSHOT/get-timestamped-snapshot-1.0-SNAPSHOT.jar.sha1 from Proxied Repository 1 if updated
 WARN|main| 2231|RepositoryProxyConnectors:default - Resource does not exist: File: /export/home/build/data/continuum/checkouts/282/src/test/repositories/proxied1/org/apache/maven/test/get-timestamped-snapshot/1.0-SNAPSHOT/get-timestamped-snapshot-1.0-SNAPSHOT.jar.sha1 does not exist
DEBUG|main| 2231|RepositoryProxyConnectors:default - Checksum.sha1 Not Download: File: /export/home/build/data/continuum/checkouts/282/src/test/repositories/proxied1/org/apache/maven/test/get-timestamped-snapshot/1.0-SNAPSHOT/get-timestamped-snapshot-1.0-SNAPSHOT.jar.sha1 does not exist
DEBUG|main| 2231|RepositoryProxyConnectors:default - Retrieving org/apache/maven/test/get-timestamped-snapshot/1.0-SNAPSHOT/get-timestamped-snapshot-1.0-SNAPSHOT.jar.md5 from Proxied Repository 1 if updated
 WARN|main| 2231|RepositoryProxyConnectors:default - Resource does not exist: File: /export/home/build/data/continuum/checkouts/282/src/test/repositories/proxied1/org/apache/maven/test/get-timestamped-snapshot/1.0-SNAPSHOT/get-timestamped-snapshot-1.0-SNAPSHOT.jar.md5 does not exist
DEBUG|main| 2231|RepositoryProxyConnectors:default - Checksum.md5 Not Download: File: /export/home/build/data/continuum/checkouts/282/src/test/repositories/proxied1/org/apache/maven/test/get-timestamped-snapshot/1.0-SNAPSHOT/get-timestamped-snapshot-1.0-SNAPSHOT.jar.md5 does not exist
DEBUG|main| 2231|RepositoryProxyConnectors:default - Applying [checksum] policy with [ignored]
 INFO|main| 2231|RepositoryProxyConnectors:default - Successfully transfered: /export/home/build/data/continuum/checkouts/282/target/test-repository/managed/org/apache/maven/test/get-timestamped-snapshot/1.0-SNAPSHOT/get-timestamped-snapshot-1.0-SNAPSHOT.jar
 INFO|main| 2232|Cache:url-failures-cache       - Disposing cache: [  name = cache status = STATUS_ALIVE eternal = false overflowToDisk = false maxElementsInMemory = 1000 maxElementsOnDisk = 0 memoryStoreEvictionPolicy = LRU timeToLiveSeconds = 1800 timeToIdleSeconds = 2700 diskPersistent = true diskExpiryThreadIntervalSeconds = 600 cacheEventListeners:  hitCount = 0 memoryStoreHitCount = 0 diskStoreHitCount = 0 missCountNotFound = 0 missCountExpired = 0 ]
DEBUG|main| 2285|Registry:commons-configuration - Creating a default configuration - no configuration was provided
DEBUG|main| 2334|CacheManager                   - Attempting to create an existing singleton. Existing singleton returned.
DEBUG|main| 2334|MemoryStore                    - Initialized net.sf.ehcache.store.LruMemoryStore for cache
DEBUG|main| 2334|LruMemoryStore                 - cache Cache: Using SpoolingLinkedHashMap implementation
DEBUG|main| 2334|Cache                          - Initialised cache: cache

.\ testMetadataDrivenSnapshotNotPresentAlready() \._________________________________________

DEBUG|main| 2341|RepositoryProxyConnectors:default - Attempting connector: ProxyConnector[
  source:ArchivaRepository[default-managed-repository,file:/export/home/build/data/continuum/checkouts/282/target/test-repository/managed/]
  target:ArchivaRepository[proxied1,file:/export/home/build/data/continuum/checkouts/282/src/test/repositories/proxied1/]
  proxyId:null
  policy[releases]:ignored
  policy[snapshots]:ignored
  policy[cache-failures]:ignored
  policy[checksum]:ignored
]
DEBUG|main| 2341|RepositoryProxyConnectors:default - Using target repository: proxied1 - layout: default - targetPath: org/apache/maven/test/get-metadata-snapshot/1.0-SNAPSHOT/get-metadata-snapshot-1.0-20050831.101112-1.jar
DEBUG|main| 2341|RepositoryProxyConnectors:default - Applying [releases] policy with [ignored]
DEBUG|main| 2341|PreDownloadPolicy:releases     - OK to update, releases policy set to IGNORED.
DEBUG|main| 2341|RepositoryProxyConnectors:default - Applying [snapshots] policy with [ignored]
DEBUG|main| 2342|PreDownloadPolicy:snapshots    - OK to update, snapshots policy set to IGNORED.
DEBUG|main| 2342|RepositoryProxyConnectors:default - Applying [cache-failures] policy with [ignored]
DEBUG|main| 2342|PreDownloadPolicy:cache-failures - OK to fetch, check-failures policy set to IGNORED.
DEBUG|main| 2342|RepositoryProxyConnectors:default - Retrieving org/apache/maven/test/get-metadata-snapshot/1.0-SNAPSHOT/get-metadata-snapshot-1.0-20050831.101112-1.jar from Proxied Repository 1 if updated
DEBUG|main| 2343|RepositoryProxyConnectors:default - Downloaded successfully.
DEBUG|main| 2344|RepositoryProxyConnectors:default - Retrieving org/apache/maven/test/get-metadata-snapshot/1.0-SNAPSHOT/get-metadata-snapshot-1.0-20050831.101112-1.jar.sha1 from Proxied Repository 1 if updated
 WARN|main| 2344|RepositoryProxyConnectors:default - Resource does not exist: File: /export/home/build/data/continuum/checkouts/282/src/test/repositories/proxied1/org/apache/maven/test/get-metadata-snapshot/1.0-SNAPSHOT/get-metadata-snapshot-1.0-20050831.101112-1.jar.sha1 does not exist
DEBUG|main| 2344|RepositoryProxyConnectors:default - Checksum.sha1 Not Download: File: /export/home/build/data/continuum/checkouts/282/src/test/repositories/proxied1/org/apache/maven/test/get-metadata-snapshot/1.0-SNAPSHOT/get-metadata-snapshot-1.0-20050831.101112-1.jar.sha1 does not exist
DEBUG|main| 2344|RepositoryProxyConnectors:default - Retrieving org/apache/maven/test/get-metadata-snapshot/1.0-SNAPSHOT/get-metadata-snapshot-1.0-20050831.101112-1.jar.md5 from Proxied Repository 1 if updated
 WARN|main| 2344|RepositoryProxyConnectors:default - Resource does not exist: File: /export/home/build/data/continuum/checkouts/282/src/test/repositories/proxied1/org/apache/maven/test/get-metadata-snapshot/1.0-SNAPSHOT/get-metadata-snapshot-1.0-20050831.101112-1.jar.md5 does not exist
DEBUG|main| 2344|RepositoryProxyConnectors:default - Checksum.md5 Not Download: File: /export/home/build/data/continuum/checkouts/282/src/test/repositories/proxied1/org/apache/maven/test/get-metadata-snapshot/1.0-SNAPSHOT/get-metadata-snapshot-1.0-20050831.101112-1.jar.md5 does not exist
DEBUG|main| 2344|RepositoryProxyConnectors:default - Applying [checksum] policy with [ignored]
 INFO|main| 2345|RepositoryProxyConnectors:default - Successfully transfered: /export/home/build/data/continuum/checkouts/282/target/test-repository/managed/org/apache/maven/test/get-metadata-snapshot/1.0-SNAPSHOT/get-metadata-snapshot-1.0-20050831.101112-1.jar
 INFO|main| 2345|Cache:url-failures-cache       - Disposing cache: [  name = cache status = STATUS_ALIVE eternal = false overflowToDisk = false maxElementsInMemory = 1000 maxElementsOnDisk = 0 memoryStoreEvictionPolicy = LRU timeToLiveSeconds = 1800 timeToIdleSeconds = 2700 diskPersistent = true diskExpiryThreadIntervalSeconds = 600 cacheEventListeners:  hitCount = 0 memoryStoreHitCount = 0 diskStoreHitCount = 0 missCountNotFound = 0 missCountExpired = 0 ]
DEBUG|main| 2370|Registry:commons-configuration - Creating a default configuration - no configuration was provided
DEBUG|main| 2415|CacheManager                   - Attempting to create an existing singleton. Existing singleton returned.
DEBUG|main| 2415|MemoryStore                    - Initialized net.sf.ehcache.store.LruMemoryStore for cache
DEBUG|main| 2415|LruMemoryStore                 - cache Cache: Using SpoolingLinkedHashMap implementation
DEBUG|main| 2415|Cache                          - Initialised cache: cache

.\ testGetMetadataDrivenSnapshotRemoteUpdate() \._________________________________________

DEBUG|main| 2421|RepositoryProxyConnectors:default - Attempting connector: ProxyConnector[
  source:ArchivaRepository[default-managed-repository,file:/export/home/build/data/continuum/checkouts/282/target/test-repository/managed/]
  target:ArchivaRepository[proxied1,file:/export/home/build/data/continuum/checkouts/282/src/test/repositories/proxied1/]
  proxyId:null
  policy[releases]:ignored
  policy[snapshots]:ignored
  policy[cache-failures]:ignored
  policy[checksum]:ignored
]
DEBUG|main| 2421|RepositoryProxyConnectors:default - Using target repository: proxied1 - layout: default - targetPath: org/apache/maven/test/get-present-metadata-snapshot/1.0-SNAPSHOT/get-present-metadata-snapshot-1.0-20050831.101112-1.jar
DEBUG|main| 2422|RepositoryProxyConnectors:default - Applying [releases] policy with [ignored]
DEBUG|main| 2422|PreDownloadPolicy:releases     - OK to update, releases policy set to IGNORED.
DEBUG|main| 2422|RepositoryProxyConnectors:default - Applying [snapshots] policy with [ignored]
DEBUG|main| 2422|PreDownloadPolicy:snapshots    - OK to update, snapshots policy set to IGNORED.
DEBUG|main| 2422|RepositoryProxyConnectors:default - Applying [cache-failures] policy with [ignored]
DEBUG|main| 2422|PreDownloadPolicy:cache-failures - OK to fetch, check-failures policy set to IGNORED.
DEBUG|main| 2422|RepositoryProxyConnectors:default - Retrieving org/apache/maven/test/get-present-metadata-snapshot/1.0-SNAPSHOT/get-present-metadata-snapshot-1.0-20050831.101112-1.jar from Proxied Repository 1
DEBUG|main| 2443|RepositoryProxyConnectors:default - Downloaded successfully.
DEBUG|main| 2444|RepositoryProxyConnectors:default - Retrieving org/apache/maven/test/get-present-metadata-snapshot/1.0-SNAPSHOT/get-present-metadata-snapshot-1.0-20050831.101112-1.jar.sha1 from Proxied Repository 1 if updated
 WARN|main| 2444|RepositoryProxyConnectors:default - Resource does not exist: File: /export/home/build/data/continuum/checkouts/282/src/test/repositories/proxied1/org/apache/maven/test/get-present-metadata-snapshot/1.0-SNAPSHOT/get-present-metadata-snapshot-1.0-20050831.101112-1.jar.sha1 does not exist
DEBUG|main| 2444|RepositoryProxyConnectors:default - Checksum.sha1 Not Download: File: /export/home/build/data/continuum/checkouts/282/src/test/repositories/proxied1/org/apache/maven/test/get-present-metadata-snapshot/1.0-SNAPSHOT/get-present-metadata-snapshot-1.0-20050831.101112-1.jar.sha1 does not exist
DEBUG|main| 2444|RepositoryProxyConnectors:default - Retrieving org/apache/maven/test/get-present-metadata-snapshot/1.0-SNAPSHOT/get-present-metadata-snapshot-1.0-20050831.101112-1.jar.md5 from Proxied Repository 1 if updated
 WARN|main| 2445|RepositoryProxyConnectors:default - Resource does not exist: File: /export/home/build/data/continuum/checkouts/282/src/test/repositories/proxied1/org/apache/maven/test/get-present-metadata-snapshot/1.0-SNAPSHOT/get-present-metadata-snapshot-1.0-20050831.101112-1.jar.md5 does not exist
DEBUG|main| 2445|RepositoryProxyConnectors:default - Checksum.md5 Not Download: File: /export/home/build/data/continuum/checkouts/282/src/test/repositories/proxied1/org/apache/maven/test/get-present-metadata-snapshot/1.0-SNAPSHOT/get-present-metadata-snapshot-1.0-20050831.101112-1.jar.md5 does not exist
DEBUG|main| 2445|RepositoryProxyConnectors:default - Applying [checksum] policy with [ignored]
 INFO|main| 2445|RepositoryProxyConnectors:default - Successfully transfered: /export/home/build/data/continuum/checkouts/282/target/test-repository/managed/org/apache/maven/test/get-present-metadata-snapshot/1.0-SNAPSHOT/get-present-metadata-snapshot-1.0-20050831.101112-1.jar
 INFO|main| 2446|Cache:url-failures-cache       - Disposing cache: [  name = cache status = STATUS_ALIVE eternal = false overflowToDisk = false maxElementsInMemory = 1000 maxElementsOnDisk = 0 memoryStoreEvictionPolicy = LRU timeToLiveSeconds = 1800 timeToIdleSeconds = 2700 diskPersistent = true diskExpiryThreadIntervalSeconds = 600 cacheEventListeners:  hitCount = 0 memoryStoreHitCount = 0 diskStoreHitCount = 0 missCountNotFound = 0 missCountExpired = 0 ]
Tests run: 9, Failures: 0, Errors: 0, Skipped: 0, Time elapsed: 0.736 sec
Running org.apache.maven.archiva.proxy.ChecksumTransferTest
DEBUG|main| 2479|Registry:commons-configuration - Creating a default configuration - no configuration was provided
DEBUG|main| 2519|CacheManager                   - Attempting to create an existing singleton. Existing singleton returned.
DEBUG|main| 2519|MemoryStore                    - Initialized net.sf.ehcache.store.LruMemoryStore for cache
DEBUG|main| 2519|LruMemoryStore                 - cache Cache: Using SpoolingLinkedHashMap implementation
DEBUG|main| 2519|Cache                          - Initialised cache: cache

.\ testGetChecksumBothCorrect() \._________________________________________

DEBUG|main| 2521|RepositoryProxyConnectors:default - Attempting connector: ProxyConnector[
  source:ArchivaRepository[default-managed-repository,file:/export/home/build/data/continuum/checkouts/282/target/test-repository/managed/]
  target:ArchivaRepository[proxied1,file:/export/home/build/data/continuum/checkouts/282/src/test/repositories/proxied1/]
  proxyId:null
  policy[releases]:ignored
  policy[snapshots]:ignored
  policy[cache-failures]:ignored
  policy[checksum]:ignored
]
DEBUG|main| 2522|RepositoryProxyConnectors:default - Using target repository: proxied1 - layout: default - targetPath: org/apache/maven/test/get-checksum-both-right/1.0/get-checksum-both-right-1.0.jar
DEBUG|main| 2522|RepositoryProxyConnectors:default - Applying [releases] policy with [ignored]
DEBUG|main| 2522|PreDownloadPolicy:releases     - OK to update, releases policy set to IGNORED.
DEBUG|main| 2522|RepositoryProxyConnectors:default - Applying [snapshots] policy with [ignored]
DEBUG|main| 2522|PreDownloadPolicy:snapshots    - OK to update, snapshots policy set to IGNORED.
DEBUG|main| 2522|RepositoryProxyConnectors:default - Applying [cache-failures] policy with [ignored]
DEBUG|main| 2522|PreDownloadPolicy:cache-failures - OK to fetch, check-failures policy set to IGNORED.
DEBUG|main| 2522|RepositoryProxyConnectors:default - Retrieving org/apache/maven/test/get-checksum-both-right/1.0/get-checksum-both-right-1.0.jar from Proxied Repository 1 if updated
DEBUG|main| 2541|RepositoryProxyConnectors:default - Downloaded successfully.
DEBUG|main| 2542|RepositoryProxyConnectors:default - Retrieving org/apache/maven/test/get-checksum-both-right/1.0/get-checksum-both-right-1.0.jar.sha1 from Proxied Repository 1 if updated
DEBUG|main| 2543|RepositoryProxyConnectors:default - Downloaded successfully.
DEBUG|main| 2544|RepositoryProxyConnectors:default - Checksum.sha1 Downloaded: /export/home/build/data/continuum/checkouts/282/target/test-repository/managed/org/apache/maven/test/get-checksum-both-right/1.0/get-checksum-both-right-1.0.jar.sha1
DEBUG|main| 2544|RepositoryProxyConnectors:default - Retrieving org/apache/maven/test/get-checksum-both-right/1.0/get-checksum-both-right-1.0.jar.md5 from Proxied Repository 1 if updated
DEBUG|main| 2554|RepositoryProxyConnectors:default - Downloaded successfully.
DEBUG|main| 2555|RepositoryProxyConnectors:default - Checksum.md5 Downloaded: /export/home/build/data/continuum/checkouts/282/target/test-repository/managed/org/apache/maven/test/get-checksum-both-right/1.0/get-checksum-both-right-1.0.jar.md5
DEBUG|main| 2555|RepositoryProxyConnectors:default - Applying [checksum] policy with [ignored]
 INFO|main| 2555|RepositoryProxyConnectors:default - Successfully transfered: /export/home/build/data/continuum/checkouts/282/target/test-repository/managed/org/apache/maven/test/get-checksum-both-right/1.0/get-checksum-both-right-1.0.jar
 INFO|main| 2557|Cache:url-failures-cache       - Disposing cache: [  name = cache status = STATUS_ALIVE eternal = false overflowToDisk = false maxElementsInMemory = 1000 maxElementsOnDisk = 0 memoryStoreEvictionPolicy = LRU timeToLiveSeconds = 1800 timeToIdleSeconds = 2700 diskPersistent = true diskExpiryThreadIntervalSeconds = 600 cacheEventListeners:  hitCount = 0 memoryStoreHitCount = 0 diskStoreHitCount = 0 missCountNotFound = 0 missCountExpired = 0 ]
DEBUG|main| 2580|Registry:commons-configuration - Creating a default configuration - no configuration was provided
DEBUG|main| 2625|CacheManager                   - Attempting to create an existing singleton. Existing singleton returned.
DEBUG|main| 2625|MemoryStore                    - Initialized net.sf.ehcache.store.LruMemoryStore for cache
DEBUG|main| 2625|LruMemoryStore                 - cache Cache: Using SpoolingLinkedHashMap implementation
DEBUG|main| 2625|Cache                          - Initialised cache: cache

.\ testGetChecksumCorrectSha1NoMd5() \._________________________________________

DEBUG|main| 2628|RepositoryProxyConnectors:default - Attempting connector: ProxyConnector[
  source:ArchivaRepository[default-managed-repository,file:/export/home/build/data/continuum/checkouts/282/target/test-repository/managed/]
  target:ArchivaRepository[proxied1,file:/export/home/build/data/continuum/checkouts/282/src/test/repositories/proxied1/]
  proxyId:null
  policy[releases]:ignored
  policy[snapshots]:ignored
  policy[cache-failures]:ignored
  policy[checksum]:ignored
]
DEBUG|main| 2628|RepositoryProxyConnectors:default - Using target repository: proxied1 - layout: default - targetPath: org/apache/maven/test/get-checksum-sha1-only/1.0/get-checksum-sha1-only-1.0.jar
DEBUG|main| 2628|RepositoryProxyConnectors:default - Applying [releases] policy with [ignored]
DEBUG|main| 2628|PreDownloadPolicy:releases     - OK to update, releases policy set to IGNORED.
DEBUG|main| 2628|RepositoryProxyConnectors:default - Applying [snapshots] policy with [ignored]
DEBUG|main| 2628|PreDownloadPolicy:snapshots    - OK to update, snapshots policy set to IGNORED.
DEBUG|main| 2628|RepositoryProxyConnectors:default - Applying [cache-failures] policy with [ignored]
DEBUG|main| 2628|PreDownloadPolicy:cache-failures - OK to fetch, check-failures policy set to IGNORED.
DEBUG|main| 2628|RepositoryProxyConnectors:default - Retrieving org/apache/maven/test/get-checksum-sha1-only/1.0/get-checksum-sha1-only-1.0.jar from Proxied Repository 1 if updated
DEBUG|main| 2629|RepositoryProxyConnectors:default - Downloaded successfully.
DEBUG|main| 2630|RepositoryProxyConnectors:default - Retrieving org/apache/maven/test/get-checksum-sha1-only/1.0/get-checksum-sha1-only-1.0.jar.sha1 from Proxied Repository 1 if updated
DEBUG|main| 2630|RepositoryProxyConnectors:default - Downloaded successfully.
DEBUG|main| 2631|RepositoryProxyConnectors:default - Checksum.sha1 Downloaded: /export/home/build/data/continuum/checkouts/282/target/test-repository/managed/org/apache/maven/test/get-checksum-sha1-only/1.0/get-checksum-sha1-only-1.0.jar.sha1
DEBUG|main| 2631|RepositoryProxyConnectors:default - Retrieving org/apache/maven/test/get-checksum-sha1-only/1.0/get-checksum-sha1-only-1.0.jar.md5 from Proxied Repository 1 if updated
 WARN|main| 2631|RepositoryProxyConnectors:default - Resource does not exist: File: /export/home/build/data/continuum/checkouts/282/src/test/repositories/proxied1/org/apache/maven/test/get-checksum-sha1-only/1.0/get-checksum-sha1-only-1.0.jar.md5 does not exist
DEBUG|main| 2631|RepositoryProxyConnectors:default - Checksum.md5 Not Download: File: /export/home/build/data/continuum/checkouts/282/src/test/repositories/proxied1/org/apache/maven/test/get-checksum-sha1-only/1.0/get-checksum-sha1-only-1.0.jar.md5 does not exist
DEBUG|main| 2631|RepositoryProxyConnectors:default - Applying [checksum] policy with [ignored]
 INFO|main| 2631|RepositoryProxyConnectors:default - Successfully transfered: /export/home/build/data/continuum/checkouts/282/target/test-repository/managed/org/apache/maven/test/get-checksum-sha1-only/1.0/get-checksum-sha1-only-1.0.jar
 INFO|main| 2632|Cache:url-failures-cache       - Disposing cache: [  name = cache status = STATUS_ALIVE eternal = false overflowToDisk = false maxElementsInMemory = 1000 maxElementsOnDisk = 0 memoryStoreEvictionPolicy = LRU timeToLiveSeconds = 1800 timeToIdleSeconds = 2700 diskPersistent = true diskExpiryThreadIntervalSeconds = 600 cacheEventListeners:  hitCount = 0 memoryStoreHitCount = 0 diskStoreHitCount = 0 missCountNotFound = 0 missCountExpired = 0 ]
DEBUG|main| 2653|Registry:commons-configuration - Creating a default configuration - no configuration was provided
DEBUG|main| 2685|CacheManager                   - Attempting to create an existing singleton. Existing singleton returned.
DEBUG|main| 2685|MemoryStore                    - Initialized net.sf.ehcache.store.LruMemoryStore for cache
DEBUG|main| 2685|LruMemoryStore                 - cache Cache: Using SpoolingLinkedHashMap implementation
DEBUG|main| 2686|Cache                          - Initialised cache: cache

.\ testGetChecksumNoSha1CorrectMd5() \._________________________________________

DEBUG|main| 2688|RepositoryProxyConnectors:default - Attempting connector: ProxyConnector[
  source:ArchivaRepository[default-managed-repository,file:/export/home/build/data/continuum/checkouts/282/target/test-repository/managed/]
  target:ArchivaRepository[proxied1,file:/export/home/build/data/continuum/checkouts/282/src/test/repositories/proxied1/]
  proxyId:null
  policy[releases]:ignored
  policy[snapshots]:ignored
  policy[cache-failures]:ignored
  policy[checksum]:ignored
]
DEBUG|main| 2688|RepositoryProxyConnectors:default - Using target repository: proxied1 - layout: default - targetPath: org/apache/maven/test/get-checksum-md5-only/1.0/get-checksum-md5-only-1.0.jar
DEBUG|main| 2688|RepositoryProxyConnectors:default - Applying [releases] policy with [ignored]
DEBUG|main| 2688|PreDownloadPolicy:releases     - OK to update, releases policy set to IGNORED.
DEBUG|main| 2688|RepositoryProxyConnectors:default - Applying [snapshots] policy with [ignored]
DEBUG|main| 2688|PreDownloadPolicy:snapshots    - OK to update, snapshots policy set to IGNORED.
DEBUG|main| 2688|RepositoryProxyConnectors:default - Applying [cache-failures] policy with [ignored]
DEBUG|main| 2688|PreDownloadPolicy:cache-failures - OK to fetch, check-failures policy set to IGNORED.
DEBUG|main| 2689|RepositoryProxyConnectors:default - Retrieving org/apache/maven/test/get-checksum-md5-only/1.0/get-checksum-md5-only-1.0.jar from Proxied Repository 1 if updated
DEBUG|main| 2690|RepositoryProxyConnectors:default - Downloaded successfully.
DEBUG|main| 2691|RepositoryProxyConnectors:default - Retrieving org/apache/maven/test/get-checksum-md5-only/1.0/get-checksum-md5-only-1.0.jar.sha1 from Proxied Repository 1 if updated
 WARN|main| 2691|RepositoryProxyConnectors:default - Resource does not exist: File: /export/home/build/data/continuum/checkouts/282/src/test/repositories/proxied1/org/apache/maven/test/get-checksum-md5-only/1.0/get-checksum-md5-only-1.0.jar.sha1 does not exist
DEBUG|main| 2691|RepositoryProxyConnectors:default - Checksum.sha1 Not Download: File: /export/home/build/data/continuum/checkouts/282/src/test/repositories/proxied1/org/apache/maven/test/get-checksum-md5-only/1.0/get-checksum-md5-only-1.0.jar.sha1 does not exist
DEBUG|main| 2691|RepositoryProxyConnectors:default - Retrieving org/apache/maven/test/get-checksum-md5-only/1.0/get-checksum-md5-only-1.0.jar.md5 from Proxied Repository 1 if updated
DEBUG|main| 2692|RepositoryProxyConnectors:default - Downloaded successfully.
DEBUG|main| 2692|RepositoryProxyConnectors:default - Checksum.md5 Downloaded: /export/home/build/data/continuum/checkouts/282/target/test-repository/managed/org/apache/maven/test/get-checksum-md5-only/1.0/get-checksum-md5-only-1.0.jar.md5
DEBUG|main| 2692|RepositoryProxyConnectors:default - Applying [checksum] policy with [ignored]
 INFO|main| 2692|RepositoryProxyConnectors:default - Successfully transfered: /export/home/build/data/continuum/checkouts/282/target/test-repository/managed/org/apache/maven/test/get-checksum-md5-only/1.0/get-checksum-md5-only-1.0.jar
 INFO|main| 2693|Cache:url-failures-cache       - Disposing cache: [  name = cache status = STATUS_ALIVE eternal = false overflowToDisk = false maxElementsInMemory = 1000 maxElementsOnDisk = 0 memoryStoreEvictionPolicy = LRU timeToLiveSeconds = 1800 timeToIdleSeconds = 2700 diskPersistent = true diskExpiryThreadIntervalSeconds = 600 cacheEventListeners:  hitCount = 0 memoryStoreHitCount = 0 diskStoreHitCount = 0 missCountNotFound = 0 missCountExpired = 0 ]
DEBUG|main| 2725|Registry:commons-configuration - Creating a default configuration - no configuration was provided
DEBUG|main| 2762|CacheManager                   - Attempting to create an existing singleton. Existing singleton returned.
DEBUG|main| 2762|MemoryStore                    - Initialized net.sf.ehcache.store.LruMemoryStore for cache
DEBUG|main| 2762|LruMemoryStore                 - cache Cache: Using SpoolingLinkedHashMap implementation
DEBUG|main| 2762|Cache                          - Initialised cache: cache

.\ testGetWithNoChecksumsUsingIgnoredSetting() \._________________________________________

DEBUG|main| 2765|RepositoryProxyConnectors:default - Attempting connector: ProxyConnector[
  source:ArchivaRepository[default-managed-repository,file:/export/home/build/data/continuum/checkouts/282/target/test-repository/managed/]
  target:ArchivaRepository[proxied1,file:/export/home/build/data/continuum/checkouts/282/src/test/repositories/proxied1/]
  proxyId:null
  policy[releases]:ignored
  policy[snapshots]:ignored
  policy[cache-failures]:ignored
  policy[checksum]:ignored
]
DEBUG|main| 2765|RepositoryProxyConnectors:default - Using target repository: proxied1 - layout: default - targetPath: org/apache/maven/test/get-default-layout/1.0/get-default-layout-1.0.jar
DEBUG|main| 2765|RepositoryProxyConnectors:default - Applying [releases] policy with [ignored]
DEBUG|main| 2765|PreDownloadPolicy:releases     - OK to update, releases policy set to IGNORED.
DEBUG|main| 2765|RepositoryProxyConnectors:default - Applying [snapshots] policy with [ignored]
DEBUG|main| 2765|PreDownloadPolicy:snapshots    - OK to update, snapshots policy set to IGNORED.
DEBUG|main| 2765|RepositoryProxyConnectors:default - Applying [cache-failures] policy with [ignored]
DEBUG|main| 2766|PreDownloadPolicy:cache-failures - OK to fetch, check-failures policy set to IGNORED.
DEBUG|main| 2766|RepositoryProxyConnectors:default - Retrieving org/apache/maven/test/get-default-layout/1.0/get-default-layout-1.0.jar from Proxied Repository 1 if updated
DEBUG|main| 2767|RepositoryProxyConnectors:default - Downloaded successfully.
DEBUG|main| 2767|RepositoryProxyConnectors:default - Retrieving org/apache/maven/test/get-default-layout/1.0/get-default-layout-1.0.jar.sha1 from Proxied Repository 1 if updated
 WARN|main| 2768|RepositoryProxyConnectors:default - Resource does not exist: File: /export/home/build/data/continuum/checkouts/282/src/test/repositories/proxied1/org/apache/maven/test/get-default-layout/1.0/get-default-layout-1.0.jar.sha1 does not exist
DEBUG|main| 2768|RepositoryProxyConnectors:default - Checksum.sha1 Not Download: File: /export/home/build/data/continuum/checkouts/282/src/test/repositories/proxied1/org/apache/maven/test/get-default-layout/1.0/get-default-layout-1.0.jar.sha1 does not exist
DEBUG|main| 2768|RepositoryProxyConnectors:default - Retrieving org/apache/maven/test/get-default-layout/1.0/get-default-layout-1.0.jar.md5 from Proxied Repository 1 if updated
 WARN|main| 2768|RepositoryProxyConnectors:default - Resource does not exist: File: /export/home/build/data/continuum/checkouts/282/src/test/repositories/proxied1/org/apache/maven/test/get-default-layout/1.0/get-default-layout-1.0.jar.md5 does not exist
DEBUG|main| 2768|RepositoryProxyConnectors:default - Checksum.md5 Not Download: File: /export/home/build/data/continuum/checkouts/282/src/test/repositories/proxied1/org/apache/maven/test/get-default-layout/1.0/get-default-layout-1.0.jar.md5 does not exist
DEBUG|main| 2768|RepositoryProxyConnectors:default - Applying [checksum] policy with [ignored]
 INFO|main| 2768|RepositoryProxyConnectors:default - Successfully transfered: /export/home/build/data/continuum/checkouts/282/target/test-repository/managed/org/apache/maven/test/get-default-layout/1.0/get-default-layout-1.0.jar
 INFO|main| 2769|Cache:url-failures-cache       - Disposing cache: [  name = cache status = STATUS_ALIVE eternal = false overflowToDisk = false maxElementsInMemory = 1000 maxElementsOnDisk = 0 memoryStoreEvictionPolicy = LRU timeToLiveSeconds = 1800 timeToIdleSeconds = 2700 diskPersistent = true diskExpiryThreadIntervalSeconds = 600 cacheEventListeners:  hitCount = 0 memoryStoreHitCount = 0 diskStoreHitCount = 0 missCountNotFound = 0 missCountExpired = 0 ]
DEBUG|main| 2790|Registry:commons-configuration - Creating a default configuration - no configuration was provided
DEBUG|main| 2830|CacheManager                   - Attempting to create an existing singleton. Existing singleton returned.
DEBUG|main| 2830|MemoryStore                    - Initialized net.sf.ehcache.store.LruMemoryStore for cache
DEBUG|main| 2830|LruMemoryStore                 - cache Cache: Using SpoolingLinkedHashMap implementation
DEBUG|main| 2830|Cache                          - Initialised cache: cache

.\ testGetChecksumBadSha1BadMd5IgnoredSetting() \._________________________________________

DEBUG|main| 2832|RepositoryProxyConnectors:default - Attempting connector: ProxyConnector[
  source:ArchivaRepository[default-managed-repository,file:/export/home/build/data/continuum/checkouts/282/target/test-repository/managed/]
  target:ArchivaRepository[proxied1,file:/export/home/build/data/continuum/checkouts/282/src/test/repositories/proxied1/]
  proxyId:null
  policy[releases]:ignored
  policy[snapshots]:ignored
  policy[cache-failures]:ignored
  policy[checksum]:ignored
]
DEBUG|main| 2832|RepositoryProxyConnectors:default - Using target repository: proxied1 - layout: default - targetPath: org/apache/maven/test/get-checksum-both-bad/1.0/get-checksum-both-bad-1.0.jar
DEBUG|main| 2832|RepositoryProxyConnectors:default - Applying [releases] policy with [ignored]
DEBUG|main| 2832|PreDownloadPolicy:releases     - OK to update, releases policy set to IGNORED.
DEBUG|main| 2832|RepositoryProxyConnectors:default - Applying [snapshots] policy with [ignored]
DEBUG|main| 2832|PreDownloadPolicy:snapshots    - OK to update, snapshots policy set to IGNORED.
DEBUG|main| 2832|RepositoryProxyConnectors:default - Applying [cache-failures] policy with [ignored]
DEBUG|main| 2832|PreDownloadPolicy:cache-failures - OK to fetch, check-failures policy set to IGNORED.
DEBUG|main| 2832|RepositoryProxyConnectors:default - Retrieving org/apache/maven/test/get-checksum-both-bad/1.0/get-checksum-both-bad-1.0.jar from Proxied Repository 1 if updated
DEBUG|main| 2834|RepositoryProxyConnectors:default - Downloaded successfully.
DEBUG|main| 2834|RepositoryProxyConnectors:default - Retrieving org/apache/maven/test/get-checksum-both-bad/1.0/get-checksum-both-bad-1.0.jar.sha1 from Proxied Repository 1 if updated
DEBUG|main| 2835|RepositoryProxyConnectors:default - Downloaded successfully.
DEBUG|main| 2835|RepositoryProxyConnectors:default - Checksum.sha1 Downloaded: /export/home/build/data/continuum/checkouts/282/target/test-repository/managed/org/apache/maven/test/get-checksum-both-bad/1.0/get-checksum-both-bad-1.0.jar.sha1
DEBUG|main| 2835|RepositoryProxyConnectors:default - Retrieving org/apache/maven/test/get-checksum-both-bad/1.0/get-checksum-both-bad-1.0.jar.md5 from Proxied Repository 1 if updated
DEBUG|main| 2836|RepositoryProxyConnectors:default - Downloaded successfully.
DEBUG|main| 2836|RepositoryProxyConnectors:default - Checksum.md5 Downloaded: /export/home/build/data/continuum/checkouts/282/target/test-repository/managed/org/apache/maven/test/get-checksum-both-bad/1.0/get-checksum-both-bad-1.0.jar.md5
DEBUG|main| 2836|RepositoryProxyConnectors:default - Applying [checksum] policy with [ignored]
 INFO|main| 2836|RepositoryProxyConnectors:default - Successfully transfered: /export/home/build/data/continuum/checkouts/282/target/test-repository/managed/org/apache/maven/test/get-checksum-both-bad/1.0/get-checksum-both-bad-1.0.jar
 INFO|main| 2837|Cache:url-failures-cache       - Disposing cache: [  name = cache status = STATUS_ALIVE eternal = false overflowToDisk = false maxElementsInMemory = 1000 maxElementsOnDisk = 0 memoryStoreEvictionPolicy = LRU timeToLiveSeconds = 1800 timeToIdleSeconds = 2700 diskPersistent = true diskExpiryThreadIntervalSeconds = 600 cacheEventListeners:  hitCount = 0 memoryStoreHitCount = 0 diskStoreHitCount = 0 missCountNotFound = 0 missCountExpired = 0 ]
DEBUG|main| 2863|Registry:commons-configuration - Creating a default configuration - no configuration was provided
DEBUG|main| 2895|CacheManager                   - Attempting to create an existing singleton. Existing singleton returned.
DEBUG|main| 2896|MemoryStore                    - Initialized net.sf.ehcache.store.LruMemoryStore for cache
DEBUG|main| 2896|LruMemoryStore                 - cache Cache: Using SpoolingLinkedHashMap implementation
DEBUG|main| 2896|Cache                          - Initialised cache: cache

.\ testGetChecksumBadSha1BadMd5FailSetting() \._________________________________________

DEBUG|main| 2898|RepositoryProxyConnectors:default - Attempting connector: ProxyConnector[
  source:ArchivaRepository[default-managed-repository,file:/export/home/build/data/continuum/checkouts/282/target/test-repository/managed/]
  target:ArchivaRepository[proxied1,file:/export/home/build/data/continuum/checkouts/282/src/test/repositories/proxied1/]
  proxyId:null
  policy[releases]:ignored
  policy[snapshots]:ignored
  policy[cache-failures]:ignored
  policy[checksum]:fail
]
DEBUG|main| 2899|RepositoryProxyConnectors:default - Using target repository: proxied1 - layout: default - targetPath: org/apache/maven/test/get-checksum-both-bad/1.0/get-checksum-both-bad-1.0.jar
DEBUG|main| 2899|RepositoryProxyConnectors:default - Applying [releases] policy with [ignored]
DEBUG|main| 2899|PreDownloadPolicy:releases     - OK to update, releases policy set to IGNORED.
DEBUG|main| 2899|RepositoryProxyConnectors:default - Applying [snapshots] policy with [ignored]
DEBUG|main| 2899|PreDownloadPolicy:snapshots    - OK to update, snapshots policy set to IGNORED.
DEBUG|main| 2899|RepositoryProxyConnectors:default - Applying [cache-failures] policy with [ignored]
DEBUG|main| 2899|PreDownloadPolicy:cache-failures - OK to fetch, check-failures policy set to IGNORED.
DEBUG|main| 2899|RepositoryProxyConnectors:default - Retrieving org/apache/maven/test/get-checksum-both-bad/1.0/get-checksum-both-bad-1.0.jar from Proxied Repository 1 if updated
DEBUG|main| 2900|RepositoryProxyConnectors:default - Downloaded successfully.
DEBUG|main| 2900|RepositoryProxyConnectors:default - Retrieving org/apache/maven/test/get-checksum-both-bad/1.0/get-checksum-both-bad-1.0.jar.sha1 from Proxied Repository 1 if updated
DEBUG|main| 2901|RepositoryProxyConnectors:default - Downloaded successfully.
DEBUG|main| 2901|RepositoryProxyConnectors:default - Checksum.sha1 Downloaded: /export/home/build/data/continuum/checkouts/282/target/test-repository/managed/org/apache/maven/test/get-checksum-both-bad/1.0/get-checksum-both-bad-1.0.jar.sha1
DEBUG|main| 2901|RepositoryProxyConnectors:default - Retrieving org/apache/maven/test/get-checksum-both-bad/1.0/get-checksum-both-bad-1.0.jar.md5 from Proxied Repository 1 if updated
DEBUG|main| 2901|RepositoryProxyConnectors:default - Downloaded successfully.
DEBUG|main| 2902|RepositoryProxyConnectors:default - Checksum.md5 Downloaded: /export/home/build/data/continuum/checkouts/282/target/test-repository/managed/org/apache/maven/test/get-checksum-both-bad/1.0/get-checksum-both-bad-1.0.jar.md5
DEBUG|main| 2902|RepositoryProxyConnectors:default - Applying [checksum] policy with [fail]
DEBUG|main| 2904|PostDownloadPolicy:checksum    - Not valid checksum: /export/home/build/data/continuum/checkouts/282/target/test-repository/managed/org/apache/maven/test/get-checksum-both-bad/1.0/get-checksum-both-bad-1.0.jar.sha1
 WARN|main| 2904|PostDownloadPolicy:checksum    - SHA1 is incorrect for /export/home/build/data/continuum/checkouts/282/target/test-repository/managed/org/apache/maven/test/get-checksum-both-bad/1.0/get-checksum-both-bad-1.0.jar
DEBUG|main| 2905|PostDownloadPolicy:checksum    - Not valid checksum: /export/home/build/data/continuum/checkouts/282/target/test-repository/managed/org/apache/maven/test/get-checksum-both-bad/1.0/get-checksum-both-bad-1.0.jar.md5
 WARN|main| 2905|PostDownloadPolicy:checksum    - MD5 is incorrect for /export/home/build/data/continuum/checkouts/282/target/test-repository/managed/org/apache/maven/test/get-checksum-both-bad/1.0/get-checksum-both-bad-1.0.jar
DEBUG|main| 2906|RepositoryProxyConnectors:default - Didn't pass the [checksum] policy.
 INFO|main| 2906|RepositoryProxyConnectors:default - Failed post-download policies - /export/home/build/data/continuum/checkouts/282/target/test-repository/managed/org/apache/maven/test/get-checksum-both-bad/1.0/get-checksum-both-bad-1.0.jar
 INFO|main| 2906|Cache:url-failures-cache       - Disposing cache: [  name = cache status = STATUS_ALIVE eternal = false overflowToDisk = false maxElementsInMemory = 1000 maxElementsOnDisk = 0 memoryStoreEvictionPolicy = LRU timeToLiveSeconds = 1800 timeToIdleSeconds = 2700 diskPersistent = true diskExpiryThreadIntervalSeconds = 600 cacheEventListeners:  hitCount = 0 memoryStoreHitCount = 0 diskStoreHitCount = 0 missCountNotFound = 0 missCountExpired = 0 ]
DEBUG|main| 2928|Registry:commons-configuration - Creating a default configuration - no configuration was provided
DEBUG|main| 2959|CacheManager                   - Attempting to create an existing singleton. Existing singleton returned.
DEBUG|main| 2960|MemoryStore                    - Initialized net.sf.ehcache.store.LruMemoryStore for cache
DEBUG|main| 2960|LruMemoryStore                 - cache Cache: Using SpoolingLinkedHashMap implementation
DEBUG|main| 2960|Cache                          - Initialised cache: cache

.\ testGetChecksumBadSha1BadMd5FixSetting() \._________________________________________

DEBUG|main| 2962|RepositoryProxyConnectors:default - Attempting connector: ProxyConnector[
  source:ArchivaRepository[default-managed-repository,file:/export/home/build/data/continuum/checkouts/282/target/test-repository/managed/]
  target:ArchivaRepository[proxied1,file:/export/home/build/data/continuum/checkouts/282/src/test/repositories/proxied1/]
  proxyId:null
  policy[releases]:ignored
  policy[snapshots]:ignored
  policy[cache-failures]:ignored
  policy[checksum]:fix
]
DEBUG|main| 2962|RepositoryProxyConnectors:default - Using target repository: proxied1 - layout: default - targetPath: org/apache/maven/test/get-checksum-both-bad/1.0/get-checksum-both-bad-1.0.jar
DEBUG|main| 2962|RepositoryProxyConnectors:default - Applying [releases] policy with [ignored]
DEBUG|main| 2962|PreDownloadPolicy:releases     - OK to update, releases policy set to IGNORED.
DEBUG|main| 2962|RepositoryProxyConnectors:default - Applying [snapshots] policy with [ignored]
DEBUG|main| 2962|PreDownloadPolicy:snapshots    - OK to update, snapshots policy set to IGNORED.
DEBUG|main| 2963|RepositoryProxyConnectors:default - Applying [cache-failures] policy with [ignored]
DEBUG|main| 2963|PreDownloadPolicy:cache-failures - OK to fetch, check-failures policy set to IGNORED.
DEBUG|main| 2963|RepositoryProxyConnectors:default - Retrieving org/apache/maven/test/get-checksum-both-bad/1.0/get-checksum-both-bad-1.0.jar from Proxied Repository 1 if updated
DEBUG|main| 2963|RepositoryProxyConnectors:default - Downloaded successfully.
DEBUG|main| 2964|RepositoryProxyConnectors:default - Retrieving org/apache/maven/test/get-checksum-both-bad/1.0/get-checksum-both-bad-1.0.jar.sha1 from Proxied Repository 1 if updated
DEBUG|main| 2964|RepositoryProxyConnectors:default - Downloaded successfully.
DEBUG|main| 2965|RepositoryProxyConnectors:default - Checksum.sha1 Downloaded: /export/home/build/data/continuum/checkouts/282/target/test-repository/managed/org/apache/maven/test/get-checksum-both-bad/1.0/get-checksum-both-bad-1.0.jar.sha1
DEBUG|main| 2965|RepositoryProxyConnectors:default - Retrieving org/apache/maven/test/get-checksum-both-bad/1.0/get-checksum-both-bad-1.0.jar.md5 from Proxied Repository 1 if updated
DEBUG|main| 2965|RepositoryProxyConnectors:default - Downloaded successfully.
DEBUG|main| 2966|RepositoryProxyConnectors:default - Checksum.md5 Downloaded: /export/home/build/data/continuum/checkouts/282/target/test-repository/managed/org/apache/maven/test/get-checksum-both-bad/1.0/get-checksum-both-bad-1.0.jar.md5
DEBUG|main| 2966|RepositoryProxyConnectors:default - Applying [checksum] policy with [fix]
DEBUG|main| 2967|PostDownloadPolicy:checksum    - Not valid checksum: /export/home/build/data/continuum/checkouts/282/target/test-repository/managed/org/apache/maven/test/get-checksum-both-bad/1.0/get-checksum-both-bad-1.0.jar.sha1
DEBUG|main| 2970|PostDownloadPolicy:checksum    - Not valid checksum: /export/home/build/data/continuum/checkouts/282/target/test-repository/managed/org/apache/maven/test/get-checksum-both-bad/1.0/get-checksum-both-bad-1.0.jar.md5
 INFO|main| 2971|RepositoryProxyConnectors:default - Successfully transfered: /export/home/build/data/continuum/checkouts/282/target/test-repository/managed/org/apache/maven/test/get-checksum-both-bad/1.0/get-checksum-both-bad-1.0.jar
 INFO|main| 2972|Cache:url-failures-cache       - Disposing cache: [  name = cache status = STATUS_ALIVE eternal = false overflowToDisk = false maxElementsInMemory = 1000 maxElementsOnDisk = 0 memoryStoreEvictionPolicy = LRU timeToLiveSeconds = 1800 timeToIdleSeconds = 2700 diskPersistent = true diskExpiryThreadIntervalSeconds = 600 cacheEventListeners:  hitCount = 0 memoryStoreHitCount = 0 diskStoreHitCount = 0 missCountNotFound = 0 missCountExpired = 0 ]
DEBUG|main| 2994|Registry:commons-configuration - Creating a default configuration - no configuration was provided
DEBUG|main| 3038|CacheManager                   - Attempting to create an existing singleton. Existing singleton returned.
DEBUG|main| 3038|MemoryStore                    - Initialized net.sf.ehcache.store.LruMemoryStore for cache
DEBUG|main| 3038|LruMemoryStore                 - cache Cache: Using SpoolingLinkedHashMap implementation
DEBUG|main| 3038|Cache                          - Initialised cache: cache

.\ testGetChecksumCorrectSha1BadMd5UsingFailSetting() \._________________________________________

DEBUG|main| 3040|RepositoryProxyConnectors:default - Attempting connector: ProxyConnector[
  source:ArchivaRepository[default-managed-repository,file:/export/home/build/data/continuum/checkouts/282/target/test-repository/managed/]
  target:ArchivaRepository[proxied1,file:/export/home/build/data/continuum/checkouts/282/src/test/repositories/proxied1/]
  proxyId:null
  policy[releases]:ignored
  policy[snapshots]:ignored
  policy[cache-failures]:ignored
  policy[checksum]:fail
]
DEBUG|main| 3040|RepositoryProxyConnectors:default - Using target repository: proxied1 - layout: default - targetPath: org/apache/maven/test/get-checksum-sha1-bad-md5/1.0/get-checksum-sha1-bad-md5-1.0.jar
DEBUG|main| 3041|RepositoryProxyConnectors:default - Applying [releases] policy with [ignored]
DEBUG|main| 3041|PreDownloadPolicy:releases     - OK to update, releases policy set to IGNORED.
DEBUG|main| 3041|RepositoryProxyConnectors:default - Applying [snapshots] policy with [ignored]
DEBUG|main| 3041|PreDownloadPolicy:snapshots    - OK to update, snapshots policy set to IGNORED.
DEBUG|main| 3041|RepositoryProxyConnectors:default - Applying [cache-failures] policy with [ignored]
DEBUG|main| 3041|PreDownloadPolicy:cache-failures - OK to fetch, check-failures policy set to IGNORED.
DEBUG|main| 3041|RepositoryProxyConnectors:default - Retrieving org/apache/maven/test/get-checksum-sha1-bad-md5/1.0/get-checksum-sha1-bad-md5-1.0.jar from Proxied Repository 1 if updated
DEBUG|main| 3104|RepositoryProxyConnectors:default - Downloaded successfully.
DEBUG|main| 3104|RepositoryProxyConnectors:default - Retrieving org/apache/maven/test/get-checksum-sha1-bad-md5/1.0/get-checksum-sha1-bad-md5-1.0.jar.sha1 from Proxied Repository 1 if updated
DEBUG|main| 3133|RepositoryProxyConnectors:default - Downloaded successfully.
DEBUG|main| 3134|RepositoryProxyConnectors:default - Checksum.sha1 Downloaded: /export/home/build/data/continuum/checkouts/282/target/test-repository/managed/org/apache/maven/test/get-checksum-sha1-bad-md5/1.0/get-checksum-sha1-bad-md5-1.0.jar.sha1
DEBUG|main| 3134|RepositoryProxyConnectors:default - Retrieving org/apache/maven/test/get-checksum-sha1-bad-md5/1.0/get-checksum-sha1-bad-md5-1.0.jar.md5 from Proxied Repository 1 if updated
DEBUG|main| 3136|RepositoryProxyConnectors:default - Downloaded successfully.
DEBUG|main| 3137|RepositoryProxyConnectors:default - Checksum.md5 Downloaded: /export/home/build/data/continuum/checkouts/282/target/test-repository/managed/org/apache/maven/test/get-checksum-sha1-bad-md5/1.0/get-checksum-sha1-bad-md5-1.0.jar.md5
DEBUG|main| 3137|RepositoryProxyConnectors:default - Applying [checksum] policy with [fail]
DEBUG|main| 3139|PostDownloadPolicy:checksum    - Valid checksum: /export/home/build/data/continuum/checkouts/282/target/test-repository/managed/org/apache/maven/test/get-checksum-sha1-bad-md5/1.0/get-checksum-sha1-bad-md5-1.0.jar.sha1
DEBUG|main| 3140|PostDownloadPolicy:checksum    - Not valid checksum: /export/home/build/data/continuum/checkouts/282/target/test-repository/managed/org/apache/maven/test/get-checksum-sha1-bad-md5/1.0/get-checksum-sha1-bad-md5-1.0.jar.md5
 WARN|main| 3140|PostDownloadPolicy:checksum    - MD5 is incorrect for /export/home/build/data/continuum/checkouts/282/target/test-repository/managed/org/apache/maven/test/get-checksum-sha1-bad-md5/1.0/get-checksum-sha1-bad-md5-1.0.jar
DEBUG|main| 3140|RepositoryProxyConnectors:default - Didn't pass the [checksum] policy.
 INFO|main| 3140|RepositoryProxyConnectors:default - Failed post-download policies - /export/home/build/data/continuum/checkouts/282/target/test-repository/managed/org/apache/maven/test/get-checksum-sha1-bad-md5/1.0/get-checksum-sha1-bad-md5-1.0.jar
 INFO|main| 3141|Cache:url-failures-cache       - Disposing cache: [  name = cache status = STATUS_ALIVE eternal = false overflowToDisk = false maxElementsInMemory = 1000 maxElementsOnDisk = 0 memoryStoreEvictionPolicy = LRU timeToLiveSeconds = 1800 timeToIdleSeconds = 2700 diskPersistent = true diskExpiryThreadIntervalSeconds = 600 cacheEventListeners:  hitCount = 0 memoryStoreHitCount = 0 diskStoreHitCount = 0 missCountNotFound = 0 missCountExpired = 0 ]
DEBUG|main| 3168|Registry:commons-configuration - Creating a default configuration - no configuration was provided
DEBUG|main| 3202|CacheManager                   - Attempting to create an existing singleton. Existing singleton returned.
DEBUG|main| 3202|MemoryStore                    - Initialized net.sf.ehcache.store.LruMemoryStore for cache
DEBUG|main| 3202|LruMemoryStore                 - cache Cache: Using SpoolingLinkedHashMap implementation
DEBUG|main| 3202|Cache                          - Initialised cache: cache

.\ testGetChecksumNoSha1CorrectMd5UsingFailSetting() \._________________________________________

DEBUG|main| 3206|RepositoryProxyConnectors:default - Attempting connector: ProxyConnector[
  source:ArchivaRepository[default-managed-repository,file:/export/home/build/data/continuum/checkouts/282/target/test-repository/managed/]
  target:ArchivaRepository[proxied1,file:/export/home/build/data/continuum/checkouts/282/src/test/repositories/proxied1/]
  proxyId:null
  policy[releases]:ignored
  policy[snapshots]:ignored
  policy[cache-failures]:ignored
  policy[checksum]:fail
]
DEBUG|main| 3206|RepositoryProxyConnectors:default - Using target repository: proxied1 - layout: default - targetPath: org/apache/maven/test/get-checksum-md5-only/1.0/get-checksum-md5-only-1.0.jar
DEBUG|main| 3206|RepositoryProxyConnectors:default - Applying [releases] policy with [ignored]
DEBUG|main| 3206|PreDownloadPolicy:releases     - OK to update, releases policy set to IGNORED.
DEBUG|main| 3206|RepositoryProxyConnectors:default - Applying [snapshots] policy with [ignored]
DEBUG|main| 3206|PreDownloadPolicy:snapshots    - OK to update, snapshots policy set to IGNORED.
DEBUG|main| 3206|RepositoryProxyConnectors:default - Applying [cache-failures] policy with [ignored]
DEBUG|main| 3206|PreDownloadPolicy:cache-failures - OK to fetch, check-failures policy set to IGNORED.
DEBUG|main| 3207|RepositoryProxyConnectors:default - Retrieving org/apache/maven/test/get-checksum-md5-only/1.0/get-checksum-md5-only-1.0.jar from Proxied Repository 1 if updated
DEBUG|main| 3208|RepositoryProxyConnectors:default - Downloaded successfully.
DEBUG|main| 3208|RepositoryProxyConnectors:default - Retrieving org/apache/maven/test/get-checksum-md5-only/1.0/get-checksum-md5-only-1.0.jar.sha1 from Proxied Repository 1 if updated
 WARN|main| 3209|RepositoryProxyConnectors:default - Resource does not exist: File: /export/home/build/data/continuum/checkouts/282/src/test/repositories/proxied1/org/apache/maven/test/get-checksum-md5-only/1.0/get-checksum-md5-only-1.0.jar.sha1 does not exist
DEBUG|main| 3209|RepositoryProxyConnectors:default - Checksum.sha1 Not Download: File: /export/home/build/data/continuum/checkouts/282/src/test/repositories/proxied1/org/apache/maven/test/get-checksum-md5-only/1.0/get-checksum-md5-only-1.0.jar.sha1 does not exist
DEBUG|main| 3209|RepositoryProxyConnectors:default - Retrieving org/apache/maven/test/get-checksum-md5-only/1.0/get-checksum-md5-only-1.0.jar.md5 from Proxied Repository 1 if updated
DEBUG|main| 3209|RepositoryProxyConnectors:default - Downloaded successfully.
DEBUG|main| 3209|RepositoryProxyConnectors:default - Checksum.md5 Downloaded: /export/home/build/data/continuum/checkouts/282/target/test-repository/managed/org/apache/maven/test/get-checksum-md5-only/1.0/get-checksum-md5-only-1.0.jar.md5
DEBUG|main| 3210|RepositoryProxyConnectors:default - Applying [checksum] policy with [fail]
DEBUG|main| 3210|PostDownloadPolicy:checksum    - Valid checksum: /export/home/build/data/continuum/checkouts/282/target/test-repository/managed/org/apache/maven/test/get-checksum-md5-only/1.0/get-checksum-md5-only-1.0.jar.md5
 INFO|main| 3210|RepositoryProxyConnectors:default - Successfully transfered: /export/home/build/data/continuum/checkouts/282/target/test-repository/managed/org/apache/maven/test/get-checksum-md5-only/1.0/get-checksum-md5-only-1.0.jar
 INFO|main| 3211|Cache:url-failures-cache       - Disposing cache: [  name = cache status = STATUS_ALIVE eternal = false overflowToDisk = false maxElementsInMemory = 1000 maxElementsOnDisk = 0 memoryStoreEvictionPolicy = LRU timeToLiveSeconds = 1800 timeToIdleSeconds = 2700 diskPersistent = true diskExpiryThreadIntervalSeconds = 600 cacheEventListeners:  hitCount = 0 memoryStoreHitCount = 0 diskStoreHitCount = 0 missCountNotFound = 0 missCountExpired = 0 ]
DEBUG|main| 3235|Registry:commons-configuration - Creating a default configuration - no configuration was provided
DEBUG|main| 3264|CacheManager                   - Attempting to create an existing singleton. Existing singleton returned.
DEBUG|main| 3264|MemoryStore                    - Initialized net.sf.ehcache.store.LruMemoryStore for cache
DEBUG|main| 3264|LruMemoryStore                 - cache Cache: Using SpoolingLinkedHashMap implementation
DEBUG|main| 3264|Cache                          - Initialised cache: cache

.\ testGetWithNoChecksumsUsingFailSetting() \._________________________________________

DEBUG|main| 3266|RepositoryProxyConnectors:default - Attempting connector: ProxyConnector[
  source:ArchivaRepository[default-managed-repository,file:/export/home/build/data/continuum/checkouts/282/target/test-repository/managed/]
  target:ArchivaRepository[proxied1,file:/export/home/build/data/continuum/checkouts/282/src/test/repositories/proxied1/]
  proxyId:null
  policy[releases]:ignored
  policy[snapshots]:ignored
  policy[cache-failures]:ignored
  policy[checksum]:fail
]
DEBUG|main| 3267|RepositoryProxyConnectors:default - Using target repository: proxied1 - layout: default - targetPath: org/apache/maven/test/get-default-layout/1.0/get-default-layout-1.0.jar
DEBUG|main| 3267|RepositoryProxyConnectors:default - Applying [releases] policy with [ignored]
DEBUG|main| 3267|PreDownloadPolicy:releases     - OK to update, releases policy set to IGNORED.
DEBUG|main| 3267|RepositoryProxyConnectors:default - Applying [snapshots] policy with [ignored]
DEBUG|main| 3267|PreDownloadPolicy:snapshots    - OK to update, snapshots policy set to IGNORED.
DEBUG|main| 3267|RepositoryProxyConnectors:default - Applying [cache-failures] policy with [ignored]
DEBUG|main| 3267|PreDownloadPolicy:cache-failures - OK to fetch, check-failures policy set to IGNORED.
DEBUG|main| 3267|RepositoryProxyConnectors:default - Retrieving org/apache/maven/test/get-default-layout/1.0/get-default-layout-1.0.jar from Proxied Repository 1 if updated
DEBUG|main| 3268|RepositoryProxyConnectors:default - Downloaded successfully.
DEBUG|main| 3268|RepositoryProxyConnectors:default - Retrieving org/apache/maven/test/get-default-layout/1.0/get-default-layout-1.0.jar.sha1 from Proxied Repository 1 if updated
 WARN|main| 3269|RepositoryProxyConnectors:default - Resource does not exist: File: /export/home/build/data/continuum/checkouts/282/src/test/repositories/proxied1/org/apache/maven/test/get-default-layout/1.0/get-default-layout-1.0.jar.sha1 does not exist
DEBUG|main| 3269|RepositoryProxyConnectors:default - Checksum.sha1 Not Download: File: /export/home/build/data/continuum/checkouts/282/src/test/repositories/proxied1/org/apache/maven/test/get-default-layout/1.0/get-default-layout-1.0.jar.sha1 does not exist
DEBUG|main| 3269|RepositoryProxyConnectors:default - Retrieving org/apache/maven/test/get-default-layout/1.0/get-default-layout-1.0.jar.md5 from Proxied Repository 1 if updated
 WARN|main| 3269|RepositoryProxyConnectors:default - Resource does not exist: File: /export/home/build/data/continuum/checkouts/282/src/test/repositories/proxied1/org/apache/maven/test/get-default-layout/1.0/get-default-layout-1.0.jar.md5 does not exist
DEBUG|main| 3269|RepositoryProxyConnectors:default - Checksum.md5 Not Download: File: /export/home/build/data/continuum/checkouts/282/src/test/repositories/proxied1/org/apache/maven/test/get-default-layout/1.0/get-default-layout-1.0.jar.md5 does not exist
DEBUG|main| 3269|RepositoryProxyConnectors:default - Applying [checksum] policy with [fail]
ERROR|main| 3269|PostDownloadPolicy:checksum    - File /export/home/build/data/continuum/checkouts/282/target/test-repository/managed/org/apache/maven/test/get-default-layout/1.0/get-default-layout-1.0.jar has no checksum files (sha1 or md5).
DEBUG|main| 3269|RepositoryProxyConnectors:default - Didn't pass the [checksum] policy.
 INFO|main| 3269|RepositoryProxyConnectors:default - Failed post-download policies - /export/home/build/data/continuum/checkouts/282/target/test-repository/managed/org/apache/maven/test/get-default-layout/1.0/get-default-layout-1.0.jar
 INFO|main| 3270|Cache:url-failures-cache       - Disposing cache: [  name = cache status = STATUS_ALIVE eternal = false overflowToDisk = false maxElementsInMemory = 1000 maxElementsOnDisk = 0 memoryStoreEvictionPolicy = LRU timeToLiveSeconds = 1800 timeToIdleSeconds = 2700 diskPersistent = true diskExpiryThreadIntervalSeconds = 600 cacheEventListeners:  hitCount = 0 memoryStoreHitCount = 0 diskStoreHitCount = 0 missCountNotFound = 0 missCountExpired = 0 ]
DEBUG|main| 3291|Registry:commons-configuration - Creating a default configuration - no configuration was provided
DEBUG|main| 3326|CacheManager                   - Attempting to create an existing singleton. Existing singleton returned.
DEBUG|main| 3328|MemoryStore                    - Initialized net.sf.ehcache.store.LruMemoryStore for cache
DEBUG|main| 3328|LruMemoryStore                 - cache Cache: Using SpoolingLinkedHashMap implementation
DEBUG|main| 3328|Cache                          - Initialised cache: cache

.\ testGetChecksumCorrectSha1BadMd5UsingIgnoredSetting() \._________________________________________

DEBUG|main| 3331|RepositoryProxyConnectors:default - Attempting connector: ProxyConnector[
  source:ArchivaRepository[default-managed-repository,file:/export/home/build/data/continuum/checkouts/282/target/test-repository/managed/]
  target:ArchivaRepository[proxied1,file:/export/home/build/data/continuum/checkouts/282/src/test/repositories/proxied1/]
  proxyId:null
  policy[releases]:ignored
  policy[snapshots]:ignored
  policy[cache-failures]:ignored
  policy[checksum]:ignored
]
DEBUG|main| 3331|RepositoryProxyConnectors:default - Using target repository: proxied1 - layout: default - targetPath: org/apache/maven/test/get-checksum-sha1-bad-md5/1.0/get-checksum-sha1-bad-md5-1.0.jar
DEBUG|main| 3331|RepositoryProxyConnectors:default - Applying [releases] policy with [ignored]
DEBUG|main| 3331|PreDownloadPolicy:releases     - OK to update, releases policy set to IGNORED.
DEBUG|main| 3331|RepositoryProxyConnectors:default - Applying [snapshots] policy with [ignored]
DEBUG|main| 3331|PreDownloadPolicy:snapshots    - OK to update, snapshots policy set to IGNORED.
DEBUG|main| 3331|RepositoryProxyConnectors:default - Applying [cache-failures] policy with [ignored]
DEBUG|main| 3331|PreDownloadPolicy:cache-failures - OK to fetch, check-failures policy set to IGNORED.
DEBUG|main| 3331|RepositoryProxyConnectors:default - Retrieving org/apache/maven/test/get-checksum-sha1-bad-md5/1.0/get-checksum-sha1-bad-md5-1.0.jar from Proxied Repository 1 if updated
DEBUG|main| 3332|RepositoryProxyConnectors:default - Downloaded successfully.
DEBUG|main| 3332|RepositoryProxyConnectors:default - Retrieving org/apache/maven/test/get-checksum-sha1-bad-md5/1.0/get-checksum-sha1-bad-md5-1.0.jar.sha1 from Proxied Repository 1 if updated
DEBUG|main| 3333|RepositoryProxyConnectors:default - Downloaded successfully.
DEBUG|main| 3333|RepositoryProxyConnectors:default - Checksum.sha1 Downloaded: /export/home/build/data/continuum/checkouts/282/target/test-repository/managed/org/apache/maven/test/get-checksum-sha1-bad-md5/1.0/get-checksum-sha1-bad-md5-1.0.jar.sha1
DEBUG|main| 3333|RepositoryProxyConnectors:default - Retrieving org/apache/maven/test/get-checksum-sha1-bad-md5/1.0/get-checksum-sha1-bad-md5-1.0.jar.md5 from Proxied Repository 1 if updated
DEBUG|main| 3334|RepositoryProxyConnectors:default - Downloaded successfully.
DEBUG|main| 3334|RepositoryProxyConnectors:default - Checksum.md5 Downloaded: /export/home/build/data/continuum/checkouts/282/target/test-repository/managed/org/apache/maven/test/get-checksum-sha1-bad-md5/1.0/get-checksum-sha1-bad-md5-1.0.jar.md5
DEBUG|main| 3334|RepositoryProxyConnectors:default - Applying [checksum] policy with [ignored]
 INFO|main| 3334|RepositoryProxyConnectors:default - Successfully transfered: /export/home/build/data/continuum/checkouts/282/target/test-repository/managed/org/apache/maven/test/get-checksum-sha1-bad-md5/1.0/get-checksum-sha1-bad-md5-1.0.jar
 INFO|main| 3335|Cache:url-failures-cache       - Disposing cache: [  name = cache status = STATUS_ALIVE eternal = false overflowToDisk = false maxElementsInMemory = 1000 maxElementsOnDisk = 0 memoryStoreEvictionPolicy = LRU timeToLiveSeconds = 1800 timeToIdleSeconds = 2700 diskPersistent = true diskExpiryThreadIntervalSeconds = 600 cacheEventListeners:  hitCount = 0 memoryStoreHitCount = 0 diskStoreHitCount = 0 missCountNotFound = 0 missCountExpired = 0 ]
DEBUG|main| 3363|Registry:commons-configuration - Creating a default configuration - no configuration was provided
DEBUG|main| 3392|CacheManager                   - Attempting to create an existing singleton. Existing singleton returned.
DEBUG|main| 3392|MemoryStore                    - Initialized net.sf.ehcache.store.LruMemoryStore for cache
DEBUG|main| 3392|LruMemoryStore                 - cache Cache: Using SpoolingLinkedHashMap implementation
DEBUG|main| 3392|Cache                          - Initialised cache: cache

.\ testGetChecksumCorrectSha1BadMd5UsingFixSetting() \._________________________________________

DEBUG|main| 3398|RepositoryProxyConnectors:default - Attempting connector: ProxyConnector[
  source:ArchivaRepository[default-managed-repository,file:/export/home/build/data/continuum/checkouts/282/target/test-repository/managed/]
  target:ArchivaRepository[proxied1,file:/export/home/build/data/continuum/checkouts/282/src/test/repositories/proxied1/]
  proxyId:null
  policy[releases]:ignored
  policy[snapshots]:ignored
  policy[cache-failures]:ignored
  policy[checksum]:fix
]
DEBUG|main| 3398|RepositoryProxyConnectors:default - Using target repository: proxied1 - layout: default - targetPath: org/apache/maven/test/get-checksum-sha1-bad-md5/1.0/get-checksum-sha1-bad-md5-1.0.jar
DEBUG|main| 3398|RepositoryProxyConnectors:default - Applying [releases] policy with [ignored]
DEBUG|main| 3398|PreDownloadPolicy:releases     - OK to update, releases policy set to IGNORED.
DEBUG|main| 3398|RepositoryProxyConnectors:default - Applying [snapshots] policy with [ignored]
DEBUG|main| 3398|PreDownloadPolicy:snapshots    - OK to update, snapshots policy set to IGNORED.
DEBUG|main| 3399|RepositoryProxyConnectors:default - Applying [cache-failures] policy with [ignored]
DEBUG|main| 3399|PreDownloadPolicy:cache-failures - OK to fetch, check-failures policy set to IGNORED.
DEBUG|main| 3399|RepositoryProxyConnectors:default - Retrieving org/apache/maven/test/get-checksum-sha1-bad-md5/1.0/get-checksum-sha1-bad-md5-1.0.jar from Proxied Repository 1 if updated
DEBUG|main| 3399|RepositoryProxyConnectors:default - Downloaded successfully.
DEBUG|main| 3400|RepositoryProxyConnectors:default - Retrieving org/apache/maven/test/get-checksum-sha1-bad-md5/1.0/get-checksum-sha1-bad-md5-1.0.jar.sha1 from Proxied Repository 1 if updated
DEBUG|main| 3400|RepositoryProxyConnectors:default - Downloaded successfully.
DEBUG|main| 3401|RepositoryProxyConnectors:default - Checksum.sha1 Downloaded: /export/home/build/data/continuum/checkouts/282/target/test-repository/managed/org/apache/maven/test/get-checksum-sha1-bad-md5/1.0/get-checksum-sha1-bad-md5-1.0.jar.sha1
DEBUG|main| 3401|RepositoryProxyConnectors:default - Retrieving org/apache/maven/test/get-checksum-sha1-bad-md5/1.0/get-checksum-sha1-bad-md5-1.0.jar.md5 from Proxied Repository 1 if updated
DEBUG|main| 3401|RepositoryProxyConnectors:default - Downloaded successfully.
DEBUG|main| 3402|RepositoryProxyConnectors:default - Checksum.md5 Downloaded: /export/home/build/data/continuum/checkouts/282/target/test-repository/managed/org/apache/maven/test/get-checksum-sha1-bad-md5/1.0/get-checksum-sha1-bad-md5-1.0.jar.md5
DEBUG|main| 3402|RepositoryProxyConnectors:default - Applying [checksum] policy with [fix]
DEBUG|main| 3402|PostDownloadPolicy:checksum    - Valid checksum: /export/home/build/data/continuum/checkouts/282/target/test-repository/managed/org/apache/maven/test/get-checksum-sha1-bad-md5/1.0/get-checksum-sha1-bad-md5-1.0.jar.sha1
DEBUG|main| 3403|PostDownloadPolicy:checksum    - Not valid checksum: /export/home/build/data/continuum/checkouts/282/target/test-repository/managed/org/apache/maven/test/get-checksum-sha1-bad-md5/1.0/get-checksum-sha1-bad-md5-1.0.jar.md5
 INFO|main| 3403|RepositoryProxyConnectors:default - Successfully transfered: /export/home/build/data/continuum/checkouts/282/target/test-repository/managed/org/apache/maven/test/get-checksum-sha1-bad-md5/1.0/get-checksum-sha1-bad-md5-1.0.jar
 INFO|main| 3404|Cache:url-failures-cache       - Disposing cache: [  name = cache status = STATUS_ALIVE eternal = false overflowToDisk = false maxElementsInMemory = 1000 maxElementsOnDisk = 0 memoryStoreEvictionPolicy = LRU timeToLiveSeconds = 1800 timeToIdleSeconds = 2700 diskPersistent = true diskExpiryThreadIntervalSeconds = 600 cacheEventListeners:  hitCount = 0 memoryStoreHitCount = 0 diskStoreHitCount = 0 missCountNotFound = 0 missCountExpired = 0 ]
DEBUG|main| 3424|Registry:commons-configuration - Creating a default configuration - no configuration was provided
DEBUG|main| 3453|CacheManager                   - Attempting to create an existing singleton. Existing singleton returned.
DEBUG|main| 3453|MemoryStore                    - Initialized net.sf.ehcache.store.LruMemoryStore for cache
DEBUG|main| 3453|LruMemoryStore                 - cache Cache: Using SpoolingLinkedHashMap implementation
DEBUG|main| 3453|Cache                          - Initialised cache: cache

.\ testGetChecksumNoSha1CorrectMd5UsingFixSetting() \._________________________________________

DEBUG|main| 3456|RepositoryProxyConnectors:default - Attempting connector: ProxyConnector[
  source:ArchivaRepository[default-managed-repository,file:/export/home/build/data/continuum/checkouts/282/target/test-repository/managed/]
  target:ArchivaRepository[proxied1,file:/export/home/build/data/continuum/checkouts/282/src/test/repositories/proxied1/]
  proxyId:null
  policy[releases]:ignored
  policy[snapshots]:ignored
  policy[cache-failures]:ignored
  policy[checksum]:fix
]
DEBUG|main| 3456|RepositoryProxyConnectors:default - Using target repository: proxied1 - layout: default - targetPath: org/apache/maven/test/get-checksum-md5-only/1.0/get-checksum-md5-only-1.0.jar
DEBUG|main| 3457|RepositoryProxyConnectors:default - Applying [releases] policy with [ignored]
DEBUG|main| 3457|PreDownloadPolicy:releases     - OK to update, releases policy set to IGNORED.
DEBUG|main| 3457|RepositoryProxyConnectors:default - Applying [snapshots] policy with [ignored]
DEBUG|main| 3457|PreDownloadPolicy:snapshots    - OK to update, snapshots policy set to IGNORED.
DEBUG|main| 3457|RepositoryProxyConnectors:default - Applying [cache-failures] policy with [ignored]
DEBUG|main| 3458|PreDownloadPolicy:cache-failures - OK to fetch, check-failures policy set to IGNORED.
DEBUG|main| 3458|RepositoryProxyConnectors:default - Retrieving org/apache/maven/test/get-checksum-md5-only/1.0/get-checksum-md5-only-1.0.jar from Proxied Repository 1 if updated
DEBUG|main| 3458|RepositoryProxyConnectors:default - Downloaded successfully.
DEBUG|main| 3459|RepositoryProxyConnectors:default - Retrieving org/apache/maven/test/get-checksum-md5-only/1.0/get-checksum-md5-only-1.0.jar.sha1 from Proxied Repository 1 if updated
 WARN|main| 3459|RepositoryProxyConnectors:default - Resource does not exist: File: /export/home/build/data/continuum/checkouts/282/src/test/repositories/proxied1/org/apache/maven/test/get-checksum-md5-only/1.0/get-checksum-md5-only-1.0.jar.sha1 does not exist
DEBUG|main| 3459|RepositoryProxyConnectors:default - Checksum.sha1 Not Download: File: /export/home/build/data/continuum/checkouts/282/src/test/repositories/proxied1/org/apache/maven/test/get-checksum-md5-only/1.0/get-checksum-md5-only-1.0.jar.sha1 does not exist
DEBUG|main| 3459|RepositoryProxyConnectors:default - Retrieving org/apache/maven/test/get-checksum-md5-only/1.0/get-checksum-md5-only-1.0.jar.md5 from Proxied Repository 1 if updated
DEBUG|main| 3460|RepositoryProxyConnectors:default - Downloaded successfully.
DEBUG|main| 3460|RepositoryProxyConnectors:default - Checksum.md5 Downloaded: /export/home/build/data/continuum/checkouts/282/target/test-repository/managed/org/apache/maven/test/get-checksum-md5-only/1.0/get-checksum-md5-only-1.0.jar.md5
DEBUG|main| 3460|RepositoryProxyConnectors:default - Applying [checksum] policy with [fix]
DEBUG|main| 3461|PostDownloadPolicy:checksum    - Valid checksum: /export/home/build/data/continuum/checkouts/282/target/test-repository/managed/org/apache/maven/test/get-checksum-md5-only/1.0/get-checksum-md5-only-1.0.jar.md5
 INFO|main| 3461|RepositoryProxyConnectors:default - Successfully transfered: /export/home/build/data/continuum/checkouts/282/target/test-repository/managed/org/apache/maven/test/get-checksum-md5-only/1.0/get-checksum-md5-only-1.0.jar
 INFO|main| 3464|Cache:url-failures-cache       - Disposing cache: [  name = cache status = STATUS_ALIVE eternal = false overflowToDisk = false maxElementsInMemory = 1000 maxElementsOnDisk = 0 memoryStoreEvictionPolicy = LRU timeToLiveSeconds = 1800 timeToIdleSeconds = 2700 diskPersistent = true diskExpiryThreadIntervalSeconds = 600 cacheEventListeners:  hitCount = 0 memoryStoreHitCount = 0 diskStoreHitCount = 0 missCountNotFound = 0 missCountExpired = 0 ]
DEBUG|main| 3486|Registry:commons-configuration - Creating a default configuration - no configuration was provided
DEBUG|main| 3524|CacheManager                   - Attempting to create an existing singleton. Existing singleton returned.
DEBUG|main| 3524|MemoryStore                    - Initialized net.sf.ehcache.store.LruMemoryStore for cache
DEBUG|main| 3524|LruMemoryStore                 - cache Cache: Using SpoolingLinkedHashMap implementation
DEBUG|main| 3524|Cache                          - Initialised cache: cache

.\ testGetWithNoChecksumsUsingFixSetting() \._________________________________________

DEBUG|main| 3527|RepositoryProxyConnectors:default - Attempting connector: ProxyConnector[
  source:ArchivaRepository[default-managed-repository,file:/export/home/build/data/continuum/checkouts/282/target/test-repository/managed/]
  target:ArchivaRepository[proxied1,file:/export/home/build/data/continuum/checkouts/282/src/test/repositories/proxied1/]
  proxyId:null
  policy[releases]:ignored
  policy[snapshots]:ignored
  policy[cache-failures]:ignored
  policy[checksum]:fix
]
DEBUG|main| 3527|RepositoryProxyConnectors:default - Using target repository: proxied1 - layout: default - targetPath: org/apache/maven/test/get-default-layout/1.0/get-default-layout-1.0.jar
DEBUG|main| 3527|RepositoryProxyConnectors:default - Applying [releases] policy with [ignored]
DEBUG|main| 3527|PreDownloadPolicy:releases     - OK to update, releases policy set to IGNORED.
DEBUG|main| 3527|RepositoryProxyConnectors:default - Applying [snapshots] policy with [ignored]
DEBUG|main| 3527|PreDownloadPolicy:snapshots    - OK to update, snapshots policy set to IGNORED.
DEBUG|main| 3527|RepositoryProxyConnectors:default - Applying [cache-failures] policy with [ignored]
DEBUG|main| 3528|PreDownloadPolicy:cache-failures - OK to fetch, check-failures policy set to IGNORED.
DEBUG|main| 3528|RepositoryProxyConnectors:default - Retrieving org/apache/maven/test/get-default-layout/1.0/get-default-layout-1.0.jar from Proxied Repository 1 if updated
DEBUG|main| 3528|RepositoryProxyConnectors:default - Downloaded successfully.
DEBUG|main| 3529|RepositoryProxyConnectors:default - Retrieving org/apache/maven/test/get-default-layout/1.0/get-default-layout-1.0.jar.sha1 from Proxied Repository 1 if updated
 WARN|main| 3529|RepositoryProxyConnectors:default - Resource does not exist: File: /export/home/build/data/continuum/checkouts/282/src/test/repositories/proxied1/org/apache/maven/test/get-default-layout/1.0/get-default-layout-1.0.jar.sha1 does not exist
DEBUG|main| 3529|RepositoryProxyConnectors:default - Checksum.sha1 Not Download: File: /export/home/build/data/continuum/checkouts/282/src/test/repositories/proxied1/org/apache/maven/test/get-default-layout/1.0/get-default-layout-1.0.jar.sha1 does not exist
DEBUG|main| 3529|RepositoryProxyConnectors:default - Retrieving org/apache/maven/test/get-default-layout/1.0/get-default-layout-1.0.jar.md5 from Proxied Repository 1 if updated
 WARN|main| 3529|RepositoryProxyConnectors:default - Resource does not exist: File: /export/home/build/data/continuum/checkouts/282/src/test/repositories/proxied1/org/apache/maven/test/get-default-layout/1.0/get-default-layout-1.0.jar.md5 does not exist
DEBUG|main| 3530|RepositoryProxyConnectors:default - Checksum.md5 Not Download: File: /export/home/build/data/continuum/checkouts/282/src/test/repositories/proxied1/org/apache/maven/test/get-default-layout/1.0/get-default-layout-1.0.jar.md5 does not exist
DEBUG|main| 3530|RepositoryProxyConnectors:default - Applying [checksum] policy with [fix]
 INFO|main| 3530|RepositoryProxyConnectors:default - Successfully transfered: /export/home/build/data/continuum/checkouts/282/target/test-repository/managed/org/apache/maven/test/get-default-layout/1.0/get-default-layout-1.0.jar
 INFO|main| 3531|Cache:url-failures-cache       - Disposing cache: [  name = cache status = STATUS_ALIVE eternal = false overflowToDisk = false maxElementsInMemory = 1000 maxElementsOnDisk = 0 memoryStoreEvictionPolicy = LRU timeToLiveSeconds = 1800 timeToIdleSeconds = 2700 diskPersistent = true diskExpiryThreadIntervalSeconds = 600 cacheEventListeners:  hitCount = 0 memoryStoreHitCount = 0 diskStoreHitCount = 0 missCountNotFound = 0 missCountExpired = 0 ]
DEBUG|main| 3572|Registry:commons-configuration - Creating a default configuration - no configuration was provided
DEBUG|main| 3608|CacheManager                   - Attempting to create an existing singleton. Existing singleton returned.
DEBUG|main| 3611|MemoryStore                    - Initialized net.sf.ehcache.store.LruMemoryStore for cache
DEBUG|main| 3611|LruMemoryStore                 - cache Cache: Using SpoolingLinkedHashMap implementation
DEBUG|main| 3611|Cache                          - Initialised cache: cache

.\ testGetChecksumTransferFailed() \._________________________________________

DEBUG|main| 3614|RepositoryProxyConnectors:default - Attempting connector: ProxyConnector[
  source:ArchivaRepository[default-managed-repository,file:/export/home/build/data/continuum/checkouts/282/target/test-repository/managed/]
  target:ArchivaRepository[badproxied,test://bad.machine.com/repo/]
  proxyId:null
  policy[releases]:ignored
  policy[snapshots]:ignored
  policy[cache-failures]:ignored
  policy[checksum]:ignored
]
DEBUG|main| 3614|RepositoryProxyConnectors:default - Using target repository: badproxied - layout: default - targetPath: org/apache/maven/test/get-checksum-sha1-only/1.0/get-checksum-sha1-only-1.0.jar
DEBUG|main| 3614|RepositoryProxyConnectors:default - Applying [releases] policy with [ignored]
DEBUG|main| 3614|PreDownloadPolicy:releases     - OK to update, releases policy set to IGNORED.
DEBUG|main| 3614|RepositoryProxyConnectors:default - Applying [snapshots] policy with [ignored]
DEBUG|main| 3614|PreDownloadPolicy:snapshots    - OK to update, snapshots policy set to IGNORED.
DEBUG|main| 3614|RepositoryProxyConnectors:default - Applying [cache-failures] policy with [ignored]
DEBUG|main| 3614|PreDownloadPolicy:cache-failures - OK to fetch, check-failures policy set to IGNORED.
DEBUG|main| 3615|RepositoryProxyConnectors:default - Retrieving org/apache/maven/test/get-checksum-sha1-only/1.0/get-checksum-sha1-only-1.0.jar from Bad Proxied if updated
DEBUG|main| 3615|Wagon:test                     - .getIfNewer(org/apache/maven/test/get-checksum-sha1-only/1.0/get-checksum-sha1-only-1.0.jar, /export/home/build/data/continuum/checkouts/282/target/test-repository/managed/org/apache/maven/test/get-checksum-sha1-only/1.0/get-checksum-sha1-only-1.0.jar.tmp, 0)
DEBUG|main| 3615|RepositoryProxyConnectors:default - Downloaded successfully.
DEBUG|main| 3616|RepositoryProxyConnectors:default - Retrieving org/apache/maven/test/get-checksum-sha1-only/1.0/get-checksum-sha1-only-1.0.jar.sha1 from Bad Proxied if updated
DEBUG|main| 3616|Wagon:test                     - .getIfNewer(org/apache/maven/test/get-checksum-sha1-only/1.0/get-checksum-sha1-only-1.0.jar.sha1, /export/home/build/data/continuum/checkouts/282/target/test-repository/managed/org/apache/maven/test/get-checksum-sha1-only/1.0/get-checksum-sha1-only-1.0.jar.sha1.tmp, 0)
DEBUG|main| 3616|RepositoryProxyConnectors:default - Downloaded successfully.
DEBUG|main| 3616|RepositoryProxyConnectors:default - Checksum.sha1 Downloaded: /export/home/build/data/continuum/checkouts/282/target/test-repository/managed/org/apache/maven/test/get-checksum-sha1-only/1.0/get-checksum-sha1-only-1.0.jar.sha1
DEBUG|main| 3616|RepositoryProxyConnectors:default - Retrieving org/apache/maven/test/get-checksum-sha1-only/1.0/get-checksum-sha1-only-1.0.jar.md5 from Bad Proxied if updated
DEBUG|main| 3616|Wagon:test                     - .getIfNewer(org/apache/maven/test/get-checksum-sha1-only/1.0/get-checksum-sha1-only-1.0.jar.md5, /export/home/build/data/continuum/checkouts/282/target/test-repository/managed/org/apache/maven/test/get-checksum-sha1-only/1.0/get-checksum-sha1-only-1.0.jar.md5.tmp, 0)
 WARN|main| 3616|RepositoryProxyConnectors:default - Download failure:transfer failed
org.apache.maven.wagon.TransferFailedException: transfer failed
	at org.easymock.MockControl$4.invoke(MockControl.java:150)
	at org.easymock.internal.ObjectMethodsFilter.invoke(ObjectMethodsFilter.java:44)
	at $Proxy2.getIfNewer(Unknown Source)
	at org.apache.maven.archiva.proxy.WagonDelegate.getIfNewer(WagonDelegate.java:66)
	at org.apache.maven.archiva.proxy.DefaultRepositoryProxyConnectors.transferSimpleFile(DefaultRepositoryProxyConnectors.java:463)
	at org.apache.maven.archiva.proxy.DefaultRepositoryProxyConnectors.transferChecksum(DefaultRepositoryProxyConnectors.java:420)
	at org.apache.maven.archiva.proxy.DefaultRepositoryProxyConnectors.transferFile(DefaultRepositoryProxyConnectors.java:360)
	at org.apache.maven.archiva.proxy.DefaultRepositoryProxyConnectors.fetchFromProxies(DefaultRepositoryProxyConnectors.java:150)
	at org.apache.maven.archiva.proxy.ChecksumTransferTest.testGetChecksumTransferFailed(ChecksumTransferTest.java:376)
	at sun.reflect.NativeMethodAccessorImpl.invoke0(Native Method)
	at sun.reflect.NativeMethodAccessorImpl.invoke(NativeMethodAccessorImpl.java:39)
	at sun.reflect.DelegatingMethodAccessorImpl.invoke(DelegatingMethodAccessorImpl.java:25)
	at java.lang.reflect.Method.invoke(Method.java:585)
	at junit.framework.TestCase.runTest(TestCase.java:154)
	at junit.framework.TestCase.runBare(TestCase.java:127)
	at junit.framework.TestResult$1.protect(TestResult.java:106)
	at junit.framework.TestResult.runProtected(TestResult.java:124)
	at junit.framework.TestResult.run(TestResult.java:109)
	at junit.framework.TestCase.run(TestCase.java:118)
	at junit.framework.TestSuite.runTest(TestSuite.java:208)
	at junit.framework.TestSuite.run(TestSuite.java:203)
	at sun.reflect.NativeMethodAccessorImpl.invoke0(Native Method)
	at sun.reflect.NativeMethodAccessorImpl.invoke(NativeMethodAccessorImpl.java:39)
	at sun.reflect.DelegatingMethodAccessorImpl.invoke(DelegatingMethodAccessorImpl.java:25)
	at java.lang.reflect.Method.invoke(Method.java:585)
	at org.apache.maven.surefire.junit.JUnitTestSet.execute(JUnitTestSet.java:210)
	at org.apache.maven.surefire.suite.AbstractDirectoryTestSuite.executeTestSet(AbstractDirectoryTestSuite.java:135)
	at org.apache.maven.surefire.suite.AbstractDirectoryTestSuite.execute(AbstractDirectoryTestSuite.java:122)
	at org.apache.maven.surefire.Surefire.run(Surefire.java:129)
	at sun.reflect.NativeMethodAccessorImpl.invoke0(Native Method)
	at sun.reflect.NativeMethodAccessorImpl.invoke(NativeMethodAccessorImpl.java:39)
	at sun.reflect.DelegatingMethodAccessorImpl.invoke(DelegatingMethodAccessorImpl.java:25)
	at java.lang.reflect.Method.invoke(Method.java:585)
	at org.apache.maven.surefire.booter.SurefireBooter.runSuitesInProcess(SurefireBooter.java:225)
	at org.apache.maven.surefire.booter.SurefireBooter.main(SurefireBooter.java:747)
 WARN|main| 3621|RepositoryProxyConnectors:default - Transfer failed on checksum: test://bad.machine.com/repo/org/apache/maven/test/get-checksum-sha1-only/1.0/get-checksum-sha1-only-1.0.jar : transfer failed
org.apache.maven.wagon.TransferFailedException: transfer failed
	at org.easymock.MockControl$4.invoke(MockControl.java:150)
	at org.easymock.internal.ObjectMethodsFilter.invoke(ObjectMethodsFilter.java:44)
	at $Proxy2.getIfNewer(Unknown Source)
	at org.apache.maven.archiva.proxy.WagonDelegate.getIfNewer(WagonDelegate.java:66)
	at org.apache.maven.archiva.proxy.DefaultRepositoryProxyConnectors.transferSimpleFile(DefaultRepositoryProxyConnectors.java:463)
	at org.apache.maven.archiva.proxy.DefaultRepositoryProxyConnectors.transferChecksum(DefaultRepositoryProxyConnectors.java:420)
	at org.apache.maven.archiva.proxy.DefaultRepositoryProxyConnectors.transferFile(DefaultRepositoryProxyConnectors.java:360)
	at org.apache.maven.archiva.proxy.DefaultRepositoryProxyConnectors.fetchFromProxies(DefaultRepositoryProxyConnectors.java:150)
	at org.apache.maven.archiva.proxy.ChecksumTransferTest.testGetChecksumTransferFailed(ChecksumTransferTest.java:376)
	at sun.reflect.NativeMethodAccessorImpl.invoke0(Native Method)
	at sun.reflect.NativeMethodAccessorImpl.invoke(NativeMethodAccessorImpl.java:39)
	at sun.reflect.DelegatingMethodAccessorImpl.invoke(DelegatingMethodAccessorImpl.java:25)
	at java.lang.reflect.Method.invoke(Method.java:585)
	at junit.framework.TestCase.runTest(TestCase.java:154)
	at junit.framework.TestCase.runBare(TestCase.java:127)
	at junit.framework.TestResult$1.protect(TestResult.java:106)
	at junit.framework.TestResult.runProtected(TestResult.java:124)
	at junit.framework.TestResult.run(TestResult.java:109)
	at junit.framework.TestCase.run(TestCase.java:118)
	at junit.framework.TestSuite.runTest(TestSuite.java:208)
	at junit.framework.TestSuite.run(TestSuite.java:203)
	at sun.reflect.NativeMethodAccessorImpl.invoke0(Native Method)
	at sun.reflect.NativeMethodAccessorImpl.invoke(NativeMethodAccessorImpl.java:39)
	at sun.reflect.DelegatingMethodAccessorImpl.invoke(DelegatingMethodAccessorImpl.java:25)
	at java.lang.reflect.Method.invoke(Method.java:585)
	at org.apache.maven.surefire.junit.JUnitTestSet.execute(JUnitTestSet.java:210)
	at org.apache.maven.surefire.suite.AbstractDirectoryTestSuite.executeTestSet(AbstractDirectoryTestSuite.java:135)
	at org.apache.maven.surefire.suite.AbstractDirectoryTestSuite.execute(AbstractDirectoryTestSuite.java:122)
	at org.apache.maven.surefire.Surefire.run(Surefire.java:129)
	at sun.reflect.NativeMethodAccessorImpl.invoke0(Native Method)
	at sun.reflect.NativeMethodAccessorImpl.invoke(NativeMethodAccessorImpl.java:39)
	at sun.reflect.DelegatingMethodAccessorImpl.invoke(DelegatingMethodAccessorImpl.java:25)
	at java.lang.reflect.Method.invoke(Method.java:585)
	at org.apache.maven.surefire.booter.SurefireBooter.runSuitesInProcess(SurefireBooter.java:225)
	at org.apache.maven.surefire.booter.SurefireBooter.main(SurefireBooter.java:747)
DEBUG|main| 3623|RepositoryProxyConnectors:default - Applying [checksum] policy with [ignored]
 INFO|main| 3623|RepositoryProxyConnectors:default - Successfully transfered: /export/home/build/data/continuum/checkouts/282/target/test-repository/managed/org/apache/maven/test/get-checksum-sha1-only/1.0/get-checksum-sha1-only-1.0.jar
 INFO|main| 3624|Cache:url-failures-cache       - Disposing cache: [  name = cache status = STATUS_ALIVE eternal = false overflowToDisk = false maxElementsInMemory = 1000 maxElementsOnDisk = 0 memoryStoreEvictionPolicy = LRU timeToLiveSeconds = 1800 timeToIdleSeconds = 2700 diskPersistent = true diskExpiryThreadIntervalSeconds = 600 cacheEventListeners:  hitCount = 0 memoryStoreHitCount = 0 diskStoreHitCount = 0 missCountNotFound = 0 missCountExpired = 0 ]
DEBUG|main| 3643|Registry:commons-configuration - Creating a default configuration - no configuration was provided
DEBUG|main| 3671|CacheManager                   - Attempting to create an existing singleton. Existing singleton returned.
DEBUG|main| 3672|MemoryStore                    - Initialized net.sf.ehcache.store.LruMemoryStore for cache
DEBUG|main| 3672|LruMemoryStore                 - cache Cache: Using SpoolingLinkedHashMap implementation
DEBUG|main| 3672|Cache                          - Initialised cache: cache

.\ testGetAlwaysBadChecksumPresentLocallyAbsentRemoteUsingIgnoredSetting() \._________________________________________

DEBUG|main| 3674|RepositoryProxyConnectors:default - Attempting connector: ProxyConnector[
  source:ArchivaRepository[default-managed-repository,file:/export/home/build/data/continuum/checkouts/282/target/test-repository/managed/]
  target:ArchivaRepository[proxied1,file:/export/home/build/data/continuum/checkouts/282/src/test/repositories/proxied1/]
  proxyId:null
  policy[releases]:ignored
  policy[snapshots]:ignored
  policy[cache-failures]:ignored
  policy[checksum]:ignored
]
DEBUG|main| 3675|RepositoryProxyConnectors:default - Using target repository: proxied1 - layout: default - targetPath: org/apache/maven/test/get-bad-local-checksum/1.0/get-bad-local-checksum-1.0.jar
DEBUG|main| 3675|RepositoryProxyConnectors:default - Applying [releases] policy with [ignored]
DEBUG|main| 3675|PreDownloadPolicy:releases     - OK to update, releases policy set to IGNORED.
DEBUG|main| 3675|RepositoryProxyConnectors:default - Applying [snapshots] policy with [ignored]
DEBUG|main| 3675|PreDownloadPolicy:snapshots    - OK to update, snapshots policy set to IGNORED.
DEBUG|main| 3675|RepositoryProxyConnectors:default - Applying [cache-failures] policy with [ignored]
DEBUG|main| 3675|PreDownloadPolicy:cache-failures - OK to fetch, check-failures policy set to IGNORED.
DEBUG|main| 3675|RepositoryProxyConnectors:default - Retrieving org/apache/maven/test/get-bad-local-checksum/1.0/get-bad-local-checksum-1.0.jar from Proxied Repository 1
DEBUG|main| 3698|RepositoryProxyConnectors:default - Downloaded successfully.
DEBUG|main| 3699|RepositoryProxyConnectors:default - Retrieving org/apache/maven/test/get-bad-local-checksum/1.0/get-bad-local-checksum-1.0.jar.sha1 from Proxied Repository 1
 WARN|main| 3699|RepositoryProxyConnectors:default - Resource does not exist: File: /export/home/build/data/continuum/checkouts/282/src/test/repositories/proxied1/org/apache/maven/test/get-bad-local-checksum/1.0/get-bad-local-checksum-1.0.jar.sha1 does not exist
DEBUG|main| 3699|RepositoryProxyConnectors:default - Checksum.sha1 Not Download: File: /export/home/build/data/continuum/checkouts/282/src/test/repositories/proxied1/org/apache/maven/test/get-bad-local-checksum/1.0/get-bad-local-checksum-1.0.jar.sha1 does not exist
DEBUG|main| 3700|RepositoryProxyConnectors:default - Retrieving org/apache/maven/test/get-bad-local-checksum/1.0/get-bad-local-checksum-1.0.jar.md5 from Proxied Repository 1
 WARN|main| 3700|RepositoryProxyConnectors:default - Resource does not exist: File: /export/home/build/data/continuum/checkouts/282/src/test/repositories/proxied1/org/apache/maven/test/get-bad-local-checksum/1.0/get-bad-local-checksum-1.0.jar.md5 does not exist
DEBUG|main| 3700|RepositoryProxyConnectors:default - Checksum.md5 Not Download: File: /export/home/build/data/continuum/checkouts/282/src/test/repositories/proxied1/org/apache/maven/test/get-bad-local-checksum/1.0/get-bad-local-checksum-1.0.jar.md5 does not exist
DEBUG|main| 3700|RepositoryProxyConnectors:default - Applying [checksum] policy with [ignored]
 INFO|main| 3700|RepositoryProxyConnectors:default - Successfully transfered: /export/home/build/data/continuum/checkouts/282/target/test-repository/managed/org/apache/maven/test/get-bad-local-checksum/1.0/get-bad-local-checksum-1.0.jar
 INFO|main| 3701|Cache:url-failures-cache       - Disposing cache: [  name = cache status = STATUS_ALIVE eternal = false overflowToDisk = false maxElementsInMemory = 1000 maxElementsOnDisk = 0 memoryStoreEvictionPolicy = LRU timeToLiveSeconds = 1800 timeToIdleSeconds = 2700 diskPersistent = true diskExpiryThreadIntervalSeconds = 600 cacheEventListeners:  hitCount = 0 memoryStoreHitCount = 0 diskStoreHitCount = 0 missCountNotFound = 0 missCountExpired = 0 ]
DEBUG|main| 3720|Registry:commons-configuration - Creating a default configuration - no configuration was provided
DEBUG|main| 3757|CacheManager                   - Attempting to create an existing singleton. Existing singleton returned.
DEBUG|main| 3757|MemoryStore                    - Initialized net.sf.ehcache.store.LruMemoryStore for cache
DEBUG|main| 3758|LruMemoryStore                 - cache Cache: Using SpoolingLinkedHashMap implementation
DEBUG|main| 3758|Cache                          - Initialised cache: cache

.\ testGetAlwaysBadChecksumPresentLocallyAbsentRemoteUsingFailSetting() \._________________________________________

DEBUG|main| 3760|RepositoryProxyConnectors:default - Attempting connector: ProxyConnector[
  source:ArchivaRepository[default-managed-repository,file:/export/home/build/data/continuum/checkouts/282/target/test-repository/managed/]
  target:ArchivaRepository[proxied1,file:/export/home/build/data/continuum/checkouts/282/src/test/repositories/proxied1/]
  proxyId:null
  policy[releases]:ignored
  policy[snapshots]:ignored
  policy[cache-failures]:ignored
  policy[checksum]:fail
]
DEBUG|main| 3760|RepositoryProxyConnectors:default - Using target repository: proxied1 - layout: default - targetPath: org/apache/maven/test/get-bad-local-checksum/1.0/get-bad-local-checksum-1.0.jar
DEBUG|main| 3760|RepositoryProxyConnectors:default - Applying [releases] policy with [ignored]
DEBUG|main| 3760|PreDownloadPolicy:releases     - OK to update, releases policy set to IGNORED.
DEBUG|main| 3760|RepositoryProxyConnectors:default - Applying [snapshots] policy with [ignored]
DEBUG|main| 3761|PreDownloadPolicy:snapshots    - OK to update, snapshots policy set to IGNORED.
DEBUG|main| 3761|RepositoryProxyConnectors:default - Applying [cache-failures] policy with [ignored]
DEBUG|main| 3761|PreDownloadPolicy:cache-failures - OK to fetch, check-failures policy set to IGNORED.
DEBUG|main| 3761|RepositoryProxyConnectors:default - Retrieving org/apache/maven/test/get-bad-local-checksum/1.0/get-bad-local-checksum-1.0.jar from Proxied Repository 1
DEBUG|main| 3763|RepositoryProxyConnectors:default - Downloaded successfully.
DEBUG|main| 3763|RepositoryProxyConnectors:default - Retrieving org/apache/maven/test/get-bad-local-checksum/1.0/get-bad-local-checksum-1.0.jar.sha1 from Proxied Repository 1
 WARN|main| 3763|RepositoryProxyConnectors:default - Resource does not exist: File: /export/home/build/data/continuum/checkouts/282/src/test/repositories/proxied1/org/apache/maven/test/get-bad-local-checksum/1.0/get-bad-local-checksum-1.0.jar.sha1 does not exist
DEBUG|main| 3763|RepositoryProxyConnectors:default - Checksum.sha1 Not Download: File: /export/home/build/data/continuum/checkouts/282/src/test/repositories/proxied1/org/apache/maven/test/get-bad-local-checksum/1.0/get-bad-local-checksum-1.0.jar.sha1 does not exist
DEBUG|main| 3763|RepositoryProxyConnectors:default - Retrieving org/apache/maven/test/get-bad-local-checksum/1.0/get-bad-local-checksum-1.0.jar.md5 from Proxied Repository 1
 WARN|main| 3763|RepositoryProxyConnectors:default - Resource does not exist: File: /export/home/build/data/continuum/checkouts/282/src/test/repositories/proxied1/org/apache/maven/test/get-bad-local-checksum/1.0/get-bad-local-checksum-1.0.jar.md5 does not exist
DEBUG|main| 3764|RepositoryProxyConnectors:default - Checksum.md5 Not Download: File: /export/home/build/data/continuum/checkouts/282/src/test/repositories/proxied1/org/apache/maven/test/get-bad-local-checksum/1.0/get-bad-local-checksum-1.0.jar.md5 does not exist
DEBUG|main| 3764|RepositoryProxyConnectors:default - Applying [checksum] policy with [fail]
DEBUG|main| 3764|PostDownloadPolicy:checksum    - Not valid checksum: /export/home/build/data/continuum/checkouts/282/target/test-repository/managed/org/apache/maven/test/get-bad-local-checksum/1.0/get-bad-local-checksum-1.0.jar.sha1
 WARN|main| 3765|PostDownloadPolicy:checksum    - SHA1 is incorrect for /export/home/build/data/continuum/checkouts/282/target/test-repository/managed/org/apache/maven/test/get-bad-local-checksum/1.0/get-bad-local-checksum-1.0.jar
DEBUG|main| 3765|PostDownloadPolicy:checksum    - Not valid checksum: /export/home/build/data/continuum/checkouts/282/target/test-repository/managed/org/apache/maven/test/get-bad-local-checksum/1.0/get-bad-local-checksum-1.0.jar.md5
 WARN|main| 3765|PostDownloadPolicy:checksum    - MD5 is incorrect for /export/home/build/data/continuum/checkouts/282/target/test-repository/managed/org/apache/maven/test/get-bad-local-checksum/1.0/get-bad-local-checksum-1.0.jar
DEBUG|main| 3766|RepositoryProxyConnectors:default - Didn't pass the [checksum] policy.
 INFO|main| 3766|RepositoryProxyConnectors:default - Failed post-download policies - /export/home/build/data/continuum/checkouts/282/target/test-repository/managed/org/apache/maven/test/get-bad-local-checksum/1.0/get-bad-local-checksum-1.0.jar
 INFO|main| 3766|Cache:url-failures-cache       - Disposing cache: [  name = cache status = STATUS_ALIVE eternal = false overflowToDisk = false maxElementsInMemory = 1000 maxElementsOnDisk = 0 memoryStoreEvictionPolicy = LRU timeToLiveSeconds = 1800 timeToIdleSeconds = 2700 diskPersistent = true diskExpiryThreadIntervalSeconds = 600 cacheEventListeners:  hitCount = 0 memoryStoreHitCount = 0 diskStoreHitCount = 0 missCountNotFound = 0 missCountExpired = 0 ]
DEBUG|main| 3785|Registry:commons-configuration - Creating a default configuration - no configuration was provided
DEBUG|main| 3812|CacheManager                   - Attempting to create an existing singleton. Existing singleton returned.
DEBUG|main| 3812|MemoryStore                    - Initialized net.sf.ehcache.store.LruMemoryStore for cache
DEBUG|main| 3813|LruMemoryStore                 - cache Cache: Using SpoolingLinkedHashMap implementation
DEBUG|main| 3813|Cache                          - Initialised cache: cache

.\ testGetAlwaysBadChecksumPresentLocallyAbsentRemoteUsingFixSetting() \._________________________________________

DEBUG|main| 3816|RepositoryProxyConnectors:default - Attempting connector: ProxyConnector[
  source:ArchivaRepository[default-managed-repository,file:/export/home/build/data/continuum/checkouts/282/target/test-repository/managed/]
  target:ArchivaRepository[proxied1,file:/export/home/build/data/continuum/checkouts/282/src/test/repositories/proxied1/]
  proxyId:null
  policy[releases]:ignored
  policy[snapshots]:ignored
  policy[cache-failures]:ignored
  policy[checksum]:fix
]
DEBUG|main| 3816|RepositoryProxyConnectors:default - Using target repository: proxied1 - layout: default - targetPath: org/apache/maven/test/get-bad-local-checksum/1.0/get-bad-local-checksum-1.0.jar
DEBUG|main| 3816|RepositoryProxyConnectors:default - Applying [releases] policy with [ignored]
DEBUG|main| 3816|PreDownloadPolicy:releases     - OK to update, releases policy set to IGNORED.
DEBUG|main| 3816|RepositoryProxyConnectors:default - Applying [snapshots] policy with [ignored]
DEBUG|main| 3816|PreDownloadPolicy:snapshots    - OK to update, snapshots policy set to IGNORED.
DEBUG|main| 3816|RepositoryProxyConnectors:default - Applying [cache-failures] policy with [ignored]
DEBUG|main| 3816|PreDownloadPolicy:cache-failures - OK to fetch, check-failures policy set to IGNORED.
DEBUG|main| 3817|RepositoryProxyConnectors:default - Retrieving org/apache/maven/test/get-bad-local-checksum/1.0/get-bad-local-checksum-1.0.jar from Proxied Repository 1
DEBUG|main| 3818|RepositoryProxyConnectors:default - Downloaded successfully.
DEBUG|main| 3818|RepositoryProxyConnectors:default - Retrieving org/apache/maven/test/get-bad-local-checksum/1.0/get-bad-local-checksum-1.0.jar.sha1 from Proxied Repository 1
 WARN|main| 3819|RepositoryProxyConnectors:default - Resource does not exist: File: /export/home/build/data/continuum/checkouts/282/src/test/repositories/proxied1/org/apache/maven/test/get-bad-local-checksum/1.0/get-bad-local-checksum-1.0.jar.sha1 does not exist
DEBUG|main| 3819|RepositoryProxyConnectors:default - Checksum.sha1 Not Download: File: /export/home/build/data/continuum/checkouts/282/src/test/repositories/proxied1/org/apache/maven/test/get-bad-local-checksum/1.0/get-bad-local-checksum-1.0.jar.sha1 does not exist
DEBUG|main| 3819|RepositoryProxyConnectors:default - Retrieving org/apache/maven/test/get-bad-local-checksum/1.0/get-bad-local-checksum-1.0.jar.md5 from Proxied Repository 1
 WARN|main| 3819|RepositoryProxyConnectors:default - Resource does not exist: File: /export/home/build/data/continuum/checkouts/282/src/test/repositories/proxied1/org/apache/maven/test/get-bad-local-checksum/1.0/get-bad-local-checksum-1.0.jar.md5 does not exist
DEBUG|main| 3819|RepositoryProxyConnectors:default - Checksum.md5 Not Download: File: /export/home/build/data/continuum/checkouts/282/src/test/repositories/proxied1/org/apache/maven/test/get-bad-local-checksum/1.0/get-bad-local-checksum-1.0.jar.md5 does not exist
DEBUG|main| 3819|RepositoryProxyConnectors:default - Applying [checksum] policy with [fix]
DEBUG|main| 3820|PostDownloadPolicy:checksum    - Not valid checksum: /export/home/build/data/continuum/checkouts/282/target/test-repository/managed/org/apache/maven/test/get-bad-local-checksum/1.0/get-bad-local-checksum-1.0.jar.sha1
DEBUG|main| 3821|PostDownloadPolicy:checksum    - Not valid checksum: /export/home/build/data/continuum/checkouts/282/target/test-repository/managed/org/apache/maven/test/get-bad-local-checksum/1.0/get-bad-local-checksum-1.0.jar.md5
 INFO|main| 3821|RepositoryProxyConnectors:default - Successfully transfered: /export/home/build/data/continuum/checkouts/282/target/test-repository/managed/org/apache/maven/test/get-bad-local-checksum/1.0/get-bad-local-checksum-1.0.jar
 INFO|main| 3822|Cache:url-failures-cache       - Disposing cache: [  name = cache status = STATUS_ALIVE eternal = false overflowToDisk = false maxElementsInMemory = 1000 maxElementsOnDisk = 0 memoryStoreEvictionPolicy = LRU timeToLiveSeconds = 1800 timeToIdleSeconds = 2700 diskPersistent = true diskExpiryThreadIntervalSeconds = 600 cacheEventListeners:  hitCount = 0 memoryStoreHitCount = 0 diskStoreHitCount = 0 missCountNotFound = 0 missCountExpired = 0 ]
Tests run: 18, Failures: 0, Errors: 0, Skipped: 0, Time elapsed: 1.375 sec
Running org.apache.maven.archiva.proxy.ManagedDefaultTransferTest
DEBUG|main| 3855|Registry:commons-configuration - Creating a default configuration - no configuration was provided
DEBUG|main| 3880|CacheManager                   - Attempting to create an existing singleton. Existing singleton returned.
DEBUG|main| 3881|MemoryStore                    - Initialized net.sf.ehcache.store.LruMemoryStore for cache
DEBUG|main| 3881|LruMemoryStore                 - cache Cache: Using SpoolingLinkedHashMap implementation
DEBUG|main| 3881|Cache                          - Initialised cache: cache

.\ testGetDefaultLayoutNotPresent() \._________________________________________

DEBUG|main| 3884|RepositoryProxyConnectors:default - Attempting connector: ProxyConnector[
  source:ArchivaRepository[default-managed-repository,file:/export/home/build/data/continuum/checkouts/282/target/test-repository/managed/]
  target:ArchivaRepository[proxied1,file:/export/home/build/data/continuum/checkouts/282/src/test/repositories/proxied1/]
  proxyId:null
  policy[releases]:once
  policy[snapshots]:once
  policy[cache-failures]:ignored
  policy[checksum]:fix
]
DEBUG|main| 3884|RepositoryProxyConnectors:default - Using target repository: proxied1 - layout: default - targetPath: org/apache/maven/test/get-default-layout/1.0/get-default-layout-1.0.jar
DEBUG|main| 3884|RepositoryProxyConnectors:default - Applying [releases] policy with [once]
DEBUG|main| 3884|PreDownloadPolicy:releases     - OK to update releases, local file does not exist.
DEBUG|main| 3884|RepositoryProxyConnectors:default - Applying [snapshots] policy with [once]
DEBUG|main| 3884|PreDownloadPolicy:snapshots    - OK to update, snapshot policy does not apply for non-snapshot versions.
DEBUG|main| 3884|RepositoryProxyConnectors:default - Applying [cache-failures] policy with [ignored]
DEBUG|main| 3884|PreDownloadPolicy:cache-failures - OK to fetch, check-failures policy set to IGNORED.
DEBUG|main| 3884|RepositoryProxyConnectors:default - Retrieving org/apache/maven/test/get-default-layout/1.0/get-default-layout-1.0.jar from Proxied Repository 1 if updated
DEBUG|main| 3885|RepositoryProxyConnectors:default - Downloaded successfully.
DEBUG|main| 3885|RepositoryProxyConnectors:default - Retrieving org/apache/maven/test/get-default-layout/1.0/get-default-layout-1.0.jar.sha1 from Proxied Repository 1
 WARN|main| 3885|RepositoryProxyConnectors:default - Resource does not exist: File: /export/home/build/data/continuum/checkouts/282/src/test/repositories/proxied1/org/apache/maven/test/get-default-layout/1.0/get-default-layout-1.0.jar.sha1 does not exist
DEBUG|main| 3885|RepositoryProxyConnectors:default - Checksum.sha1 Not Download: File: /export/home/build/data/continuum/checkouts/282/src/test/repositories/proxied1/org/apache/maven/test/get-default-layout/1.0/get-default-layout-1.0.jar.sha1 does not exist
DEBUG|main| 3886|RepositoryProxyConnectors:default - Retrieving org/apache/maven/test/get-default-layout/1.0/get-default-layout-1.0.jar.md5 from Proxied Repository 1
 WARN|main| 3886|RepositoryProxyConnectors:default - Resource does not exist: File: /export/home/build/data/continuum/checkouts/282/src/test/repositories/proxied1/org/apache/maven/test/get-default-layout/1.0/get-default-layout-1.0.jar.md5 does not exist
DEBUG|main| 3886|RepositoryProxyConnectors:default - Checksum.md5 Not Download: File: /export/home/build/data/continuum/checkouts/282/src/test/repositories/proxied1/org/apache/maven/test/get-default-layout/1.0/get-default-layout-1.0.jar.md5 does not exist
DEBUG|main| 3886|RepositoryProxyConnectors:default - Applying [checksum] policy with [fix]
DEBUG|main| 3886|PostDownloadPolicy:checksum    - Valid checksum: /export/home/build/data/continuum/checkouts/282/target/test-repository/managed/org/apache/maven/test/get-default-layout/1.0/get-default-layout-1.0.jar.sha1
DEBUG|main| 3887|PostDownloadPolicy:checksum    - Valid checksum: /export/home/build/data/continuum/checkouts/282/target/test-repository/managed/org/apache/maven/test/get-default-layout/1.0/get-default-layout-1.0.jar.md5
 INFO|main| 3888|RepositoryProxyConnectors:default - Successfully transfered: /export/home/build/data/continuum/checkouts/282/target/test-repository/managed/org/apache/maven/test/get-default-layout/1.0/get-default-layout-1.0.jar
 INFO|main| 3889|Cache:url-failures-cache       - Disposing cache: [  name = cache status = STATUS_ALIVE eternal = false overflowToDisk = false maxElementsInMemory = 1000 maxElementsOnDisk = 0 memoryStoreEvictionPolicy = LRU timeToLiveSeconds = 1800 timeToIdleSeconds = 2700 diskPersistent = true diskExpiryThreadIntervalSeconds = 600 cacheEventListeners:  hitCount = 0 memoryStoreHitCount = 0 diskStoreHitCount = 0 missCountNotFound = 0 missCountExpired = 0 ]
DEBUG|main| 3910|Registry:commons-configuration - Creating a default configuration - no configuration was provided
DEBUG|main| 3935|CacheManager                   - Attempting to create an existing singleton. Existing singleton returned.
DEBUG|main| 3935|MemoryStore                    - Initialized net.sf.ehcache.store.LruMemoryStore for cache
DEBUG|main| 3936|LruMemoryStore                 - cache Cache: Using SpoolingLinkedHashMap implementation
DEBUG|main| 3936|Cache                          - Initialised cache: cache

.\ testGetDefaultLayoutAlreadyPresentPolicyOnce() \._________________________________________

DEBUG|main| 3938|RepositoryProxyConnectors:default - Attempting connector: ProxyConnector[
  source:ArchivaRepository[default-managed-repository,file:/export/home/build/data/continuum/checkouts/282/target/test-repository/managed/]
  target:ArchivaRepository[proxied1,file:/export/home/build/data/continuum/checkouts/282/src/test/repositories/proxied1/]
  proxyId:null
  policy[releases]:once
  policy[snapshots]:once
  policy[cache-failures]:ignored
  policy[checksum]:fix
]
DEBUG|main| 3938|RepositoryProxyConnectors:default - Using target repository: proxied1 - layout: default - targetPath: org/apache/maven/test/get-default-layout-present/1.0/get-default-layout-present-1.0.jar
DEBUG|main| 3938|RepositoryProxyConnectors:default - Applying [releases] policy with [once]
DEBUG|main| 3938|PreDownloadPolicy:releases     - NO to updatereleases, local file exist (and policy is ONCE).
DEBUG|main| 3938|RepositoryProxyConnectors:default - Didn't pass the [releases] policy.
 INFO|main| 3938|RepositoryProxyConnectors:default - Failed pre-download policies - /export/home/build/data/continuum/checkouts/282/target/test-repository/managed/org/apache/maven/test/get-default-layout-present/1.0/get-default-layout-present-1.0.jar
 INFO|main| 3938|RepositoryProxyConnectors:default - Successfully transfered: /export/home/build/data/continuum/checkouts/282/target/test-repository/managed/org/apache/maven/test/get-default-layout-present/1.0/get-default-layout-present-1.0.jar
 INFO|main| 3939|Cache:url-failures-cache       - Disposing cache: [  name = cache status = STATUS_ALIVE eternal = false overflowToDisk = false maxElementsInMemory = 1000 maxElementsOnDisk = 0 memoryStoreEvictionPolicy = LRU timeToLiveSeconds = 1800 timeToIdleSeconds = 2700 diskPersistent = true diskExpiryThreadIntervalSeconds = 600 cacheEventListeners:  hitCount = 0 memoryStoreHitCount = 0 diskStoreHitCount = 0 missCountNotFound = 0 missCountExpired = 0 ]
DEBUG|main| 3956|Registry:commons-configuration - Creating a default configuration - no configuration was provided
DEBUG|main| 3983|CacheManager                   - Attempting to create an existing singleton. Existing singleton returned.
DEBUG|main| 3983|MemoryStore                    - Initialized net.sf.ehcache.store.LruMemoryStore for cache
DEBUG|main| 3983|LruMemoryStore                 - cache Cache: Using SpoolingLinkedHashMap implementation
DEBUG|main| 3984|Cache                          - Initialised cache: cache

.\ testGetDefaultLayoutAlreadyPresentPolicyIgnored() \._________________________________________

DEBUG|main| 3985|RepositoryProxyConnectors:default - Attempting connector: ProxyConnector[
  source:ArchivaRepository[default-managed-repository,file:/export/home/build/data/continuum/checkouts/282/target/test-repository/managed/]
  target:ArchivaRepository[proxied1,file:/export/home/build/data/continuum/checkouts/282/src/test/repositories/proxied1/]
  proxyId:null
  policy[releases]:ignored
  policy[snapshots]:ignored
  policy[cache-failures]:ignored
  policy[checksum]:fix
]
DEBUG|main| 3985|RepositoryProxyConnectors:default - Using target repository: proxied1 - layout: default - targetPath: org/apache/maven/test/get-default-layout-present/1.0/get-default-layout-present-1.0.jar
DEBUG|main| 3986|RepositoryProxyConnectors:default - Applying [releases] policy with [ignored]
DEBUG|main| 3986|PreDownloadPolicy:releases     - OK to update, releases policy set to IGNORED.
DEBUG|main| 3986|RepositoryProxyConnectors:default - Applying [snapshots] policy with [ignored]
DEBUG|main| 3986|PreDownloadPolicy:snapshots    - OK to update, snapshots policy set to IGNORED.
DEBUG|main| 3986|RepositoryProxyConnectors:default - Applying [cache-failures] policy with [ignored]
DEBUG|main| 3986|PreDownloadPolicy:cache-failures - OK to fetch, check-failures policy set to IGNORED.
DEBUG|main| 3986|RepositoryProxyConnectors:default - Retrieving org/apache/maven/test/get-default-layout-present/1.0/get-default-layout-present-1.0.jar from Proxied Repository 1
DEBUG|main| 3987|RepositoryProxyConnectors:default - Downloaded successfully.
DEBUG|main| 3988|RepositoryProxyConnectors:default - Retrieving org/apache/maven/test/get-default-layout-present/1.0/get-default-layout-present-1.0.jar.sha1 from Proxied Repository 1 if updated
 WARN|main| 3988|RepositoryProxyConnectors:default - Resource does not exist: File: /export/home/build/data/continuum/checkouts/282/src/test/repositories/proxied1/org/apache/maven/test/get-default-layout-present/1.0/get-default-layout-present-1.0.jar.sha1 does not exist
DEBUG|main| 3988|RepositoryProxyConnectors:default - Checksum.sha1 Not Download: File: /export/home/build/data/continuum/checkouts/282/src/test/repositories/proxied1/org/apache/maven/test/get-default-layout-present/1.0/get-default-layout-present-1.0.jar.sha1 does not exist
DEBUG|main| 3988|RepositoryProxyConnectors:default - Retrieving org/apache/maven/test/get-default-layout-present/1.0/get-default-layout-present-1.0.jar.md5 from Proxied Repository 1
 WARN|main| 3988|RepositoryProxyConnectors:default - Resource does not exist: File: /export/home/build/data/continuum/checkouts/282/src/test/repositories/proxied1/org/apache/maven/test/get-default-layout-present/1.0/get-default-layout-present-1.0.jar.md5 does not exist
DEBUG|main| 3988|RepositoryProxyConnectors:default - Checksum.md5 Not Download: File: /export/home/build/data/continuum/checkouts/282/src/test/repositories/proxied1/org/apache/maven/test/get-default-layout-present/1.0/get-default-layout-present-1.0.jar.md5 does not exist
DEBUG|main| 3988|RepositoryProxyConnectors:default - Applying [checksum] policy with [fix]
DEBUG|main| 3989|PostDownloadPolicy:checksum    - Not valid checksum: /export/home/build/data/continuum/checkouts/282/target/test-repository/managed/org/apache/maven/test/get-default-layout-present/1.0/get-default-layout-present-1.0.jar.md5
 INFO|main| 3990|RepositoryProxyConnectors:default - Successfully transfered: /export/home/build/data/continuum/checkouts/282/target/test-repository/managed/org/apache/maven/test/get-default-layout-present/1.0/get-default-layout-present-1.0.jar
 INFO|main| 3990|Cache:url-failures-cache       - Disposing cache: [  name = cache status = STATUS_ALIVE eternal = false overflowToDisk = false maxElementsInMemory = 1000 maxElementsOnDisk = 0 memoryStoreEvictionPolicy = LRU timeToLiveSeconds = 1800 timeToIdleSeconds = 2700 diskPersistent = true diskExpiryThreadIntervalSeconds = 600 cacheEventListeners:  hitCount = 0 memoryStoreHitCount = 0 diskStoreHitCount = 0 missCountNotFound = 0 missCountExpired = 0 ]
DEBUG|main| 4008|Registry:commons-configuration - Creating a default configuration - no configuration was provided
DEBUG|main| 4031|CacheManager                   - Attempting to create an existing singleton. Existing singleton returned.
DEBUG|main| 4031|MemoryStore                    - Initialized net.sf.ehcache.store.LruMemoryStore for cache
DEBUG|main| 4031|LruMemoryStore                 - cache Cache: Using SpoolingLinkedHashMap implementation
DEBUG|main| 4031|Cache                          - Initialised cache: cache

.\ testGetDefaultLayoutRemoteUpdate() \._________________________________________

DEBUG|main| 4033|RepositoryProxyConnectors:default - Attempting connector: ProxyConnector[
  source:ArchivaRepository[default-managed-repository,file:/export/home/build/data/continuum/checkouts/282/target/test-repository/managed/]
  target:ArchivaRepository[proxied1,file:/export/home/build/data/continuum/checkouts/282/src/test/repositories/proxied1/]
  proxyId:null
  policy[releases]:daily
  policy[snapshots]:daily
  policy[cache-failures]:ignored
  policy[checksum]:fix
]
DEBUG|main| 4034|RepositoryProxyConnectors:default - Using target repository: proxied1 - layout: default - targetPath: org/apache/maven/test/get-default-layout-present/1.0/get-default-layout-present-1.0.jar
DEBUG|main| 4034|RepositoryProxyConnectors:default - Applying [releases] policy with [daily]
DEBUG|main| 4034|RepositoryProxyConnectors:default - Applying [snapshots] policy with [daily]
DEBUG|main| 4034|PreDownloadPolicy:snapshots    - OK to update, snapshot policy does not apply for non-snapshot versions.
DEBUG|main| 4034|RepositoryProxyConnectors:default - Applying [cache-failures] policy with [ignored]
DEBUG|main| 4034|PreDownloadPolicy:cache-failures - OK to fetch, check-failures policy set to IGNORED.
DEBUG|main| 4034|RepositoryProxyConnectors:default - Retrieving org/apache/maven/test/get-default-layout-present/1.0/get-default-layout-present-1.0.jar from Proxied Repository 1
DEBUG|main| 4035|RepositoryProxyConnectors:default - Downloaded successfully.
DEBUG|main| 4035|RepositoryProxyConnectors:default - Retrieving org/apache/maven/test/get-default-layout-present/1.0/get-default-layout-present-1.0.jar.sha1 from Proxied Repository 1
 WARN|main| 4036|RepositoryProxyConnectors:default - Resource does not exist: File: /export/home/build/data/continuum/checkouts/282/src/test/repositories/proxied1/org/apache/maven/test/get-default-layout-present/1.0/get-default-layout-present-1.0.jar.sha1 does not exist
DEBUG|main| 4036|RepositoryProxyConnectors:default - Checksum.sha1 Not Download: File: /export/home/build/data/continuum/checkouts/282/src/test/repositories/proxied1/org/apache/maven/test/get-default-layout-present/1.0/get-default-layout-present-1.0.jar.sha1 does not exist
DEBUG|main| 4036|RepositoryProxyConnectors:default - Retrieving org/apache/maven/test/get-default-layout-present/1.0/get-default-layout-present-1.0.jar.md5 from Proxied Repository 1
 WARN|main| 4036|RepositoryProxyConnectors:default - Resource does not exist: File: /export/home/build/data/continuum/checkouts/282/src/test/repositories/proxied1/org/apache/maven/test/get-default-layout-present/1.0/get-default-layout-present-1.0.jar.md5 does not exist
DEBUG|main| 4036|RepositoryProxyConnectors:default - Checksum.md5 Not Download: File: /export/home/build/data/continuum/checkouts/282/src/test/repositories/proxied1/org/apache/maven/test/get-default-layout-present/1.0/get-default-layout-present-1.0.jar.md5 does not exist
DEBUG|main| 4036|RepositoryProxyConnectors:default - Applying [checksum] policy with [fix]
DEBUG|main| 4037|PostDownloadPolicy:checksum    - Valid checksum: /export/home/build/data/continuum/checkouts/282/target/test-repository/managed/org/apache/maven/test/get-default-layout-present/1.0/get-default-layout-present-1.0.jar.sha1
DEBUG|main| 4038|PostDownloadPolicy:checksum    - Not valid checksum: /export/home/build/data/continuum/checkouts/282/target/test-repository/managed/org/apache/maven/test/get-default-layout-present/1.0/get-default-layout-present-1.0.jar.md5
 INFO|main| 4038|RepositoryProxyConnectors:default - Successfully transfered: /export/home/build/data/continuum/checkouts/282/target/test-repository/managed/org/apache/maven/test/get-default-layout-present/1.0/get-default-layout-present-1.0.jar
 INFO|main| 4039|Cache:url-failures-cache       - Disposing cache: [  name = cache status = STATUS_ALIVE eternal = false overflowToDisk = false maxElementsInMemory = 1000 maxElementsOnDisk = 0 memoryStoreEvictionPolicy = LRU timeToLiveSeconds = 1800 timeToIdleSeconds = 2700 diskPersistent = true diskExpiryThreadIntervalSeconds = 600 cacheEventListeners:  hitCount = 0 memoryStoreHitCount = 0 diskStoreHitCount = 0 missCountNotFound = 0 missCountExpired = 0 ]
DEBUG|main| 4058|Registry:commons-configuration - Creating a default configuration - no configuration was provided
DEBUG|main| 4084|CacheManager                   - Attempting to create an existing singleton. Existing singleton returned.
DEBUG|main| 4084|MemoryStore                    - Initialized net.sf.ehcache.store.LruMemoryStore for cache
DEBUG|main| 4084|LruMemoryStore                 - cache Cache: Using SpoolingLinkedHashMap implementation
DEBUG|main| 4084|Cache                          - Initialised cache: cache

.\ testGetWhenInBothProxiedRepos() \._________________________________________

DEBUG|main| 4087|RepositoryProxyConnectors:default - Attempting connector: ProxyConnector[
  source:ArchivaRepository[default-managed-repository,file:/export/home/build/data/continuum/checkouts/282/target/test-repository/managed/]
  target:ArchivaRepository[proxied1,file:/export/home/build/data/continuum/checkouts/282/src/test/repositories/proxied1/]
  proxyId:null
  policy[releases]:ignored
  policy[snapshots]:ignored
  policy[cache-failures]:ignored
  policy[checksum]:fix
]
DEBUG|main| 4087|RepositoryProxyConnectors:default - Using target repository: proxied1 - layout: default - targetPath: org/apache/maven/test/get-in-both-proxies/1.0/get-in-both-proxies-1.0.jar
DEBUG|main| 4088|RepositoryProxyConnectors:default - Applying [releases] policy with [ignored]
DEBUG|main| 4088|PreDownloadPolicy:releases     - OK to update, releases policy set to IGNORED.
DEBUG|main| 4088|RepositoryProxyConnectors:default - Applying [snapshots] policy with [ignored]
DEBUG|main| 4088|PreDownloadPolicy:snapshots    - OK to update, snapshots policy set to IGNORED.
DEBUG|main| 4088|RepositoryProxyConnectors:default - Applying [cache-failures] policy with [ignored]
DEBUG|main| 4088|PreDownloadPolicy:cache-failures - OK to fetch, check-failures policy set to IGNORED.
DEBUG|main| 4088|RepositoryProxyConnectors:default - Retrieving org/apache/maven/test/get-in-both-proxies/1.0/get-in-both-proxies-1.0.jar from Proxied Repository 1 if updated
DEBUG|main| 4090|RepositoryProxyConnectors:default - Downloaded successfully.
DEBUG|main| 4090|RepositoryProxyConnectors:default - Retrieving org/apache/maven/test/get-in-both-proxies/1.0/get-in-both-proxies-1.0.jar.sha1 from Proxied Repository 1 if updated
 WARN|main| 4090|RepositoryProxyConnectors:default - Resource does not exist: File: /export/home/build/data/continuum/checkouts/282/src/test/repositories/proxied1/org/apache/maven/test/get-in-both-proxies/1.0/get-in-both-proxies-1.0.jar.sha1 does not exist
DEBUG|main| 4090|RepositoryProxyConnectors:default - Checksum.sha1 Not Download: File: /export/home/build/data/continuum/checkouts/282/src/test/repositories/proxied1/org/apache/maven/test/get-in-both-proxies/1.0/get-in-both-proxies-1.0.jar.sha1 does not exist
DEBUG|main| 4090|RepositoryProxyConnectors:default - Retrieving org/apache/maven/test/get-in-both-proxies/1.0/get-in-both-proxies-1.0.jar.md5 from Proxied Repository 1 if updated
 WARN|main| 4091|RepositoryProxyConnectors:default - Resource does not exist: File: /export/home/build/data/continuum/checkouts/282/src/test/repositories/proxied1/org/apache/maven/test/get-in-both-proxies/1.0/get-in-both-proxies-1.0.jar.md5 does not exist
DEBUG|main| 4091|RepositoryProxyConnectors:default - Checksum.md5 Not Download: File: /export/home/build/data/continuum/checkouts/282/src/test/repositories/proxied1/org/apache/maven/test/get-in-both-proxies/1.0/get-in-both-proxies-1.0.jar.md5 does not exist
DEBUG|main| 4091|RepositoryProxyConnectors:default - Applying [checksum] policy with [fix]
 INFO|main| 4091|RepositoryProxyConnectors:default - Successfully transfered: /export/home/build/data/continuum/checkouts/282/target/test-repository/managed/org/apache/maven/test/get-in-both-proxies/1.0/get-in-both-proxies-1.0.jar
 INFO|main| 4146|Cache:url-failures-cache       - Disposing cache: [  name = cache status = STATUS_ALIVE eternal = false overflowToDisk = false maxElementsInMemory = 1000 maxElementsOnDisk = 0 memoryStoreEvictionPolicy = LRU timeToLiveSeconds = 1800 timeToIdleSeconds = 2700 diskPersistent = true diskExpiryThreadIntervalSeconds = 600 cacheEventListeners:  hitCount = 0 memoryStoreHitCount = 0 diskStoreHitCount = 0 missCountNotFound = 0 missCountExpired = 0 ]
DEBUG|main| 4164|Registry:commons-configuration - Creating a default configuration - no configuration was provided
DEBUG|main| 4188|CacheManager                   - Attempting to create an existing singleton. Existing singleton returned.
DEBUG|main| 4189|MemoryStore                    - Initialized net.sf.ehcache.store.LruMemoryStore for cache
DEBUG|main| 4189|LruMemoryStore                 - cache Cache: Using SpoolingLinkedHashMap implementation
DEBUG|main| 4189|Cache                          - Initialised cache: cache

.\ testGetInSecondProxiedRepo() \._________________________________________

DEBUG|main| 4192|RepositoryProxyConnectors:default - Attempting connector: ProxyConnector[
  source:ArchivaRepository[default-managed-repository,file:/export/home/build/data/continuum/checkouts/282/target/test-repository/managed/]
  target:ArchivaRepository[proxied1,file:/export/home/build/data/continuum/checkouts/282/src/test/repositories/proxied1/]
  proxyId:null
  policy[releases]:ignored
  policy[snapshots]:ignored
  policy[cache-failures]:ignored
  policy[checksum]:fix
]
DEBUG|main| 4192|RepositoryProxyConnectors:default - Using target repository: proxied1 - layout: default - targetPath: org/apache/maven/test/get-in-second-proxy/1.0/get-in-second-proxy-1.0.jar
DEBUG|main| 4192|RepositoryProxyConnectors:default - Applying [releases] policy with [ignored]
DEBUG|main| 4192|PreDownloadPolicy:releases     - OK to update, releases policy set to IGNORED.
DEBUG|main| 4192|RepositoryProxyConnectors:default - Applying [snapshots] policy with [ignored]
DEBUG|main| 4192|PreDownloadPolicy:snapshots    - OK to update, snapshots policy set to IGNORED.
DEBUG|main| 4192|RepositoryProxyConnectors:default - Applying [cache-failures] policy with [ignored]
DEBUG|main| 4192|PreDownloadPolicy:cache-failures - OK to fetch, check-failures policy set to IGNORED.
DEBUG|main| 4192|RepositoryProxyConnectors:default - Retrieving org/apache/maven/test/get-in-second-proxy/1.0/get-in-second-proxy-1.0.jar from Proxied Repository 1 if updated
 WARN|main| 4192|RepositoryProxyConnectors:default - Resource does not exist: File: /export/home/build/data/continuum/checkouts/282/src/test/repositories/proxied1/org/apache/maven/test/get-in-second-proxy/1.0/get-in-second-proxy-1.0.jar does not exist
DEBUG|main| 4192|RepositoryProxyConnectors:default - Attempting connector: ProxyConnector[
  source:ArchivaRepository[default-managed-repository,file:/export/home/build/data/continuum/checkouts/282/target/test-repository/managed/]
  target:ArchivaRepository[proxied2,file:/export/home/build/data/continuum/checkouts/282/src/test/repositories/proxied2/]
  proxyId:null
  policy[releases]:ignored
  policy[snapshots]:ignored
  policy[cache-failures]:ignored
  policy[checksum]:fix
]
DEBUG|main| 4193|RepositoryProxyConnectors:default - Using target repository: proxied2 - layout: default - targetPath: org/apache/maven/test/get-in-second-proxy/1.0/get-in-second-proxy-1.0.jar
DEBUG|main| 4193|RepositoryProxyConnectors:default - Applying [releases] policy with [ignored]
DEBUG|main| 4193|PreDownloadPolicy:releases     - OK to update, releases policy set to IGNORED.
DEBUG|main| 4193|RepositoryProxyConnectors:default - Applying [snapshots] policy with [ignored]
DEBUG|main| 4193|PreDownloadPolicy:snapshots    - OK to update, snapshots policy set to IGNORED.
DEBUG|main| 4193|RepositoryProxyConnectors:default - Applying [cache-failures] policy with [ignored]
DEBUG|main| 4193|PreDownloadPolicy:cache-failures - OK to fetch, check-failures policy set to IGNORED.
DEBUG|main| 4193|RepositoryProxyConnectors:default - Retrieving org/apache/maven/test/get-in-second-proxy/1.0/get-in-second-proxy-1.0.jar from Proxied Repository 2 if updated
DEBUG|main| 4194|RepositoryProxyConnectors:default - Downloaded successfully.
DEBUG|main| 4196|RepositoryProxyConnectors:default - Retrieving org/apache/maven/test/get-in-second-proxy/1.0/get-in-second-proxy-1.0.jar.sha1 from Proxied Repository 2
 WARN|main| 4197|RepositoryProxyConnectors:default - Resource does not exist: File: /export/home/build/data/continuum/checkouts/282/src/test/repositories/proxied2/org/apache/maven/test/get-in-second-proxy/1.0/get-in-second-proxy-1.0.jar.sha1 does not exist
DEBUG|main| 4197|RepositoryProxyConnectors:default - Checksum.sha1 Not Download: File: /export/home/build/data/continuum/checkouts/282/src/test/repositories/proxied2/org/apache/maven/test/get-in-second-proxy/1.0/get-in-second-proxy-1.0.jar.sha1 does not exist
DEBUG|main| 4197|RepositoryProxyConnectors:default - Retrieving org/apache/maven/test/get-in-second-proxy/1.0/get-in-second-proxy-1.0.jar.md5 from Proxied Repository 2
 WARN|main| 4197|RepositoryProxyConnectors:default - Resource does not exist: File: /export/home/build/data/continuum/checkouts/282/src/test/repositories/proxied2/org/apache/maven/test/get-in-second-proxy/1.0/get-in-second-proxy-1.0.jar.md5 does not exist
DEBUG|main| 4197|RepositoryProxyConnectors:default - Checksum.md5 Not Download: File: /export/home/build/data/continuum/checkouts/282/src/test/repositories/proxied2/org/apache/maven/test/get-in-second-proxy/1.0/get-in-second-proxy-1.0.jar.md5 does not exist
DEBUG|main| 4198|RepositoryProxyConnectors:default - Applying [checksum] policy with [fix]
DEBUG|main| 4198|PostDownloadPolicy:checksum    - Valid checksum: /export/home/build/data/continuum/checkouts/282/target/test-repository/managed/org/apache/maven/test/get-in-second-proxy/1.0/get-in-second-proxy-1.0.jar.sha1
DEBUG|main| 4200|PostDownloadPolicy:checksum    - Valid checksum: /export/home/build/data/continuum/checkouts/282/target/test-repository/managed/org/apache/maven/test/get-in-second-proxy/1.0/get-in-second-proxy-1.0.jar.md5
 INFO|main| 4200|RepositoryProxyConnectors:default - Successfully transfered: /export/home/build/data/continuum/checkouts/282/target/test-repository/managed/org/apache/maven/test/get-in-second-proxy/1.0/get-in-second-proxy-1.0.jar
 INFO|main| 4201|Cache:url-failures-cache       - Disposing cache: [  name = cache status = STATUS_ALIVE eternal = false overflowToDisk = false maxElementsInMemory = 1000 maxElementsOnDisk = 0 memoryStoreEvictionPolicy = LRU timeToLiveSeconds = 1800 timeToIdleSeconds = 2700 diskPersistent = true diskExpiryThreadIntervalSeconds = 600 cacheEventListeners:  hitCount = 0 memoryStoreHitCount = 0 diskStoreHitCount = 0 missCountNotFound = 0 missCountExpired = 0 ]
DEBUG|main| 4218|Registry:commons-configuration - Creating a default configuration - no configuration was provided
DEBUG|main| 4247|CacheManager                   - Attempting to create an existing singleton. Existing singleton returned.
DEBUG|main| 4247|MemoryStore                    - Initialized net.sf.ehcache.store.LruMemoryStore for cache
DEBUG|main| 4248|LruMemoryStore                 - cache Cache: Using SpoolingLinkedHashMap implementation
DEBUG|main| 4248|Cache                          - Initialised cache: cache

.\ testNotFoundInAnyProxies() \._________________________________________

DEBUG|main| 4250|RepositoryProxyConnectors:default - Attempting connector: ProxyConnector[
  source:ArchivaRepository[default-managed-repository,file:/export/home/build/data/continuum/checkouts/282/target/test-repository/managed/]
  target:ArchivaRepository[proxied1,file:/export/home/build/data/continuum/checkouts/282/src/test/repositories/proxied1/]
  proxyId:null
  policy[releases]:ignored
  policy[snapshots]:ignored
  policy[cache-failures]:ignored
  policy[checksum]:fix
]
DEBUG|main| 4250|RepositoryProxyConnectors:default - Using target repository: proxied1 - layout: default - targetPath: org/apache/maven/test/does-not-exist/1.0/does-not-exist-1.0.jar
DEBUG|main| 4250|RepositoryProxyConnectors:default - Applying [releases] policy with [ignored]
DEBUG|main| 4250|PreDownloadPolicy:releases     - OK to update, releases policy set to IGNORED.
DEBUG|main| 4251|RepositoryProxyConnectors:default - Applying [snapshots] policy with [ignored]
DEBUG|main| 4251|PreDownloadPolicy:snapshots    - OK to update, snapshots policy set to IGNORED.
DEBUG|main| 4251|RepositoryProxyConnectors:default - Applying [cache-failures] policy with [ignored]
DEBUG|main| 4251|PreDownloadPolicy:cache-failures - OK to fetch, check-failures policy set to IGNORED.
DEBUG|main| 4251|RepositoryProxyConnectors:default - Retrieving org/apache/maven/test/does-not-exist/1.0/does-not-exist-1.0.jar from Proxied Repository 1 if updated
 WARN|main| 4251|RepositoryProxyConnectors:default - Resource does not exist: File: /export/home/build/data/continuum/checkouts/282/src/test/repositories/proxied1/org/apache/maven/test/does-not-exist/1.0/does-not-exist-1.0.jar does not exist
DEBUG|main| 4251|RepositoryProxyConnectors:default - Attempting connector: ProxyConnector[
  source:ArchivaRepository[default-managed-repository,file:/export/home/build/data/continuum/checkouts/282/target/test-repository/managed/]
  target:ArchivaRepository[proxied2,file:/export/home/build/data/continuum/checkouts/282/src/test/repositories/proxied2/]
  proxyId:null
  policy[releases]:ignored
  policy[snapshots]:ignored
  policy[cache-failures]:ignored
  policy[checksum]:fix
]
DEBUG|main| 4251|RepositoryProxyConnectors:default - Using target repository: proxied2 - layout: default - targetPath: org/apache/maven/test/does-not-exist/1.0/does-not-exist-1.0.jar
DEBUG|main| 4251|RepositoryProxyConnectors:default - Applying [releases] policy with [ignored]
DEBUG|main| 4251|PreDownloadPolicy:releases     - OK to update, releases policy set to IGNORED.
DEBUG|main| 4251|RepositoryProxyConnectors:default - Applying [snapshots] policy with [ignored]
DEBUG|main| 4251|PreDownloadPolicy:snapshots    - OK to update, snapshots policy set to IGNORED.
DEBUG|main| 4252|RepositoryProxyConnectors:default - Applying [cache-failures] policy with [ignored]
DEBUG|main| 4252|PreDownloadPolicy:cache-failures - OK to fetch, check-failures policy set to IGNORED.
DEBUG|main| 4252|RepositoryProxyConnectors:default - Retrieving org/apache/maven/test/does-not-exist/1.0/does-not-exist-1.0.jar from Proxied Repository 2 if updated
 WARN|main| 4252|RepositoryProxyConnectors:default - Resource does not exist: File: /export/home/build/data/continuum/checkouts/282/src/test/repositories/proxied2/org/apache/maven/test/does-not-exist/1.0/does-not-exist-1.0.jar does not exist
DEBUG|main| 4252|RepositoryProxyConnectors:default - Attempting connector: ProxyConnector[
  source:ArchivaRepository[default-managed-repository,file:/export/home/build/data/continuum/checkouts/282/target/test-repository/managed/]
  target:ArchivaRepository[legacy-proxied,file:/export/home/build/data/continuum/checkouts/282/src/test/repositories/legacy-proxied/]
  proxyId:null
  policy[releases]:ignored
  policy[snapshots]:ignored
  policy[cache-failures]:ignored
  policy[checksum]:fix
]
DEBUG|main| 4252|RepositoryProxyConnectors:default - Using target repository: legacy-proxied - layout: legacy - targetPath: org.apache.maven.test/jars/does-not-exist-1.0.jar
DEBUG|main| 4252|RepositoryProxyConnectors:default - Applying [releases] policy with [ignored]
DEBUG|main| 4252|PreDownloadPolicy:releases     - OK to update, releases policy set to IGNORED.
DEBUG|main| 4252|RepositoryProxyConnectors:default - Applying [snapshots] policy with [ignored]
DEBUG|main| 4252|PreDownloadPolicy:snapshots    - OK to update, snapshots policy set to IGNORED.
DEBUG|main| 4252|RepositoryProxyConnectors:default - Applying [cache-failures] policy with [ignored]
DEBUG|main| 4253|PreDownloadPolicy:cache-failures - OK to fetch, check-failures policy set to IGNORED.
DEBUG|main| 4253|RepositoryProxyConnectors:default - Retrieving org.apache.maven.test/jars/does-not-exist-1.0.jar from Proxied Legacy Repository if updated
 WARN|main| 4253|RepositoryProxyConnectors:default - Resource does not exist: File: /export/home/build/data/continuum/checkouts/282/src/test/repositories/legacy-proxied/org.apache.maven.test/jars/does-not-exist-1.0.jar does not exist
 INFO|main| 4253|Cache:url-failures-cache       - Disposing cache: [  name = cache status = STATUS_ALIVE eternal = false overflowToDisk = false maxElementsInMemory = 1000 maxElementsOnDisk = 0 memoryStoreEvictionPolicy = LRU timeToLiveSeconds = 1800 timeToIdleSeconds = 2700 diskPersistent = true diskExpiryThreadIntervalSeconds = 600 cacheEventListeners:  hitCount = 0 memoryStoreHitCount = 0 diskStoreHitCount = 0 missCountNotFound = 0 missCountExpired = 0 ]
DEBUG|main| 4271|Registry:commons-configuration - Creating a default configuration - no configuration was provided
DEBUG|main| 4301|CacheManager                   - Attempting to create an existing singleton. Existing singleton returned.
DEBUG|main| 4301|MemoryStore                    - Initialized net.sf.ehcache.store.LruMemoryStore for cache
DEBUG|main| 4302|LruMemoryStore                 - cache Cache: Using SpoolingLinkedHashMap implementation
DEBUG|main| 4302|Cache                          - Initialised cache: cache

.\ testGetInSecondProxiedRepoFirstFails() \._________________________________________

DEBUG|main| 4304|RepositoryProxyConnectors:default - Attempting connector: ProxyConnector[
  source:ArchivaRepository[default-managed-repository,file:/export/home/build/data/continuum/checkouts/282/target/test-repository/managed/]
  target:ArchivaRepository[badproxied,test://bad.machine.com/repo/]
  proxyId:null
  policy[releases]:ignored
  policy[snapshots]:ignored
  policy[cache-failures]:ignored
  policy[checksum]:fix
]
DEBUG|main| 4304|RepositoryProxyConnectors:default - Using target repository: badproxied - layout: default - targetPath: org/apache/maven/test/get-in-second-proxy/1.0/get-in-second-proxy-1.0.jar
DEBUG|main| 4305|RepositoryProxyConnectors:default - Applying [releases] policy with [ignored]
DEBUG|main| 4305|PreDownloadPolicy:releases     - OK to update, releases policy set to IGNORED.
DEBUG|main| 4305|RepositoryProxyConnectors:default - Applying [snapshots] policy with [ignored]
DEBUG|main| 4305|PreDownloadPolicy:snapshots    - OK to update, snapshots policy set to IGNORED.
DEBUG|main| 4305|RepositoryProxyConnectors:default - Applying [cache-failures] policy with [ignored]
DEBUG|main| 4305|PreDownloadPolicy:cache-failures - OK to fetch, check-failures policy set to IGNORED.
DEBUG|main| 4306|RepositoryProxyConnectors:default - Retrieving org/apache/maven/test/get-in-second-proxy/1.0/get-in-second-proxy-1.0.jar from Bad Proxied if updated
DEBUG|main| 4306|Wagon:test                     - .getIfNewer(org/apache/maven/test/get-in-second-proxy/1.0/get-in-second-proxy-1.0.jar, /export/home/build/data/continuum/checkouts/282/target/test-repository/managed/org/apache/maven/test/get-in-second-proxy/1.0/get-in-second-proxy-1.0.jar.tmp, 0)
 WARN|main| 4306|RepositoryProxyConnectors:default - Download failure:transfer failed
org.apache.maven.wagon.TransferFailedException: transfer failed
	at org.easymock.MockControl$4.invoke(MockControl.java:150)
	at org.easymock.internal.ObjectMethodsFilter.invoke(ObjectMethodsFilter.java:44)
	at $Proxy2.getIfNewer(Unknown Source)
	at org.apache.maven.archiva.proxy.WagonDelegate.getIfNewer(WagonDelegate.java:66)
	at org.apache.maven.archiva.proxy.DefaultRepositoryProxyConnectors.transferSimpleFile(DefaultRepositoryProxyConnectors.java:463)
	at org.apache.maven.archiva.proxy.DefaultRepositoryProxyConnectors.transferFile(DefaultRepositoryProxyConnectors.java:357)
	at org.apache.maven.archiva.proxy.DefaultRepositoryProxyConnectors.fetchFromProxies(DefaultRepositoryProxyConnectors.java:150)
	at org.apache.maven.archiva.proxy.ManagedDefaultTransferTest.testGetInSecondProxiedRepoFirstFails(ManagedDefaultTransferTest.java:278)
	at sun.reflect.NativeMethodAccessorImpl.invoke0(Native Method)
	at sun.reflect.NativeMethodAccessorImpl.invoke(NativeMethodAccessorImpl.java:39)
	at sun.reflect.DelegatingMethodAccessorImpl.invoke(DelegatingMethodAccessorImpl.java:25)
	at java.lang.reflect.Method.invoke(Method.java:585)
	at junit.framework.TestCase.runTest(TestCase.java:154)
	at junit.framework.TestCase.runBare(TestCase.java:127)
	at junit.framework.TestResult$1.protect(TestResult.java:106)
	at junit.framework.TestResult.runProtected(TestResult.java:124)
	at junit.framework.TestResult.run(TestResult.java:109)
	at junit.framework.TestCase.run(TestCase.java:118)
	at junit.framework.TestSuite.runTest(TestSuite.java:208)
	at junit.framework.TestSuite.run(TestSuite.java:203)
	at sun.reflect.NativeMethodAccessorImpl.invoke0(Native Method)
	at sun.reflect.NativeMethodAccessorImpl.invoke(NativeMethodAccessorImpl.java:39)
	at sun.reflect.DelegatingMethodAccessorImpl.invoke(DelegatingMethodAccessorImpl.java:25)
	at java.lang.reflect.Method.invoke(Method.java:585)
	at org.apache.maven.surefire.junit.JUnitTestSet.execute(JUnitTestSet.java:210)
	at org.apache.maven.surefire.suite.AbstractDirectoryTestSuite.executeTestSet(AbstractDirectoryTestSuite.java:135)
	at org.apache.maven.surefire.suite.AbstractDirectoryTestSuite.execute(AbstractDirectoryTestSuite.java:122)
	at org.apache.maven.surefire.Surefire.run(Surefire.java:129)
	at sun.reflect.NativeMethodAccessorImpl.invoke0(Native Method)
	at sun.reflect.NativeMethodAccessorImpl.invoke(NativeMethodAccessorImpl.java:39)
	at sun.reflect.DelegatingMethodAccessorImpl.invoke(DelegatingMethodAccessorImpl.java:25)
	at java.lang.reflect.Method.invoke(Method.java:585)
	at org.apache.maven.surefire.booter.SurefireBooter.runSuitesInProcess(SurefireBooter.java:225)
	at org.apache.maven.surefire.booter.SurefireBooter.main(SurefireBooter.java:747)
DEBUG|main| 4307|RepositoryProxyConnectors:default - Attempting connector: ProxyConnector[
  source:ArchivaRepository[default-managed-repository,file:/export/home/build/data/continuum/checkouts/282/target/test-repository/managed/]
  target:ArchivaRepository[proxied2,file:/export/home/build/data/continuum/checkouts/282/src/test/repositories/proxied2/]
  proxyId:null
  policy[releases]:ignored
  policy[snapshots]:ignored
  policy[cache-failures]:ignored
  policy[checksum]:fix
]
DEBUG|main| 4308|RepositoryProxyConnectors:default - Using target repository: proxied2 - layout: default - targetPath: org/apache/maven/test/get-in-second-proxy/1.0/get-in-second-proxy-1.0.jar
DEBUG|main| 4308|RepositoryProxyConnectors:default - Applying [releases] policy with [ignored]
DEBUG|main| 4308|PreDownloadPolicy:releases     - OK to update, releases policy set to IGNORED.
DEBUG|main| 4308|RepositoryProxyConnectors:default - Applying [snapshots] policy with [ignored]
DEBUG|main| 4308|PreDownloadPolicy:snapshots    - OK to update, snapshots policy set to IGNORED.
DEBUG|main| 4308|RepositoryProxyConnectors:default - Applying [cache-failures] policy with [ignored]
DEBUG|main| 4308|PreDownloadPolicy:cache-failures - OK to fetch, check-failures policy set to IGNORED.
DEBUG|main| 4308|RepositoryProxyConnectors:default - Retrieving org/apache/maven/test/get-in-second-proxy/1.0/get-in-second-proxy-1.0.jar from Proxied Repository 2 if updated
DEBUG|main| 4309|RepositoryProxyConnectors:default - Downloaded successfully.
DEBUG|main| 4309|RepositoryProxyConnectors:default - Retrieving org/apache/maven/test/get-in-second-proxy/1.0/get-in-second-proxy-1.0.jar.sha1 from Proxied Repository 2
 WARN|main| 4309|RepositoryProxyConnectors:default - Resource does not exist: File: /export/home/build/data/continuum/checkouts/282/src/test/repositories/proxied2/org/apache/maven/test/get-in-second-proxy/1.0/get-in-second-proxy-1.0.jar.sha1 does not exist
DEBUG|main| 4310|RepositoryProxyConnectors:default - Checksum.sha1 Not Download: File: /export/home/build/data/continuum/checkouts/282/src/test/repositories/proxied2/org/apache/maven/test/get-in-second-proxy/1.0/get-in-second-proxy-1.0.jar.sha1 does not exist
DEBUG|main| 4310|RepositoryProxyConnectors:default - Retrieving org/apache/maven/test/get-in-second-proxy/1.0/get-in-second-proxy-1.0.jar.md5 from Proxied Repository 2
 WARN|main| 4310|RepositoryProxyConnectors:default - Resource does not exist: File: /export/home/build/data/continuum/checkouts/282/src/test/repositories/proxied2/org/apache/maven/test/get-in-second-proxy/1.0/get-in-second-proxy-1.0.jar.md5 does not exist
DEBUG|main| 4310|RepositoryProxyConnectors:default - Checksum.md5 Not Download: File: /export/home/build/data/continuum/checkouts/282/src/test/repositories/proxied2/org/apache/maven/test/get-in-second-proxy/1.0/get-in-second-proxy-1.0.jar.md5 does not exist
DEBUG|main| 4310|RepositoryProxyConnectors:default - Applying [checksum] policy with [fix]
DEBUG|main| 4310|PostDownloadPolicy:checksum    - Valid checksum: /export/home/build/data/continuum/checkouts/282/target/test-repository/managed/org/apache/maven/test/get-in-second-proxy/1.0/get-in-second-proxy-1.0.jar.sha1
DEBUG|main| 4311|PostDownloadPolicy:checksum    - Valid checksum: /export/home/build/data/continuum/checkouts/282/target/test-repository/managed/org/apache/maven/test/get-in-second-proxy/1.0/get-in-second-proxy-1.0.jar.md5
 INFO|main| 4311|RepositoryProxyConnectors:default - Successfully transfered: /export/home/build/data/continuum/checkouts/282/target/test-repository/managed/org/apache/maven/test/get-in-second-proxy/1.0/get-in-second-proxy-1.0.jar
 INFO|main| 4312|Cache:url-failures-cache       - Disposing cache: [  name = cache status = STATUS_ALIVE eternal = false overflowToDisk = false maxElementsInMemory = 1000 maxElementsOnDisk = 0 memoryStoreEvictionPolicy = LRU timeToLiveSeconds = 1800 timeToIdleSeconds = 2700 diskPersistent = true diskExpiryThreadIntervalSeconds = 600 cacheEventListeners:  hitCount = 0 memoryStoreHitCount = 0 diskStoreHitCount = 0 missCountNotFound = 0 missCountExpired = 0 ]
DEBUG|main| 4330|Registry:commons-configuration - Creating a default configuration - no configuration was provided
DEBUG|main| 4399|CacheManager                   - Attempting to create an existing singleton. Existing singleton returned.
DEBUG|main| 4400|MemoryStore                    - Initialized net.sf.ehcache.store.LruMemoryStore for cache
DEBUG|main| 4400|LruMemoryStore                 - cache Cache: Using SpoolingLinkedHashMap implementation
DEBUG|main| 4400|Cache                          - Initialised cache: cache

.\ testGetAllRepositoriesFail() \._________________________________________

DEBUG|main| 4402|RepositoryProxyConnectors:default - Attempting connector: ProxyConnector[
  source:ArchivaRepository[default-managed-repository,file:/export/home/build/data/continuum/checkouts/282/target/test-repository/managed/]
  target:ArchivaRepository[badproxied1,test://bad.machine.com/repo/]
  proxyId:null
  policy[releases]:ignored
  policy[snapshots]:ignored
  policy[cache-failures]:ignored
  policy[checksum]:fix
]
DEBUG|main| 4402|RepositoryProxyConnectors:default - Using target repository: badproxied1 - layout: default - targetPath: org/apache/maven/test/get-in-second-proxy/1.0/get-in-second-proxy-1.0.jar
DEBUG|main| 4402|RepositoryProxyConnectors:default - Applying [releases] policy with [ignored]
DEBUG|main| 4402|PreDownloadPolicy:releases     - OK to update, releases policy set to IGNORED.
DEBUG|main| 4402|RepositoryProxyConnectors:default - Applying [snapshots] policy with [ignored]
DEBUG|main| 4403|PreDownloadPolicy:snapshots    - OK to update, snapshots policy set to IGNORED.
DEBUG|main| 4403|RepositoryProxyConnectors:default - Applying [cache-failures] policy with [ignored]
DEBUG|main| 4403|PreDownloadPolicy:cache-failures - OK to fetch, check-failures policy set to IGNORED.
DEBUG|main| 4403|RepositoryProxyConnectors:default - Retrieving org/apache/maven/test/get-in-second-proxy/1.0/get-in-second-proxy-1.0.jar from Bad Proxied 1 if updated
DEBUG|main| 4403|Wagon:test                     - .getIfNewer(org/apache/maven/test/get-in-second-proxy/1.0/get-in-second-proxy-1.0.jar, /export/home/build/data/continuum/checkouts/282/target/test-repository/managed/org/apache/maven/test/get-in-second-proxy/1.0/get-in-second-proxy-1.0.jar.tmp, 0)
 WARN|main| 4403|RepositoryProxyConnectors:default - Download failure:transfer failed
org.apache.maven.wagon.TransferFailedException: transfer failed
	at org.easymock.MockControl$4.invoke(MockControl.java:150)
	at org.easymock.internal.ObjectMethodsFilter.invoke(ObjectMethodsFilter.java:44)
	at $Proxy2.getIfNewer(Unknown Source)
	at org.apache.maven.archiva.proxy.WagonDelegate.getIfNewer(WagonDelegate.java:66)
	at org.apache.maven.archiva.proxy.DefaultRepositoryProxyConnectors.transferSimpleFile(DefaultRepositoryProxyConnectors.java:463)
	at org.apache.maven.archiva.proxy.DefaultRepositoryProxyConnectors.transferFile(DefaultRepositoryProxyConnectors.java:357)
	at org.apache.maven.archiva.proxy.DefaultRepositoryProxyConnectors.fetchFromProxies(DefaultRepositoryProxyConnectors.java:150)
	at org.apache.maven.archiva.proxy.ManagedDefaultTransferTest.testGetAllRepositoriesFail(ManagedDefaultTransferTest.java:315)
	at sun.reflect.NativeMethodAccessorImpl.invoke0(Native Method)
	at sun.reflect.NativeMethodAccessorImpl.invoke(NativeMethodAccessorImpl.java:39)
	at sun.reflect.DelegatingMethodAccessorImpl.invoke(DelegatingMethodAccessorImpl.java:25)
	at java.lang.reflect.Method.invoke(Method.java:585)
	at junit.framework.TestCase.runTest(TestCase.java:154)
	at junit.framework.TestCase.runBare(TestCase.java:127)
	at junit.framework.TestResult$1.protect(TestResult.java:106)
	at junit.framework.TestResult.runProtected(TestResult.java:124)
	at junit.framework.TestResult.run(TestResult.java:109)
	at junit.framework.TestCase.run(TestCase.java:118)
	at junit.framework.TestSuite.runTest(TestSuite.java:208)
	at junit.framework.TestSuite.run(TestSuite.java:203)
	at sun.reflect.NativeMethodAccessorImpl.invoke0(Native Method)
	at sun.reflect.NativeMethodAccessorImpl.invoke(NativeMethodAccessorImpl.java:39)
	at sun.reflect.DelegatingMethodAccessorImpl.invoke(DelegatingMethodAccessorImpl.java:25)
	at java.lang.reflect.Method.invoke(Method.java:585)
	at org.apache.maven.surefire.junit.JUnitTestSet.execute(JUnitTestSet.java:210)
	at org.apache.maven.surefire.suite.AbstractDirectoryTestSuite.executeTestSet(AbstractDirectoryTestSuite.java:135)
	at org.apache.maven.surefire.suite.AbstractDirectoryTestSuite.execute(AbstractDirectoryTestSuite.java:122)
	at org.apache.maven.surefire.Surefire.run(Surefire.java:129)
	at sun.reflect.NativeMethodAccessorImpl.invoke0(Native Method)
	at sun.reflect.NativeMethodAccessorImpl.invoke(NativeMethodAccessorImpl.java:39)
	at sun.reflect.DelegatingMethodAccessorImpl.invoke(DelegatingMethodAccessorImpl.java:25)
	at java.lang.reflect.Method.invoke(Method.java:585)
	at org.apache.maven.surefire.booter.SurefireBooter.runSuitesInProcess(SurefireBooter.java:225)
	at org.apache.maven.surefire.booter.SurefireBooter.main(SurefireBooter.java:747)
DEBUG|main| 4404|RepositoryProxyConnectors:default - Attempting connector: ProxyConnector[
  source:ArchivaRepository[default-managed-repository,file:/export/home/build/data/continuum/checkouts/282/target/test-repository/managed/]
  target:ArchivaRepository[badproxied2,test://dead.machine.com/repo/]
  proxyId:null
  policy[releases]:ignored
  policy[snapshots]:ignored
  policy[cache-failures]:ignored
  policy[checksum]:fix
]
DEBUG|main| 4404|RepositoryProxyConnectors:default - Using target repository: badproxied2 - layout: default - targetPath: org/apache/maven/test/get-in-second-proxy/1.0/get-in-second-proxy-1.0.jar
DEBUG|main| 4404|RepositoryProxyConnectors:default - Applying [releases] policy with [ignored]
DEBUG|main| 4404|PreDownloadPolicy:releases     - OK to update, releases policy set to IGNORED.
DEBUG|main| 4404|RepositoryProxyConnectors:default - Applying [snapshots] policy with [ignored]
DEBUG|main| 4404|PreDownloadPolicy:snapshots    - OK to update, snapshots policy set to IGNORED.
DEBUG|main| 4404|RepositoryProxyConnectors:default - Applying [cache-failures] policy with [ignored]
DEBUG|main| 4405|PreDownloadPolicy:cache-failures - OK to fetch, check-failures policy set to IGNORED.
DEBUG|main| 4405|RepositoryProxyConnectors:default - Retrieving org/apache/maven/test/get-in-second-proxy/1.0/get-in-second-proxy-1.0.jar from Bad Proxied 2 if updated
DEBUG|main| 4405|Wagon:test                     - .getIfNewer(org/apache/maven/test/get-in-second-proxy/1.0/get-in-second-proxy-1.0.jar, /export/home/build/data/continuum/checkouts/282/target/test-repository/managed/org/apache/maven/test/get-in-second-proxy/1.0/get-in-second-proxy-1.0.jar.tmp, 0)
 WARN|main| 4405|RepositoryProxyConnectors:default - Download failure:transfer failed
org.apache.maven.wagon.TransferFailedException: transfer failed
	at org.easymock.MockControl$4.invoke(MockControl.java:150)
	at org.easymock.internal.ObjectMethodsFilter.invoke(ObjectMethodsFilter.java:44)
	at $Proxy2.getIfNewer(Unknown Source)
	at org.apache.maven.archiva.proxy.WagonDelegate.getIfNewer(WagonDelegate.java:66)
	at org.apache.maven.archiva.proxy.DefaultRepositoryProxyConnectors.transferSimpleFile(DefaultRepositoryProxyConnectors.java:463)
	at org.apache.maven.archiva.proxy.DefaultRepositoryProxyConnectors.transferFile(DefaultRepositoryProxyConnectors.java:357)
	at org.apache.maven.archiva.proxy.DefaultRepositoryProxyConnectors.fetchFromProxies(DefaultRepositoryProxyConnectors.java:150)
	at org.apache.maven.archiva.proxy.ManagedDefaultTransferTest.testGetAllRepositoriesFail(ManagedDefaultTransferTest.java:315)
	at sun.reflect.NativeMethodAccessorImpl.invoke0(Native Method)
	at sun.reflect.NativeMethodAccessorImpl.invoke(NativeMethodAccessorImpl.java:39)
	at sun.reflect.DelegatingMethodAccessorImpl.invoke(DelegatingMethodAccessorImpl.java:25)
	at java.lang.reflect.Method.invoke(Method.java:585)
	at junit.framework.TestCase.runTest(TestCase.java:154)
	at junit.framework.TestCase.runBare(TestCase.java:127)
	at junit.framework.TestResult$1.protect(TestResult.java:106)
	at junit.framework.TestResult.runProtected(TestResult.java:124)
	at junit.framework.TestResult.run(TestResult.java:109)
	at junit.framework.TestCase.run(TestCase.java:118)
	at junit.framework.TestSuite.runTest(TestSuite.java:208)
	at junit.framework.TestSuite.run(TestSuite.java:203)
	at sun.reflect.NativeMethodAccessorImpl.invoke0(Native Method)
	at sun.reflect.NativeMethodAccessorImpl.invoke(NativeMethodAccessorImpl.java:39)
	at sun.reflect.DelegatingMethodAccessorImpl.invoke(DelegatingMethodAccessorImpl.java:25)
	at java.lang.reflect.Method.invoke(Method.java:585)
	at org.apache.maven.surefire.junit.JUnitTestSet.execute(JUnitTestSet.java:210)
	at org.apache.maven.surefire.suite.AbstractDirectoryTestSuite.executeTestSet(AbstractDirectoryTestSuite.java:135)
	at org.apache.maven.surefire.suite.AbstractDirectoryTestSuite.execute(AbstractDirectoryTestSuite.java:122)
	at org.apache.maven.surefire.Surefire.run(Surefire.java:129)
	at sun.reflect.NativeMethodAccessorImpl.invoke0(Native Method)
	at sun.reflect.NativeMethodAccessorImpl.invoke(NativeMethodAccessorImpl.java:39)
	at sun.reflect.DelegatingMethodAccessorImpl.invoke(DelegatingMethodAccessorImpl.java:25)
	at java.lang.reflect.Method.invoke(Method.java:585)
	at org.apache.maven.surefire.booter.SurefireBooter.runSuitesInProcess(SurefireBooter.java:225)
	at org.apache.maven.surefire.booter.SurefireBooter.main(SurefireBooter.java:747)
 INFO|main| 4406|Cache:url-failures-cache       - Disposing cache: [  name = cache status = STATUS_ALIVE eternal = false overflowToDisk = false maxElementsInMemory = 1000 maxElementsOnDisk = 0 memoryStoreEvictionPolicy = LRU timeToLiveSeconds = 1800 timeToIdleSeconds = 2700 diskPersistent = true diskExpiryThreadIntervalSeconds = 600 cacheEventListeners:  hitCount = 0 memoryStoreHitCount = 0 diskStoreHitCount = 0 missCountNotFound = 0 missCountExpired = 0 ]
DEBUG|main| 4424|Registry:commons-configuration - Creating a default configuration - no configuration was provided
DEBUG|main| 4446|CacheManager                   - Attempting to create an existing singleton. Existing singleton returned.
DEBUG|main| 4446|MemoryStore                    - Initialized net.sf.ehcache.store.LruMemoryStore for cache
DEBUG|main| 4446|LruMemoryStore                 - cache Cache: Using SpoolingLinkedHashMap implementation
DEBUG|main| 4447|Cache                          - Initialised cache: cache

.\ testLegacyProxyRepoGetAlreadyPresent() \._________________________________________

DEBUG|main| 4449|RepositoryProxyConnectors:default - Attempting connector: ProxyConnector[
  source:ArchivaRepository[default-managed-repository,file:/export/home/build/data/continuum/checkouts/282/target/test-repository/managed/]
  target:ArchivaRepository[legacy-proxied,file:/export/home/build/data/continuum/checkouts/282/src/test/repositories/legacy-proxied/]
  proxyId:null
  policy[releases]:ignored
  policy[snapshots]:ignored
  policy[cache-failures]:ignored
  policy[checksum]:ignored
]
DEBUG|main| 4449|RepositoryProxyConnectors:default - Using target repository: legacy-proxied - layout: legacy - targetPath: org.apache.maven.test/jars/get-default-layout-present-1.0.jar
DEBUG|main| 4449|RepositoryProxyConnectors:default - Applying [releases] policy with [ignored]
DEBUG|main| 4449|PreDownloadPolicy:releases     - OK to update, releases policy set to IGNORED.
DEBUG|main| 4449|RepositoryProxyConnectors:default - Applying [snapshots] policy with [ignored]
DEBUG|main| 4450|PreDownloadPolicy:snapshots    - OK to update, snapshots policy set to IGNORED.
DEBUG|main| 4450|RepositoryProxyConnectors:default - Applying [cache-failures] policy with [ignored]
DEBUG|main| 4450|PreDownloadPolicy:cache-failures - OK to fetch, check-failures policy set to IGNORED.
DEBUG|main| 4450|RepositoryProxyConnectors:default - Retrieving org.apache.maven.test/jars/get-default-layout-present-1.0.jar from Proxied Legacy Repository
DEBUG|main| 4451|RepositoryProxyConnectors:default - Downloaded successfully.
DEBUG|main| 4451|RepositoryProxyConnectors:default - Retrieving org.apache.maven.test/jars/get-default-layout-present-1.0.jar.sha1 from Proxied Legacy Repository
 WARN|main| 4451|RepositoryProxyConnectors:default - Resource does not exist: File: /export/home/build/data/continuum/checkouts/282/src/test/repositories/legacy-proxied/org.apache.maven.test/jars/get-default-layout-present-1.0.jar.sha1 does not exist
DEBUG|main| 4451|RepositoryProxyConnectors:default - Checksum.sha1 Not Download: File: /export/home/build/data/continuum/checkouts/282/src/test/repositories/legacy-proxied/org.apache.maven.test/jars/get-default-layout-present-1.0.jar.sha1 does not exist
DEBUG|main| 4451|RepositoryProxyConnectors:default - Retrieving org.apache.maven.test/jars/get-default-layout-present-1.0.jar.md5 from Proxied Legacy Repository
 WARN|main| 4451|RepositoryProxyConnectors:default - Resource does not exist: File: /export/home/build/data/continuum/checkouts/282/src/test/repositories/legacy-proxied/org.apache.maven.test/jars/get-default-layout-present-1.0.jar.md5 does not exist
DEBUG|main| 4451|RepositoryProxyConnectors:default - Checksum.md5 Not Download: File: /export/home/build/data/continuum/checkouts/282/src/test/repositories/legacy-proxied/org.apache.maven.test/jars/get-default-layout-present-1.0.jar.md5 does not exist
DEBUG|main| 4452|RepositoryProxyConnectors:default - Applying [checksum] policy with [ignored]
 INFO|main| 4452|RepositoryProxyConnectors:default - Successfully transfered: /export/home/build/data/continuum/checkouts/282/target/test-repository/managed/org/apache/maven/test/get-default-layout-present/1.0/get-default-layout-present-1.0.jar
 INFO|main| 4452|Cache:url-failures-cache       - Disposing cache: [  name = cache status = STATUS_ALIVE eternal = false overflowToDisk = false maxElementsInMemory = 1000 maxElementsOnDisk = 0 memoryStoreEvictionPolicy = LRU timeToLiveSeconds = 1800 timeToIdleSeconds = 2700 diskPersistent = true diskExpiryThreadIntervalSeconds = 600 cacheEventListeners:  hitCount = 0 memoryStoreHitCount = 0 diskStoreHitCount = 0 missCountNotFound = 0 missCountExpired = 0 ]
DEBUG|main| 4470|Registry:commons-configuration - Creating a default configuration - no configuration was provided
DEBUG|main| 4493|CacheManager                   - Attempting to create an existing singleton. Existing singleton returned.
DEBUG|main| 4493|MemoryStore                    - Initialized net.sf.ehcache.store.LruMemoryStore for cache
DEBUG|main| 4493|LruMemoryStore                 - cache Cache: Using SpoolingLinkedHashMap implementation
DEBUG|main| 4493|Cache                          - Initialised cache: cache

.\ testLegacyRequestConvertedToDefaultPathInManagedRepo() \._________________________________________

DEBUG|main| 4495|RepositoryProxyConnectors:default - Attempting connector: ProxyConnector[
  source:ArchivaRepository[default-managed-repository,file:/export/home/build/data/continuum/checkouts/282/target/test-repository/managed/]
  target:ArchivaRepository[legacy-proxied,file:/export/home/build/data/continuum/checkouts/282/src/test/repositories/legacy-proxied/]
  proxyId:null
  policy[releases]:ignored
  policy[snapshots]:ignored
  policy[cache-failures]:ignored
  policy[checksum]:ignored
]
DEBUG|main| 4495|RepositoryProxyConnectors:default - Using target repository: legacy-proxied - layout: legacy - targetPath: org.apache.maven.test/jars/get-default-layout-present-1.0.jar
DEBUG|main| 4495|RepositoryProxyConnectors:default - Applying [releases] policy with [ignored]
DEBUG|main| 4495|PreDownloadPolicy:releases     - OK to update, releases policy set to IGNORED.
DEBUG|main| 4495|RepositoryProxyConnectors:default - Applying [snapshots] policy with [ignored]
DEBUG|main| 4495|PreDownloadPolicy:snapshots    - OK to update, snapshots policy set to IGNORED.
DEBUG|main| 4495|RepositoryProxyConnectors:default - Applying [cache-failures] policy with [ignored]
DEBUG|main| 4495|PreDownloadPolicy:cache-failures - OK to fetch, check-failures policy set to IGNORED.
DEBUG|main| 4495|RepositoryProxyConnectors:default - Retrieving org.apache.maven.test/jars/get-default-layout-present-1.0.jar from Proxied Legacy Repository if updated
DEBUG|main| 4496|RepositoryProxyConnectors:default - Downloaded successfully.
DEBUG|main| 4496|RepositoryProxyConnectors:default - Retrieving org.apache.maven.test/jars/get-default-layout-present-1.0.jar.sha1 from Proxied Legacy Repository
 WARN|main| 4496|RepositoryProxyConnectors:default - Resource does not exist: File: /export/home/build/data/continuum/checkouts/282/src/test/repositories/legacy-proxied/org.apache.maven.test/jars/get-default-layout-present-1.0.jar.sha1 does not exist
DEBUG|main| 4497|RepositoryProxyConnectors:default - Checksum.sha1 Not Download: File: /export/home/build/data/continuum/checkouts/282/src/test/repositories/legacy-proxied/org.apache.maven.test/jars/get-default-layout-present-1.0.jar.sha1 does not exist
DEBUG|main| 4497|RepositoryProxyConnectors:default - Retrieving org.apache.maven.test/jars/get-default-layout-present-1.0.jar.md5 from Proxied Legacy Repository
 WARN|main| 4497|RepositoryProxyConnectors:default - Resource does not exist: File: /export/home/build/data/continuum/checkouts/282/src/test/repositories/legacy-proxied/org.apache.maven.test/jars/get-default-layout-present-1.0.jar.md5 does not exist
DEBUG|main| 4497|RepositoryProxyConnectors:default - Checksum.md5 Not Download: File: /export/home/build/data/continuum/checkouts/282/src/test/repositories/legacy-proxied/org.apache.maven.test/jars/get-default-layout-present-1.0.jar.md5 does not exist
DEBUG|main| 4497|RepositoryProxyConnectors:default - Applying [checksum] policy with [ignored]
 INFO|main| 4497|RepositoryProxyConnectors:default - Successfully transfered: /export/home/build/data/continuum/checkouts/282/target/test-repository/managed/org/apache/maven/test/get-default-layout-present/1.0/get-default-layout-present-1.0.jar
 INFO|main| 4498|Cache:url-failures-cache       - Disposing cache: [  name = cache status = STATUS_ALIVE eternal = false overflowToDisk = false maxElementsInMemory = 1000 maxElementsOnDisk = 0 memoryStoreEvictionPolicy = LRU timeToLiveSeconds = 1800 timeToIdleSeconds = 2700 diskPersistent = true diskExpiryThreadIntervalSeconds = 600 cacheEventListeners:  hitCount = 0 memoryStoreHitCount = 0 diskStoreHitCount = 0 missCountNotFound = 0 missCountExpired = 0 ]
DEBUG|main| 4517|Registry:commons-configuration - Creating a default configuration - no configuration was provided
DEBUG|main| 4542|CacheManager                   - Attempting to create an existing singleton. Existing singleton returned.
DEBUG|main| 4542|MemoryStore                    - Initialized net.sf.ehcache.store.LruMemoryStore for cache
DEBUG|main| 4543|LruMemoryStore                 - cache Cache: Using SpoolingLinkedHashMap implementation
DEBUG|main| 4543|Cache                          - Initialised cache: cache

.\ testLegacyProxyRepoGetNotPresent() \._________________________________________

DEBUG|main| 4544|RepositoryProxyConnectors:default - Attempting connector: ProxyConnector[
  source:ArchivaRepository[default-managed-repository,file:/export/home/build/data/continuum/checkouts/282/target/test-repository/managed/]
  target:ArchivaRepository[legacy-proxied,file:/export/home/build/data/continuum/checkouts/282/src/test/repositories/legacy-proxied/]
  proxyId:null
  policy[releases]:ignored
  policy[snapshots]:ignored
  policy[cache-failures]:ignored
  policy[checksum]:ignored
]
DEBUG|main| 4544|RepositoryProxyConnectors:default - Using target repository: legacy-proxied - layout: legacy - targetPath: org.apache.maven.test/jars/get-default-layout-1.0.jar
DEBUG|main| 4545|RepositoryProxyConnectors:default - Applying [releases] policy with [ignored]
DEBUG|main| 4545|PreDownloadPolicy:releases     - OK to update, releases policy set to IGNORED.
DEBUG|main| 4545|RepositoryProxyConnectors:default - Applying [snapshots] policy with [ignored]
DEBUG|main| 4545|PreDownloadPolicy:snapshots    - OK to update, snapshots policy set to IGNORED.
DEBUG|main| 4545|RepositoryProxyConnectors:default - Applying [cache-failures] policy with [ignored]
DEBUG|main| 4545|PreDownloadPolicy:cache-failures - OK to fetch, check-failures policy set to IGNORED.
DEBUG|main| 4545|RepositoryProxyConnectors:default - Retrieving org.apache.maven.test/jars/get-default-layout-1.0.jar from Proxied Legacy Repository if updated
DEBUG|main| 4545|RepositoryProxyConnectors:default - Downloaded successfully.
DEBUG|main| 4547|RepositoryProxyConnectors:default - Retrieving org.apache.maven.test/jars/get-default-layout-1.0.jar.sha1 from Proxied Legacy Repository
 WARN|main| 4547|RepositoryProxyConnectors:default - Resource does not exist: File: /export/home/build/data/continuum/checkouts/282/src/test/repositories/legacy-proxied/org.apache.maven.test/jars/get-default-layout-1.0.jar.sha1 does not exist
DEBUG|main| 4547|RepositoryProxyConnectors:default - Checksum.sha1 Not Download: File: /export/home/build/data/continuum/checkouts/282/src/test/repositories/legacy-proxied/org.apache.maven.test/jars/get-default-layout-1.0.jar.sha1 does not exist
DEBUG|main| 4547|RepositoryProxyConnectors:default - Retrieving org.apache.maven.test/jars/get-default-layout-1.0.jar.md5 from Proxied Legacy Repository
 WARN|main| 4548|RepositoryProxyConnectors:default - Resource does not exist: File: /export/home/build/data/continuum/checkouts/282/src/test/repositories/legacy-proxied/org.apache.maven.test/jars/get-default-layout-1.0.jar.md5 does not exist
DEBUG|main| 4548|RepositoryProxyConnectors:default - Checksum.md5 Not Download: File: /export/home/build/data/continuum/checkouts/282/src/test/repositories/legacy-proxied/org.apache.maven.test/jars/get-default-layout-1.0.jar.md5 does not exist
DEBUG|main| 4548|RepositoryProxyConnectors:default - Applying [checksum] policy with [ignored]
 INFO|main| 4548|RepositoryProxyConnectors:default - Successfully transfered: /export/home/build/data/continuum/checkouts/282/target/test-repository/managed/org/apache/maven/test/get-default-layout/1.0/get-default-layout-1.0.jar
 INFO|main| 4548|Cache:url-failures-cache       - Disposing cache: [  name = cache status = STATUS_ALIVE eternal = false overflowToDisk = false maxElementsInMemory = 1000 maxElementsOnDisk = 0 memoryStoreEvictionPolicy = LRU timeToLiveSeconds = 1800 timeToIdleSeconds = 2700 diskPersistent = true diskExpiryThreadIntervalSeconds = 600 cacheEventListeners:  hitCount = 0 memoryStoreHitCount = 0 diskStoreHitCount = 0 missCountNotFound = 0 missCountExpired = 0 ]
Tests run: 12, Failures: 0, Errors: 0, Skipped: 0, Time elapsed: 0.726 sec

Results :
Tests run: 47, Failures: 0, Errors: 0, Skipped: 0

 INFO|Thread-0| 4571|CacheManager                   - VM shutting down with the CacheManager still active. Calling shutdown.
[INFO] [jar:jar]
[INFO] Building jar: /export/home/build/data/continuum/checkouts/282/target/archiva-proxy-1.0-alpha-2-SNAPSHOT.jar
[INFO] [install:install]
[INFO] Installing /export/home/build/data/continuum/checkouts/282/target/archiva-proxy-1.0-alpha-2-SNAPSHOT.jar to /export/home/build/.m2/repository/org/apache/maven/archiva/archiva-proxy/1.0-alpha-2-SNAPSHOT/archiva-proxy-1.0-alpha-2-SNAPSHOT.jar
[INFO] ------------------------------------------------------------------------
[INFO] BUILD SUCCESSFUL
[INFO] ------------------------------------------------------------------------
[INFO] Total time: 14 seconds
[INFO] Finished at: Thu Jun 14 02:08:55 GMT 2007
[INFO] Final Memory: 18M/329M
[INFO] ------------------------------------------------------------------------

****************************************************************************



Mime
View raw message