maven-notifications mailing list archives

Site index · List index
Message view « Date » · « Thread »
Top « Date » · « Thread »
From "Continuum@maven.zones.apache.org" <contin...@maven.zones.apache.org>
Subject [continuum] BUILD FAILURE: Maven Archiver
Date Thu, 14 Jun 2007 07:36:05 GMT
Online report : http://maven.zones.apache.org/continuum/buildResult.action?buildId=8628&projectId=44
Build statistics:
  State: Failed
  Previous State: Failed
  Started at: Thu 14 Jun 2007 07:35:59 +0000
  Finished at: Thu 14 Jun 2007 07:36:05 +0000
  Total time: 5s
  Build Trigger: Schedule
  Build Number: 7
  Exit code: 1
  Building machine hostname: maven.zones.apache.org
  Operating system : SunOS(unknown)
  Java version : 1.5.0_11(Sun Microsystems Inc.)

****************************************************************************
SCM Changes:
****************************************************************************
Changed: no author @ no date
Comment: no comment
Files changed:
  pom.xml ( no revision )

****************************************************************************
Dependencies Changes:
****************************************************************************
No dependencies changed

****************************************************************************
Test Summary:
****************************************************************************
Tests: 3
Failures: 1
Total time: 152

****************************************************************************
Output:
****************************************************************************
[INFO] Scanning for projects...
[INFO] ----------------------------------------------------------------------------
[INFO] Building Maven Archiver
[INFO]    task-segment: [clean, install]
[INFO] ----------------------------------------------------------------------------
[INFO] [clean:clean]
[INFO] Deleting directory /export/home/build/data/continuum/checkouts/44/target
[INFO] [resources:resources]
[INFO] Using default encoding to copy filtered resources.
[INFO] Resource directory does not exist: /export/home/build/data/continuum/checkouts/44/src/main/resources
[INFO] [compiler:compile]
[INFO] Compiling 5 source files to /export/home/build/data/continuum/checkouts/44/target/classes
[INFO] [resources:testResources]
[INFO] Using default encoding to copy filtered resources.
[INFO] Resource directory does not exist: /export/home/build/data/continuum/checkouts/44/src/test/resources
[INFO] [compiler:testCompile]
[INFO] Compiling 2 source files to /export/home/build/data/continuum/checkouts/44/target/test-classes
[INFO] [surefire:test]
[INFO] Surefire report directory: /export/home/build/data/continuum/checkouts/44/target/surefire-reports

-------------------------------------------------------
 T E S T S
-------------------------------------------------------
Running org.apache.maven.archiver.MavenArchiverTest
[INFO] Building jar: /export/home/build/data/continuum/checkouts/44/target/test/dummy.jar
Tests run: 3, Failures: 1, Errors: 0, Skipped: 0, Time elapsed: 0.163 sec <<< FAILURE!

Results :

Failed tests: 
  testRecreation(org.apache.maven.archiver.MavenArchiverTest)

Tests run: 3, Failures: 1, Errors: 0, Skipped: 0

[INFO] ------------------------------------------------------------------------
[ERROR] BUILD FAILURE
[INFO] ------------------------------------------------------------------------
[INFO] There are test failures.
[INFO] ------------------------------------------------------------------------
[INFO] For more information, run Maven with the -e switch
[INFO] ------------------------------------------------------------------------
[INFO] Total time: 4 seconds
[INFO] Finished at: Thu Jun 14 07:36:04 GMT 2007
[INFO] Final Memory: 8M/324M
[INFO] ------------------------------------------------------------------------

****************************************************************************



Mime
View raw message