maven-notifications mailing list archives

Site index · List index
Message view « Date » · « Thread »
Top « Date » · « Thread »
From "continuum@maven.zones.apache.org" <contin...@maven.zones.apache.org>
Subject [continuum] BUILD FAILURE: Maven
Date Tue, 10 Apr 2007 12:41:34 GMT
Online report : http://maven.zones.apache.org:8180/continuum/servlet/continuum/target/ProjectBuild.vm/view/ProjectBuild/id/6/buildId/219
Build statistics:
  State: Failed
  Previous State: Failed
  Started at: Tue, 10 Apr 2007 12:40:18 +0000
  Finished at: Tue, 10 Apr 2007 12:41:33 +0000
  Total time: 1m 14s
  Build Trigger: Forced
  Exit code: 70
  Building machine hostname: maven.zones.apache.org
  Operating system : SunOS(unknown)
  Java version : 1.4.2_09(Sun Microsystems Inc.)

Changes
      No files changed
  
****************************************************************************
Output:
****************************************************************************
 __  __
|  \/  |__ _Apache__ ___
| |\/| / _` \ V / -_) ' \  ~ intelligent projects ~
|_|  |_\__,_|\_/\___|_||_|  v. 1.1-RC1-SNAPSHOT

Trying to get missing dependencies (and updated snapshots) required by Maven:
- Checking for an update of maven:maven-model:3.0.2-SNAPSHOT:jar from http://people.apache.org/repo/m1-snapshot-repository/
Skipping download as local copy is up to date!
build:start:

clean:clean:
xdoc:clean:

    [delete] Deleting directory /export/home/continuum/continuum_1.0.3_data/working-directory/6/target

clean:

maven:jar-install:
java:prepare-filesystem:
    [mkdir] Created dir: /export/home/continuum/continuum_1.0.3_data/working-directory/6/target/classes

java:init:

java:compile:
    [echo] Compiling to /export/home/continuum/continuum_1.0.3_data/working-directory/6/target/classes
    [javac] Compiling 114 source files to /export/home/continuum/continuum_1.0.3_data/working-directory/6/target/classes
    [javac] Note: Some input files use or override a deprecated API.
    [javac] Note: Recompile with -deprecation for details.

java:jar-resources:
Copying 1 file to /export/home/continuum/continuum_1.0.3_data/working-directory/6/target/classes/META-INF
Copying 1 file to /export/home/continuum/continuum_1.0.3_data/working-directory/6/target/classes
Copying 4 files to /export/home/continuum/continuum_1.0.3_data/working-directory/6/target/classes
Copying 10 files to /export/home/continuum/continuum_1.0.3_data/working-directory/6/target/classes/org/apache/maven/messages

test:test:
java:prepare-filesystem:

java:init:

java:compile:
    [echo] Compiling to /export/home/continuum/continuum_1.0.3_data/working-directory/6/target/classes

java:jar-resources:
Copying 4 files to /export/home/continuum/continuum_1.0.3_data/working-directory/6/target/classes

test:prepare-filesystem:
    [mkdir] Created dir: /export/home/continuum/continuum_1.0.3_data/working-directory/6/target/test-classes
    [mkdir] Created dir: /export/home/continuum/continuum_1.0.3_data/working-directory/6/target/test-reports

test:test-resources:

test:compile:
    [javac] Compiling 22 source files to /export/home/continuum/continuum_1.0.3_data/working-directory/6/target/test-classes

    [junit] Running org.apache.maven.werkz.ProjectTest
    [junit] Tests run: 5, Failures: 0, Errors: 0, Time elapsed: 0.589 sec
    [junit] Tests run: 5, Failures: 0, Errors: 0, Time elapsed: 0.045 sec
    [junit] Tests run: 5, Failures: 0, Errors: 0, Time elapsed: 0.013 sec
    [junit] Tests run: 1, Failures: 0, Errors: 0, Time elapsed: 0.169 sec
    [junit] Tests run: 7, Failures: 0, Errors: 0, Time elapsed: 1.822 sec
    [junit] Tests run: 3, Failures: 0, Errors: 0, Time elapsed: 0.176 sec
    [junit] Tests run: 16, Failures: 0, Errors: 0, Time elapsed: 0.463 sec
    [junit] Tests run: 2, Failures: 0, Errors: 0, Time elapsed: 0.37 sec
    [junit] Tests run: 3, Failures: 0, Errors: 0, Time elapsed: 0.04 sec
    [junit] Tests run: 4, Failures: 0, Errors: 0, Time elapsed: 0.007 sec
    [junit] Tests run: 6, Failures: 0, Errors: 0, Time elapsed: 0.009 sec
    [junit] Tests run: 6, Failures: 0, Errors: 0, Time elapsed: 0.004 sec
    [junit] Tests run: 1, Failures: 0, Errors: 0, Time elapsed: 0.056 sec
    [junit] Tests run: 1, Failures: 0, Errors: 0, Time elapsed: 0.009 sec
    [junit] Tests run: 1, Failures: 0, Errors: 0, Time elapsed: 0.004 sec
    [junit] Tests run: 28, Failures: 0, Errors: 0, Time elapsed: 0.011 sec
    [junit] Tests run: 5, Failures: 0, Errors: 0, Time elapsed: 0.006 sec

jar:jar:
    [jar] Building jar: /export/home/continuum/continuum_1.0.3_data/working-directory/6/target/maven.jar

    [copy] Copying 1 file to /export/home/continuum/maven-1.1/lib
    [copy] Copying 1 file to /export/home/continuum/.maven/repository/maven/jars

java:prepare-filesystem:

java:init:

java:compile:
    [echo] Compiling to /export/home/continuum/continuum_1.0.3_data/working-directory/6/target/classes

java:jar-resources:
Copying 4 files to /export/home/continuum/continuum_1.0.3_data/working-directory/6/target/classes

test:test:
java:prepare-filesystem:

java:init:

java:compile:
    [echo] Compiling to /export/home/continuum/continuum_1.0.3_data/working-directory/6/target/classes

java:jar-resources:
Copying 4 files to /export/home/continuum/continuum_1.0.3_data/working-directory/6/target/classes

test:prepare-filesystem:

test:test-resources:

test:compile:
Overriding previous definition of reference to _searchdir

    [junit] Running org.apache.maven.werkz.ProjectTest
    [junit] Tests run: 5, Failures: 0, Errors: 0, Time elapsed: 0.545 sec
    [junit] Tests run: 5, Failures: 0, Errors: 0, Time elapsed: 0.039 sec
    [junit] Tests run: 5, Failures: 0, Errors: 0, Time elapsed: 0.015 sec
    [junit] Tests run: 1, Failures: 0, Errors: 0, Time elapsed: 0.072 sec
    [junit] Tests run: 7, Failures: 0, Errors: 0, Time elapsed: 1.101 sec
    [junit] Tests run: 3, Failures: 0, Errors: 0, Time elapsed: 0.163 sec
    [junit] Tests run: 16, Failures: 0, Errors: 0, Time elapsed: 0.44 sec
    [junit] Tests run: 2, Failures: 0, Errors: 0, Time elapsed: 0.49 sec
    [junit] Tests run: 3, Failures: 0, Errors: 0, Time elapsed: 0.008 sec
    [junit] Tests run: 4, Failures: 0, Errors: 0, Time elapsed: 0.007 sec
    [junit] Tests run: 6, Failures: 0, Errors: 0, Time elapsed: 0.004 sec
    [junit] Tests run: 6, Failures: 0, Errors: 0, Time elapsed: 0.07 sec
    [junit] Tests run: 1, Failures: 0, Errors: 0, Time elapsed: 0.008 sec
    [junit] Tests run: 1, Failures: 0, Errors: 0, Time elapsed: 0.007 sec
    [junit] Tests run: 1, Failures: 0, Errors: 0, Time elapsed: 0.005 sec
    [junit] Tests run: 28, Failures: 0, Errors: 0, Time elapsed: 0.014 sec
    [junit] Tests run: 5, Failures: 0, Errors: 0, Time elapsed: 0.005 sec

jar:jar:

jar:install:
    [echo] Installing...
Uploading to maven/jars/maven-1.1-RC1-SNAPSHOT.jar: 
.................... (225K)
Uploading to maven/poms/maven-1.1-RC1-SNAPSHOT.pom: 
.................... (24K)

maven:run-touchstone:
Trying to get missing dependencies (and updated snapshots) required by Touchstone:
- Checking for an update of touchstone:touchstone:SNAPSHOT:jar from http://people.apache.org/repo/m1-snapshot-repository/
Skipping download as local copy is up to date!
- Checking for an update of touchstone:test:SNAPSHOT:war from http://people.apache.org/repo/m1-snapshot-repository/
Skipping download as local copy is up to date!
build:start:

clean:clean:
xdoc:clean:

    [delete] Deleting directory /export/home/continuum/continuum_1.0.3_data/working-directory/6/src/test/touchstone-build/target

clean:

java:prepare-filesystem:
    [mkdir] Created dir: /export/home/continuum/continuum_1.0.3_data/working-directory/6/src/test/touchstone-build/target/classes

java:init:

java:compile:
    [echo] 
    maven.dependency.classpath:
    /export/home/continuum/.maven/repository/ant/jars/ant-optional-1.5.1.jar
    /export/home/continuum/maven-1.1/lib/maven.jar
    /export/home/continuum/.maven/repository/maven/jars/maven-model-3.0.1.jar
    /export/home/continuum/continuum_1.0.3_data/working-directory/6/src/test/touchstone-build/lib/a.jar
    /export/home/continuum/continuum_1.0.3_data/working-directory/6/src/test/touchstone-build/lib/b.jar
    /export/home/continuum/continuum_1.0.3_data/working-directory/6/src/test/touchstone-build/lib/c-1.0-alpha-1-SNAPSHOT.jar
    /export/home/continuum/.maven/repository/classworlds/jars/classworlds-1.0-beta-1.jar
    /export/home/continuum/.maven/repository/touchstone/jars/touchstone-SNAPSHOT.jar
    /export/home/continuum/.maven/repository/commons-jelly/jars/commons-jelly-tags-interaction-1.0.jar
    
    
    [echo] Compiling to /export/home/continuum/continuum_1.0.3_data/working-directory/6/src/test/touchstone-build/target/classes
    [javac] Compiling 1 source file to /export/home/continuum/continuum_1.0.3_data/working-directory/6/src/test/touchstone-build/target/classes

java:jar-resources:
Copying 1 file to /export/home/continuum/continuum_1.0.3_data/working-directory/6/src/test/touchstone-build/target/classes
Copying 1 file to /export/home/continuum/continuum_1.0.3_data/working-directory/6/src/test/touchstone-build/target/classes/org/apache/maven/touchstone
Copying 2 files to /export/home/continuum/continuum_1.0.3_data/working-directory/6/src/test/touchstone-build/target/classes

test:test:
java:prepare-filesystem:

java:init:

java:compile:
    [echo] 
    maven.dependency.classpath:
    /export/home/continuum/.maven/repository/ant/jars/ant-optional-1.5.1.jar
    /export/home/continuum/maven-1.1/lib/maven.jar
    /export/home/continuum/.maven/repository/maven/jars/maven-model-3.0.1.jar
    /export/home/continuum/continuum_1.0.3_data/working-directory/6/src/test/touchstone-build/lib/a.jar
    /export/home/continuum/continuum_1.0.3_data/working-directory/6/src/test/touchstone-build/lib/b.jar
    /export/home/continuum/continuum_1.0.3_data/working-directory/6/src/test/touchstone-build/lib/c-1.0-alpha-1-SNAPSHOT.jar
    /export/home/continuum/.maven/repository/classworlds/jars/classworlds-1.0-beta-1.jar
    /export/home/continuum/.maven/repository/touchstone/jars/touchstone-SNAPSHOT.jar
    /export/home/continuum/.maven/repository/commons-jelly/jars/commons-jelly-tags-interaction-1.0.jar
    
    
    [echo] Compiling to /export/home/continuum/continuum_1.0.3_data/working-directory/6/src/test/touchstone-build/target/classes

java:jar-resources:

test:prepare-filesystem:
    [mkdir] Created dir: /export/home/continuum/continuum_1.0.3_data/working-directory/6/src/test/touchstone-build/target/test-classes
    [mkdir] Created dir: /export/home/continuum/continuum_1.0.3_data/working-directory/6/src/test/touchstone-build/target/test-reports

test:test-resources:
Copying 1 file to /export/home/continuum/continuum_1.0.3_data/working-directory/6/src/test/touchstone-build/target/test-classes/org/apache/maven/touchstone
Copying 1 file to /export/home/continuum/continuum_1.0.3_data/working-directory/6/src/test/touchstone-build/target/test-classes

test:compile:
    [javac] Compiling 1 source file to /export/home/continuum/continuum_1.0.3_data/working-directory/6/src/test/touchstone-build/target/test-classes


jar:jar:
    [jar] Building jar: /export/home/continuum/continuum_1.0.3_data/working-directory/6/src/test/touchstone-build/target/touchstone-1.0.jar

touchstone-tests:
xdoc:init-i18n:
    [echo] Init the i18n support

xdoc:init:
    [echo] Generates the directory structure required for xdocs
    [mkdir] Created dir: /export/home/continuum/continuum_1.0.3_data/working-directory/6/src/test/touchstone-build/target/generated-xdocs
    [mkdir] Created dir: /export/home/continuum/continuum_1.0.3_data/working-directory/6/src/test/touchstone-build/target/docs

test-plugin-loading:
    [echo] DEPRECATED: the use of dependency-handle is deprecated. Please use maven:get/set
to modify properties of the multiproject plugin

touchstone-goal-A:
    [echo] Overriding touchstone-goal-A

touchstone-goal-B:
    [echo] touchstone-goal-B defined in plugin.

test-addPath:

test-plugin-property-override:
    [echo] maven.touchstone.A = override.maven.touchstone.A

touchstone-goal-C:
    [echo] touchstone-goal-C defined in plugin.

    [echo] checkValue = 
-------------------------------------------------------------------------------
BUILD FAILED
-------------------------------------------------------------------------------
Errors stack :
>> Unable to obtain goal [maven:run-touchstone]
>> File...... file:/export/home/continuum/continuum_1.0.3_data/working-directory/6/maven.xml
>> Element... maven:maven
>> Line...... 38
>> Column.... 143
>> Unable to obtain goal [touchstone-tests]
>> File...... file:/export/home/continuum/continuum_1.0.3_data/working-directory/6/src/test/touchstone-build/maven.xml
>> Element... fail
>> Line...... 123
>> Column.... 13
>> Inter-plugin preGoals are not being dealt with correctly.

Exception stack traces :
org.apache.maven.werkz.UnattainableGoalException: Unable to obtain goal [maven:run-touchstone]
	at org.apache.maven.werkz.Goal.fire(Goal.java:655)
	at org.apache.maven.werkz.Goal.attain(Goal.java:583)
	at org.apache.maven.plugin.PluginManager.attainGoals(PluginManager.java:712)
	at org.apache.maven.MavenSession.attainGoals(MavenSession.java:265)
	at org.apache.maven.cli.App.doMain(App.java:306)
	at org.apache.maven.cli.App.main(App.java:219)
	at sun.reflect.NativeMethodAccessorImpl.invoke0(Native Method)
	at sun.reflect.NativeMethodAccessorImpl.invoke(NativeMethodAccessorImpl.java:39)
	at sun.reflect.DelegatingMethodAccessorImpl.invoke(DelegatingMethodAccessorImpl.java:25)
	at java.lang.reflect.Method.invoke(Method.java:324)
	at com.werken.forehead.Forehead.run(Forehead.java:551)
	at com.werken.forehead.Forehead.main(Forehead.java:581)
Caused by: org.apache.commons.jelly.JellyTagException: file:/export/home/continuum/continuum_1.0.3_data/working-directory/6/maven.xml:38:143:
<maven:maven> Unable to obtain goal [touchstone-tests]
	at org.apache.maven.jelly.tags.maven.MavenTag.doTag(MavenTag.java:103)
	at org.apache.commons.jelly.impl.TagScript.run(TagScript.java:250)
	at org.apache.commons.jelly.impl.ScriptBlock.run(ScriptBlock.java:95)
	at org.apache.maven.jelly.tags.werkz.MavenGoalTag.runBodyTag(MavenGoalTag.java:83)
	at org.apache.maven.jelly.tags.werkz.MavenGoalTag$MavenGoalAction.performAction(MavenGoalTag.java:116)
	at org.apache.maven.werkz.Goal.fire(Goal.java:648)
	... 11 more
Caused by: org.apache.maven.werkz.UnattainableGoalException: Unable to obtain goal [touchstone-tests]
	at org.apache.maven.werkz.Goal.fire(Goal.java:655)
	at org.apache.maven.werkz.Goal.attain(Goal.java:583)
	at org.apache.maven.plugin.PluginManager.attainGoals(PluginManager.java:712)
	at org.apache.maven.MavenSession.attainGoals(MavenSession.java:265)
	at org.apache.maven.jelly.tags.maven.MavenTag.doTag(MavenTag.java:83)
	... 16 more
Caused by: org.apache.commons.jelly.JellyTagException: file:/export/home/continuum/continuum_1.0.3_data/working-directory/6/src/test/touchstone-build/maven.xml:123:13:
<fail> Inter-plugin preGoals are not being dealt with correctly.
	at org.apache.commons.jelly.impl.TagScript.handleException(TagScript.java:681)
	at org.apache.commons.jelly.impl.TagScript.run(TagScript.java:262)
	at org.apache.commons.jelly.impl.ScriptBlock.run(ScriptBlock.java:95)
	at org.apache.commons.jelly.TagSupport.invokeBody(TagSupport.java:186)
	at org.apache.commons.jelly.tags.core.IfTag.doTag(IfTag.java:42)
	at org.apache.commons.jelly.impl.TagScript.run(TagScript.java:250)
	at org.apache.commons.jelly.impl.ScriptBlock.run(ScriptBlock.java:95)
	at org.apache.maven.jelly.tags.werkz.MavenGoalTag.runBodyTag(MavenGoalTag.java:83)
	at org.apache.maven.jelly.tags.werkz.MavenGoalTag$MavenGoalAction.performAction(MavenGoalTag.java:116)
	at org.apache.maven.werkz.Goal.fire(Goal.java:648)
	... 20 more
Caused by: Inter-plugin preGoals are not being dealt with correctly.
	at org.apache.tools.ant.taskdefs.Exit.execute(Exit.java:139)
	at org.apache.tools.ant.Task.perform(Task.java:364)
	at org.apache.commons.jelly.tags.ant.AntTag.doTag(AntTag.java:195)
	at org.apache.commons.jelly.impl.TagScript.run(TagScript.java:250)
	... 28 more
-------------------------------------------------------------------------------
Total time   : 1 minutes 7 seconds 
Finished at  : Tuesday, April 10, 2007 12:41:33 PM GMT+00:00
Final Memory : 9M/18M
-------------------------------------------------------------------------------

****************************************************************************



Mime
View raw message