maven-notifications mailing list archives

Site index · List index
Message view « Date » · « Thread »
Top « Date » · « Thread »
From "Continuum@maven.zones.apache.org" <contin...@maven.zones.apache.org>
Subject [continuum] BUILD FAILURE: Maven Core - CLI
Date Tue, 13 Feb 2007 17:43:28 GMT
Online report : http://maven.zones.apache.org/continuum/buildResult.action?buildId=6959&projectId=184
Build statistics:
  State: Failed
  Previous State: Failed
  Started at: Tue, 13 Feb 2007 17:43:19 +0000
  Finished at: Tue, 13 Feb 2007 17:43:26 +0000
  Total time: 6s
  Build Trigger: Schedule
  Build Number: 62
  Exit code: 1
  Building machine hostname: maven.zones.apache.org
  Operating system : SunOS(unknown)
  Java version : 1.5.0_10(Sun Microsystems Inc.)

****************************************************************************
SCM Changes:
****************************************************************************
No files changed

****************************************************************************
SCM Changes since last success:
****************************************************************************
****************************************************************************
Dependencies Changes:
****************************************************************************
org.apache.maven:maven:2.1-SNAPSHOT

****************************************************************************
Test Summary:
****************************************************************************
Tests: 0
Failures: 0
Total time: 0

****************************************************************************
Output:
****************************************************************************
[INFO] Scanning for projects...
[INFO] ----------------------------------------------------------------------------
[INFO] Building Maven Core - CLI
[INFO]    task-segment: [clean, install]
[INFO] ----------------------------------------------------------------------------
[INFO] [clean:clean]
[INFO] Deleting directory /export/home/continuum/continuum_data/working-directory/184/target
[INFO] Deleting directory /export/home/continuum/continuum_data/working-directory/184/target/classes
[INFO] Deleting directory /export/home/continuum/continuum_data/working-directory/184/target/test-classes
[INFO] Deleting directory /export/home/continuum/continuum_data/working-directory/184/target/site
[INFO] [resources:resources]
[INFO] Using default encoding to copy filtered resources.
[INFO] Resource directory does not exist: /export/home/continuum/continuum_data/working-directory/184/src/main/resources
[WARNING] 
	Artifact junit:junit:jar:3.8.1:test retains local scope 'test' overriding broader scope 'compile'
	given by a dependency. If this is not intended, modify or remove the local scope.

[WARNING] POM for 'org.apache.maven.wagon:wagon-manager:pom:1.0-beta-3-SNAPSHOT:compile' is
invalid. It will be ignored for artifact resolution. Reason: Failed to validate POM
[INFO] [compiler:compile]
[INFO] Compiling 5 source files to /export/home/continuum/continuum_data/working-directory/184/target/classes
[INFO] ------------------------------------------------------------------------
[ERROR] BUILD FAILURE
[INFO] ------------------------------------------------------------------------
[INFO] Compilation failure

/export/home/continuum/continuum_data/working-directory/184/src/main/java/org/apache/maven/cli/ConsoleDownloadMonitor.java:[19,30]
package org.apache.maven.wagon does not exist

/export/home/continuum/continuum_data/working-directory/184/src/main/java/org/apache/maven/cli/ConsoleDownloadMonitor.java:[20,37]
package org.apache.maven.wagon.events does not exist

/export/home/continuum/continuum_data/working-directory/184/src/main/java/org/apache/maven/cli/AbstractConsoleDownloadMonitor.java:[21,30]
package org.apache.maven.wagon does not exist

/export/home/continuum/continuum_data/working-directory/184/src/main/java/org/apache/maven/cli/AbstractConsoleDownloadMonitor.java:[22,37]
package org.apache.maven.wagon.events does not exist

/export/home/continuum/continuum_data/working-directory/184/src/main/java/org/apache/maven/cli/AbstractConsoleDownloadMonitor.java:[32,16]
cannot access org.apache.maven.wagon.events.TransferListener
file org/apache/maven/wagon/events/TransferListener.class not found
public abstract class AbstractConsoleDownloadMonitor

/export/home/continuum/continuum_data/working-directory/184/src/main/java/org/apache/maven/cli/ConsoleDownloadMonitor.java:[33,35]
cannot find symbol
symbol  : class TransferEvent
location: class org.apache.maven.cli.ConsoleDownloadMonitor

/export/home/continuum/continuum_data/working-directory/184/src/main/java/org/apache/maven/cli/ConsoleDownloadMonitor.java:[40,34]
cannot find symbol
symbol  : class TransferEvent
location: class org.apache.maven.cli.ConsoleDownloadMonitor

/export/home/continuum/continuum_data/working-directory/184/src/main/java/org/apache/maven/cli/AbstractConsoleDownloadMonitor.java:[38,33]
cannot find symbol
symbol  : class TransferEvent
location: class org.apache.maven.cli.AbstractConsoleDownloadMonitor

/export/home/continuum/continuum_data/working-directory/184/src/main/java/org/apache/maven/cli/AbstractConsoleDownloadMonitor.java:[60,35]
cannot find symbol
symbol  : class TransferEvent
location: class org.apache.maven.cli.AbstractConsoleDownloadMonitor

/export/home/continuum/continuum_data/working-directory/184/src/main/java/org/apache/maven/cli/AbstractConsoleDownloadMonitor.java:[78,33]
cannot find symbol
symbol  : class TransferEvent
location: class org.apache.maven.cli.AbstractConsoleDownloadMonitor

/export/home/continuum/continuum_data/working-directory/184/src/main/java/org/apache/maven/cli/AbstractConsoleDownloadMonitor.java:[86,34]
cannot find symbol
symbol  : class TransferEvent
location: class org.apache.maven.cli.AbstractConsoleDownloadMonitor

/export/home/continuum/continuum_data/working-directory/184/src/main/java/org/apache/maven/cli/AbstractConsoleDownloadMonitor.java:[91,35]
cannot find symbol
symbol  : class TransferEvent
location: class org.apache.maven.cli.AbstractConsoleDownloadMonitor

/export/home/continuum/continuum_data/working-directory/184/src/main/java/org/apache/maven/cli/AbstractConsoleDownloadMonitor.java:[102,31]
cannot find symbol
symbol  : class TransferEvent
location: class org.apache.maven.cli.AbstractConsoleDownloadMonitor

/export/home/continuum/continuum_data/working-directory/184/src/main/java/org/apache/maven/cli/BatchModeDownloadMonitor.java:[19,37]
package org.apache.maven.wagon.events does not exist

/export/home/continuum/continuum_data/working-directory/184/src/main/java/org/apache/maven/cli/BatchModeDownloadMonitor.java:[30,35]
cannot find symbol
symbol  : class TransferEvent
location: class org.apache.maven.cli.BatchModeDownloadMonitor

/export/home/continuum/continuum_data/working-directory/184/src/main/java/org/apache/maven/cli/AbstractConsoleDownloadMonitor.java:[67,59]
cannot find symbol
symbol  : variable TransferEvent
location: class org.apache.maven.cli.AbstractConsoleDownloadMonitor

/export/home/continuum/continuum_data/working-directory/184/src/main/java/org/apache/maven/cli/AbstractConsoleDownloadMonitor.java:[94,30]
cannot find symbol
symbol  : variable WagonConstants
location: class org.apache.maven.cli.AbstractConsoleDownloadMonitor

/export/home/continuum/continuum_data/working-directory/184/src/main/java/org/apache/maven/cli/AbstractConsoleDownloadMonitor.java:[96,62]
cannot find symbol
symbol  : variable TransferEvent
location: class org.apache.maven.cli.AbstractConsoleDownloadMonitor

/export/home/continuum/continuum_data/working-directory/184/src/main/java/org/apache/maven/cli/AbstractConsoleDownloadMonitor.java:[124,8]
cannot find symbol
symbol  : variable this
location: class org.apache.maven.cli.AbstractConsoleDownloadMonitor

/export/home/continuum/continuum_data/working-directory/184/src/main/java/org/apache/maven/cli/ConsoleDownloadMonitor.java:[28,7]
cannot find symbol
symbol  : constructor AbstractConsoleDownloadMonitor()
location: class org.apache.maven.cli.AbstractConsoleDownloadMonitor

/export/home/continuum/continuum_data/working-directory/184/src/main/java/org/apache/maven/cli/ConsoleDownloadMonitor.java:[54,55]
cannot find symbol
symbol  : variable WagonConstants
location: class org.apache.maven.cli.ConsoleDownloadMonitor

/export/home/continuum/continuum_data/working-directory/184/src/main/java/org/apache/maven/cli/ConsoleDownloadMonitor.java:[59,58]
cannot find symbol
symbol  : variable WagonConstants
location: class org.apache.maven.cli.ConsoleDownloadMonitor

/export/home/continuum/continuum_data/working-directory/184/src/main/java/org/apache/maven/cli/BatchModeDownloadMonitor.java:[27,7]
cannot find symbol
symbol  : constructor AbstractConsoleDownloadMonitor()
location: class org.apache.maven.cli.AbstractConsoleDownloadMonitor

/export/home/continuum/continuum_data/working-directory/184/src/main/java/org/apache/maven/cli/BatchModeDownloadMonitor.java:[37,59]
cannot find symbol
symbol  : variable TransferEvent
location: class org.apache.maven.cli.BatchModeDownloadMonitor

/export/home/continuum/continuum_data/working-directory/184/src/main/java/org/apache/maven/cli/MavenCli.java:[275,35]
incompatible types
found   : org.apache.maven.cli.ConsoleDownloadMonitor
required: org.apache.maven.MavenTransferListener

/export/home/continuum/continuum_data/working-directory/184/src/main/java/org/apache/maven/cli/MavenCli.java:[279,35]
incompatible types
found   : org.apache.maven.cli.BatchModeDownloadMonitor
required: org.apache.maven.MavenTransferListener

/export/home/continuum/continuum_data/working-directory/184/src/main/java/org/apache/maven/cli/MavenCli.java:[318,44]
setTransferListener(org.apache.maven.wagon.events.TransferListener) in org.apache.maven.execution.MavenExecutionRequest
cannot be applied to (org.apache.maven.MavenTransferListener)


[INFO] ------------------------------------------------------------------------
[INFO] For more information, run Maven with the -e switch
[INFO] ------------------------------------------------------------------------
[INFO] Total time: 4 seconds
[INFO] Finished at: Tue Feb 13 17:43:26 GMT+00:00 2007
[INFO] Final Memory: 9M/63M
[INFO] ------------------------------------------------------------------------

****************************************************************************



Mime
View raw message