maven-notifications mailing list archives

Site index · List index
Message view « Date » · « Thread »
Top « Date » · « Thread »
From "Continuum@maven.zones.apache.org" <contin...@maven.zones.apache.org>
Subject [continuum] BUILD FAILURE: Maven Artifact Manager
Date Tue, 13 Feb 2007 17:36:45 GMT
Online report : http://maven.zones.apache.org/continuum/buildResult.action?buildId=6941&projectId=165
Build statistics:
  State: Failed
  Previous State: Failed
  Started at: Tue, 13 Feb 2007 17:36:32 +0000
  Finished at: Tue, 13 Feb 2007 17:36:43 +0000
  Total time: 10s
  Build Trigger: Schedule
  Build Number: 55
  Exit code: 1
  Building machine hostname: maven.zones.apache.org
  Operating system : SunOS(unknown)
  Java version : 1.5.0_10(Sun Microsystems Inc.)

****************************************************************************
SCM Changes:
****************************************************************************
No files changed

****************************************************************************
SCM Changes since last success:
****************************************************************************
****************************************************************************
Dependencies Changes:
****************************************************************************
org.apache.maven:maven-repository-metadata:2.1-SNAPSHOT

org.apache.maven:maven-artifact:2.1-SNAPSHOT

org.apache.maven:maven:2.1-SNAPSHOT

****************************************************************************
Test Summary:
****************************************************************************
Tests: 0
Failures: 0
Total time: 0

****************************************************************************
Output:
****************************************************************************
[INFO] Scanning for projects...
[INFO] ----------------------------------------------------------------------------
[INFO] Building Maven Artifact Manager
[INFO]    task-segment: [clean, install]
[INFO] ----------------------------------------------------------------------------
[INFO] [clean:clean]
[INFO] Deleting directory /export/home/continuum/continuum_data/working-directory/165/target
[INFO] Deleting directory /export/home/continuum/continuum_data/working-directory/165/target/classes
[INFO] Deleting directory /export/home/continuum/continuum_data/working-directory/165/target/test-classes
[INFO] Deleting directory /export/home/continuum/continuum_data/working-directory/165/target/site
[INFO] [resources:resources]
[INFO] Using default encoding to copy filtered resources.
[INFO] Copying 1 resource
[WARNING] POM for 'org.apache.maven.wagon:wagon-manager:pom:1.0-beta-3-SNAPSHOT:compile' is
invalid. It will be ignored for artifact resolution. Reason: Failed to validate POM
[WARNING] 
	Artifact junit:junit:jar:3.8.1:test retains local scope 'test' overriding broader scope 'compile'
	given by a dependency. If this is not intended, modify or remove the local scope.

[INFO] [compiler:compile]
[INFO] Compiling 24 source files to /export/home/continuum/continuum_data/working-directory/165/target/classes
[INFO] ------------------------------------------------------------------------
[ERROR] BUILD FAILURE
[INFO] ------------------------------------------------------------------------
[INFO] Compilation failure

/export/home/continuum/continuum_data/working-directory/165/src/main/java/org/apache/maven/artifact/manager/ArtifactManager.java:[26,30]
package org.apache.maven.wagon does not exist

/export/home/continuum/continuum_data/working-directory/165/src/main/java/org/apache/maven/artifact/manager/ArtifactManager.java:[27,30]
package org.apache.maven.wagon does not exist

/export/home/continuum/continuum_data/working-directory/165/src/main/java/org/apache/maven/artifact/manager/ArtifactManager.java:[68,15]
cannot find symbol
symbol  : class TransferFailedException
location: interface org.apache.maven.artifact.manager.ArtifactManager

/export/home/continuum/continuum_data/working-directory/165/src/main/java/org/apache/maven/artifact/manager/ArtifactManager.java:[68,40]
cannot find symbol
symbol  : class ResourceDoesNotExistException
location: interface org.apache.maven.artifact.manager.ArtifactManager

/export/home/continuum/continuum_data/working-directory/165/src/main/java/org/apache/maven/artifact/manager/ArtifactManager.java:[79,15]
cannot find symbol
symbol  : class TransferFailedException
location: interface org.apache.maven.artifact.manager.ArtifactManager

/export/home/continuum/continuum_data/working-directory/165/src/main/java/org/apache/maven/artifact/manager/ArtifactManager.java:[79,40]
cannot find symbol
symbol  : class ResourceDoesNotExistException
location: interface org.apache.maven.artifact.manager.ArtifactManager

/export/home/continuum/continuum_data/working-directory/165/src/main/java/org/apache/maven/artifact/manager/ArtifactManager.java:[90,15]
cannot find symbol
symbol  : class TransferFailedException
location: interface org.apache.maven.artifact.manager.ArtifactManager

/export/home/continuum/continuum_data/working-directory/165/src/main/java/org/apache/maven/artifact/manager/ArtifactManager.java:[101,15]
cannot find symbol
symbol  : class TransferFailedException
location: interface org.apache.maven.artifact.manager.ArtifactManager

/export/home/continuum/continuum_data/working-directory/165/src/main/java/org/apache/maven/artifact/manager/ArtifactManager.java:[118,15]
cannot find symbol
symbol  : class TransferFailedException
location: interface org.apache.maven.artifact.manager.ArtifactManager

/export/home/continuum/continuum_data/working-directory/165/src/main/java/org/apache/maven/artifact/manager/ArtifactManager.java:[118,40]
cannot find symbol
symbol  : class ResourceDoesNotExistException
location: interface org.apache.maven.artifact.manager.ArtifactManager

/export/home/continuum/continuum_data/working-directory/165/src/main/java/org/apache/maven/artifact/deployer/DefaultArtifactDeployer.java:[26,30]
cannot find symbol
symbol  : class TransferFailedException
location: package org.apache.maven.wagon

/export/home/continuum/continuum_data/working-directory/165/src/main/java/org/apache/maven/artifact/resolver/DefaultArtifactResolver.java:[32,30]
cannot find symbol
symbol  : class ResourceDoesNotExistException
location: package org.apache.maven.wagon

/export/home/continuum/continuum_data/working-directory/165/src/main/java/org/apache/maven/artifact/resolver/DefaultArtifactResolver.java:[33,30]
cannot find symbol
symbol  : class TransferFailedException
location: package org.apache.maven.wagon

/export/home/continuum/continuum_data/working-directory/165/src/main/java/org/apache/maven/artifact/manager/DefaultWagonManager.java:[28,30]
cannot find symbol
symbol  : class ConnectionException
location: package org.apache.maven.wagon

/export/home/continuum/continuum_data/working-directory/165/src/main/java/org/apache/maven/artifact/manager/DefaultWagonManager.java:[29,30]
cannot find symbol
symbol  : class ResourceDoesNotExistException
location: package org.apache.maven.wagon

/export/home/continuum/continuum_data/working-directory/165/src/main/java/org/apache/maven/artifact/manager/DefaultWagonManager.java:[30,30]
cannot find symbol
symbol  : class TransferFailedException
location: package org.apache.maven.wagon

/export/home/continuum/continuum_data/working-directory/165/src/main/java/org/apache/maven/artifact/manager/DefaultWagonManager.java:[31,30]
cannot find symbol
symbol  : class UnsupportedProtocolException
location: package org.apache.maven.wagon

/export/home/continuum/continuum_data/working-directory/165/src/main/java/org/apache/maven/artifact/manager/DefaultWagonManager.java:[32,30]
cannot find symbol
symbol  : class Wagon
location: package org.apache.maven.wagon

/export/home/continuum/continuum_data/working-directory/165/src/main/java/org/apache/maven/artifact/manager/DefaultWagonManager.java:[33,45]
package org.apache.maven.wagon.authentication does not exist

/export/home/continuum/continuum_data/working-directory/165/src/main/java/org/apache/maven/artifact/manager/DefaultWagonManager.java:[34,45]
package org.apache.maven.wagon.authentication does not exist

/export/home/continuum/continuum_data/working-directory/165/src/main/java/org/apache/maven/artifact/manager/DefaultWagonManager.java:[35,44]
package org.apache.maven.wagon.authorization does not exist

/export/home/continuum/continuum_data/working-directory/165/src/main/java/org/apache/maven/artifact/manager/DefaultWagonManager.java:[36,37]
package org.apache.maven.wagon.events does not exist

/export/home/continuum/continuum_data/working-directory/165/src/main/java/org/apache/maven/artifact/manager/DefaultWagonManager.java:[41,40]
package org.apache.maven.wagon.observers does not exist

/export/home/continuum/continuum_data/working-directory/165/src/main/java/org/apache/maven/artifact/manager/DefaultWagonManager.java:[42,36]
package org.apache.maven.wagon.proxy does not exist

/export/home/continuum/continuum_data/working-directory/165/src/main/java/org/apache/maven/artifact/manager/DefaultWagonManager.java:[43,41]
package org.apache.maven.wagon.repository does not exist

/export/home/continuum/continuum_data/working-directory/165/src/main/java/org/apache/maven/artifact/manager/DefaultWagonManager.java:[44,41]
package org.apache.maven.wagon.repository does not exist

/export/home/continuum/continuum_data/working-directory/165/src/main/java/org/apache/maven/artifact/manager/WagonManager.java:[22,30]
cannot find symbol
symbol  : class ResourceDoesNotExistException
location: package org.apache.maven.wagon

/export/home/continuum/continuum_data/working-directory/165/src/main/java/org/apache/maven/artifact/manager/WagonManager.java:[23,30]
cannot find symbol
symbol  : class TransferFailedException
location: package org.apache.maven.wagon

/export/home/continuum/continuum_data/working-directory/165/src/main/java/org/apache/maven/artifact/manager/WagonManager.java:[26,45]
package org.apache.maven.wagon.authentication does not exist

/export/home/continuum/continuum_data/working-directory/165/src/main/java/org/apache/maven/artifact/manager/DefaultWagonManager.java:[81,12]
cannot find symbol
symbol  : class TransferListener
location: class org.apache.maven.artifact.manager.DefaultWagonManager

/export/home/continuum/continuum_data/working-directory/165/src/main/java/org/apache/maven/artifact/manager/DefaultWagonManager.java:[121,15]
cannot find symbol
symbol  : class TransferFailedException
location: class org.apache.maven.artifact.manager.DefaultWagonManager

/export/home/continuum/continuum_data/working-directory/165/src/main/java/org/apache/maven/artifact/manager/DefaultWagonManager.java:[121,40]
cannot find symbol
symbol  : class ResourceDoesNotExistException
location: class org.apache.maven.artifact.manager.DefaultWagonManager

/export/home/continuum/continuum_data/working-directory/165/src/main/java/org/apache/maven/artifact/manager/DefaultWagonManager.java:[127,15]
cannot find symbol
symbol  : class TransferFailedException
location: class org.apache.maven.artifact.manager.DefaultWagonManager

/export/home/continuum/continuum_data/working-directory/165/src/main/java/org/apache/maven/artifact/manager/DefaultWagonManager.java:[127,40]
cannot find symbol
symbol  : class ResourceDoesNotExistException
location: class org.apache.maven.artifact.manager.DefaultWagonManager

/export/home/continuum/continuum_data/working-directory/165/src/main/java/org/apache/maven/artifact/manager/DefaultWagonManager.java:[134,15]
cannot find symbol
symbol  : class TransferFailedException
location: class org.apache.maven.artifact.manager.DefaultWagonManager

/export/home/continuum/continuum_data/working-directory/165/src/main/java/org/apache/maven/artifact/manager/DefaultWagonManager.java:[134,40]
cannot find symbol
symbol  : class ResourceDoesNotExistException
location: class org.apache.maven.artifact.manager.DefaultWagonManager

/export/home/continuum/continuum_data/working-directory/165/src/main/java/org/apache/maven/artifact/manager/DefaultWagonManager.java:[139,11]
cannot find symbol
symbol  : class AuthenticationInfo
location: class org.apache.maven.artifact.manager.DefaultWagonManager

/export/home/continuum/continuum_data/working-directory/165/src/main/java/org/apache/maven/artifact/manager/DefaultWagonManager.java:[145,11]
cannot find symbol
symbol  : class ProxyInfo
location: class org.apache.maven.artifact.manager.DefaultWagonManager

/export/home/continuum/continuum_data/working-directory/165/src/main/java/org/apache/maven/artifact/manager/DefaultWagonManager.java:[150,11]
cannot find symbol
symbol  : class Wagon
location: class org.apache.maven.artifact.manager.DefaultWagonManager

/export/home/continuum/continuum_data/working-directory/165/src/main/java/org/apache/maven/artifact/manager/DefaultWagonManager.java:[151,15]
cannot find symbol
symbol  : class UnsupportedProtocolException
location: class org.apache.maven.artifact.manager.DefaultWagonManager

/export/home/continuum/continuum_data/working-directory/165/src/main/java/org/apache/maven/artifact/manager/DefaultWagonManager.java:[156,27]
cannot find symbol
symbol  : class Repository
location: class org.apache.maven.artifact.manager.DefaultWagonManager

/export/home/continuum/continuum_data/working-directory/165/src/main/java/org/apache/maven/artifact/manager/DefaultWagonManager.java:[156,11]
cannot find symbol
symbol  : class Wagon
location: class org.apache.maven.artifact.manager.DefaultWagonManager

/export/home/continuum/continuum_data/working-directory/165/src/main/java/org/apache/maven/artifact/manager/DefaultWagonManager.java:[157,15]
cannot find symbol
symbol  : class UnsupportedProtocolException
location: class org.apache.maven.artifact.manager.DefaultWagonManager

/export/home/continuum/continuum_data/working-directory/165/src/main/java/org/apache/maven/artifact/manager/DefaultWagonManager.java:[191,15]
cannot find symbol
symbol  : class TransferFailedException
location: class org.apache.maven.artifact.manager.DefaultWagonManager

/export/home/continuum/continuum_data/working-directory/165/src/main/java/org/apache/maven/artifact/manager/DefaultWagonManager.java:[197,15]
cannot find symbol
symbol  : class TransferFailedException
location: class org.apache.maven.artifact.manager.DefaultWagonManager

/export/home/continuum/continuum_data/working-directory/165/src/main/java/org/apache/maven/artifact/manager/DefaultWagonManager.java:[207,36]
cannot find symbol
symbol  : class TransferListener
location: class org.apache.maven.artifact.manager.DefaultWagonManager

/export/home/continuum/continuum_data/working-directory/165/src/main/java/org/apache/maven/artifact/manager/WagonManager.java:[57,4]
cannot find symbol
symbol  : class Wagon
location: interface org.apache.maven.artifact.manager.WagonManager

/export/home/continuum/continuum_data/working-directory/165/src/main/java/org/apache/maven/artifact/manager/WagonManager.java:[58,15]
cannot find symbol
symbol  : class UnsupportedProtocolException
location: interface org.apache.maven.artifact.manager.WagonManager

/export/home/continuum/continuum_data/working-directory/165/src/main/java/org/apache/maven/artifact/manager/WagonManager.java:[69,20]
cannot find symbol
symbol  : class Repository
location: interface org.apache.maven.artifact.manager.WagonManager

/export/home/continuum/continuum_data/working-directory/165/src/main/java/org/apache/maven/artifact/manager/WagonManager.java:[69,4]
cannot find symbol
symbol  : class Wagon
location: interface org.apache.maven.artifact.manager.WagonManager

/export/home/continuum/continuum_data/working-directory/165/src/main/java/org/apache/maven/artifact/manager/WagonManager.java:[70,15]
cannot find symbol
symbol  : class UnsupportedProtocolException
location: interface org.apache.maven.artifact.manager.WagonManager

/export/home/continuum/continuum_data/working-directory/165/src/main/java/org/apache/maven/artifact/manager/WagonManager.java:[73,15]
cannot find symbol
symbol  : class TransferFailedException
location: interface org.apache.maven.artifact.manager.WagonManager

/export/home/continuum/continuum_data/working-directory/165/src/main/java/org/apache/maven/artifact/manager/WagonManager.java:[73,40]
cannot find symbol
symbol  : class ResourceDoesNotExistException
location: interface org.apache.maven.artifact.manager.WagonManager

/export/home/continuum/continuum_data/working-directory/165/src/main/java/org/apache/maven/artifact/manager/WagonManager.java:[76,15]
cannot find symbol
symbol  : class TransferFailedException
location: interface org.apache.maven.artifact.manager.WagonManager

/export/home/continuum/continuum_data/working-directory/165/src/main/java/org/apache/maven/artifact/manager/WagonManager.java:[76,40]
cannot find symbol
symbol  : class ResourceDoesNotExistException
location: interface org.apache.maven.artifact.manager.WagonManager

/export/home/continuum/continuum_data/working-directory/165/src/main/java/org/apache/maven/artifact/manager/WagonManager.java:[79,15]
cannot find symbol
symbol  : class TransferFailedException
location: interface org.apache.maven.artifact.manager.WagonManager

/export/home/continuum/continuum_data/working-directory/165/src/main/java/org/apache/maven/artifact/manager/WagonManager.java:[82,15]
cannot find symbol
symbol  : class TransferFailedException
location: interface org.apache.maven.artifact.manager.WagonManager

/export/home/continuum/continuum_data/working-directory/165/src/main/java/org/apache/maven/artifact/manager/WagonManager.java:[86,15]
cannot find symbol
symbol  : class TransferFailedException
location: interface org.apache.maven.artifact.manager.WagonManager

/export/home/continuum/continuum_data/working-directory/165/src/main/java/org/apache/maven/artifact/manager/WagonManager.java:[86,40]
cannot find symbol
symbol  : class ResourceDoesNotExistException
location: interface org.apache.maven.artifact.manager.WagonManager

/export/home/continuum/continuum_data/working-directory/165/src/main/java/org/apache/maven/artifact/manager/WagonManager.java:[99,29]
cannot find symbol
symbol  : class TransferListener
location: interface org.apache.maven.artifact.manager.WagonManager

/export/home/continuum/continuum_data/working-directory/165/src/main/java/org/apache/maven/artifact/manager/WagonManager.java:[103,4]
cannot find symbol
symbol  : class ProxyInfo
location: interface org.apache.maven.artifact.manager.WagonManager

/export/home/continuum/continuum_data/working-directory/165/src/main/java/org/apache/maven/artifact/manager/WagonManager.java:[105,4]
cannot find symbol
symbol  : class AuthenticationInfo
location: interface org.apache.maven.artifact.manager.WagonManager

/export/home/continuum/continuum_data/working-directory/165/src/main/java/org/apache/maven/artifact/repository/DefaultArtifactRepository.java:[32,12]
cannot find symbol
symbol: class Repository
    extends Repository

/export/home/continuum/continuum_data/working-directory/165/src/main/java/org/apache/maven/artifact/manager/ChecksumFailedException.java:[19,30]
cannot find symbol
symbol  : class TransferFailedException
location: package org.apache.maven.wagon

/export/home/continuum/continuum_data/working-directory/165/src/main/java/org/apache/maven/artifact/manager/ChecksumFailedException.java:[27,45]
cannot find symbol
symbol: class TransferFailedException
public class ChecksumFailedException extends TransferFailedException

/export/home/continuum/continuum_data/working-directory/165/src/main/java/org/apache/maven/artifact/manager/DefaultArtifactManager.java:[26,30]
cannot find symbol
symbol  : class ConnectionException
location: package org.apache.maven.wagon

/export/home/continuum/continuum_data/working-directory/165/src/main/java/org/apache/maven/artifact/manager/DefaultArtifactManager.java:[27,30]
cannot find symbol
symbol  : class ResourceDoesNotExistException
location: package org.apache.maven.wagon

/export/home/continuum/continuum_data/working-directory/165/src/main/java/org/apache/maven/artifact/manager/DefaultArtifactManager.java:[28,30]
cannot find symbol
symbol  : class TransferFailedException
location: package org.apache.maven.wagon

/export/home/continuum/continuum_data/working-directory/165/src/main/java/org/apache/maven/artifact/manager/DefaultArtifactManager.java:[31,45]
package org.apache.maven.wagon.authentication does not exist

/export/home/continuum/continuum_data/working-directory/165/src/main/java/org/apache/maven/artifact/manager/DefaultArtifactManager.java:[32,44]
package org.apache.maven.wagon.authorization does not exist

/export/home/continuum/continuum_data/working-directory/165/src/main/java/org/apache/maven/artifact/manager/DefaultArtifactManager.java:[37,40]
package org.apache.maven.wagon.observers does not exist

/export/home/continuum/continuum_data/working-directory/165/src/main/java/org/apache/maven/artifact/manager/DefaultArtifactManager.java:[63,15]
cannot find symbol
symbol  : class TransferFailedException
location: class org.apache.maven.artifact.manager.DefaultArtifactManager

/export/home/continuum/continuum_data/working-directory/165/src/main/java/org/apache/maven/artifact/manager/DefaultArtifactManager.java:[69,15]
cannot find symbol
symbol  : class TransferFailedException
location: class org.apache.maven.artifact.manager.DefaultArtifactManager

/export/home/continuum/continuum_data/working-directory/165/src/main/java/org/apache/maven/artifact/manager/DefaultArtifactManager.java:[76,15]
cannot find symbol
symbol  : class TransferFailedException
location: class org.apache.maven.artifact.manager.DefaultArtifactManager

/export/home/continuum/continuum_data/working-directory/165/src/main/java/org/apache/maven/artifact/manager/DefaultArtifactManager.java:[188,15]
cannot find symbol
symbol  : class TransferFailedException
location: class org.apache.maven.artifact.manager.DefaultArtifactManager

/export/home/continuum/continuum_data/working-directory/165/src/main/java/org/apache/maven/artifact/manager/DefaultArtifactManager.java:[188,40]
cannot find symbol
symbol  : class ResourceDoesNotExistException
location: class org.apache.maven.artifact.manager.DefaultArtifactManager

/export/home/continuum/continuum_data/working-directory/165/src/main/java/org/apache/maven/artifact/manager/DefaultArtifactManager.java:[227,15]
cannot find symbol
symbol  : class TransferFailedException
location: class org.apache.maven.artifact.manager.DefaultArtifactManager

/export/home/continuum/continuum_data/working-directory/165/src/main/java/org/apache/maven/artifact/manager/DefaultArtifactManager.java:[227,40]
cannot find symbol
symbol  : class ResourceDoesNotExistException
location: class org.apache.maven.artifact.manager.DefaultArtifactManager

/export/home/continuum/continuum_data/working-directory/165/src/main/java/org/apache/maven/artifact/manager/DefaultArtifactManager.java:[253,15]
cannot find symbol
symbol  : class TransferFailedException
location: class org.apache.maven.artifact.manager.DefaultArtifactManager

/export/home/continuum/continuum_data/working-directory/165/src/main/java/org/apache/maven/artifact/manager/DefaultArtifactManager.java:[253,40]
cannot find symbol
symbol  : class ResourceDoesNotExistException
location: class org.apache.maven.artifact.manager.DefaultArtifactManager

/export/home/continuum/continuum_data/working-directory/165/src/main/java/org/apache/maven/artifact/manager/DefaultArtifactManager.java:[262,15]
cannot find symbol
symbol  : class TransferFailedException
location: class org.apache.maven.artifact.manager.DefaultArtifactManager

/export/home/continuum/continuum_data/working-directory/165/src/main/java/org/apache/maven/artifact/manager/DefaultArtifactManager.java:[262,40]
cannot find symbol
symbol  : class ResourceDoesNotExistException
location: class org.apache.maven.artifact.manager.DefaultArtifactManager

/export/home/continuum/continuum_data/working-directory/165/src/main/java/org/apache/maven/artifact/manager/DefaultArtifactManager.java:[458,15]
cannot find symbol
symbol  : class TransferFailedException
location: class org.apache.maven.artifact.manager.DefaultArtifactManager

/export/home/continuum/continuum_data/working-directory/165/src/main/java/org/apache/maven/artifact/manager/DefaultArtifactManager.java:[481,33]
cannot find symbol
symbol  : class ChecksumObserver
location: class org.apache.maven.artifact.manager.DefaultArtifactManager

/export/home/continuum/continuum_data/working-directory/165/src/main/java/org/apache/maven/artifact/manager/DefaultArtifactManager.java:[482,82]
cannot find symbol
symbol  : class Wagon
location: class org.apache.maven.artifact.manager.DefaultArtifactManager

/export/home/continuum/continuum_data/working-directory/165/src/main/java/org/apache/maven/artifact/manager/DefaultArtifactManager.java:[483,15]
cannot find symbol
symbol  : class ResourceDoesNotExistException
location: class org.apache.maven.artifact.manager.DefaultArtifactManager

/export/home/continuum/continuum_data/working-directory/165/src/main/java/org/apache/maven/artifact/manager/DefaultArtifactManager.java:[483,46]
cannot find symbol
symbol  : class TransferFailedException
location: class org.apache.maven.artifact.manager.DefaultArtifactManager

/export/home/continuum/continuum_data/working-directory/165/src/main/java/org/apache/maven/artifact/manager/DefaultArtifactManager.java:[483,71]
cannot find symbol
symbol  : class AuthorizationException
location: class org.apache.maven.artifact.manager.DefaultArtifactManager

/export/home/continuum/continuum_data/working-directory/165/src/main/java/org/apache/maven/artifact/repository/metadata/DefaultRepositoryMetadataManager.java:[24,30]
cannot find symbol
symbol  : class ResourceDoesNotExistException
location: package org.apache.maven.wagon

/export/home/continuum/continuum_data/working-directory/165/src/main/java/org/apache/maven/artifact/repository/metadata/DefaultRepositoryMetadataManager.java:[25,30]
cannot find symbol
symbol  : class TransferFailedException
location: package org.apache.maven.wagon

/export/home/continuum/continuum_data/working-directory/165/src/main/java/org/apache/maven/artifact/repository/metadata/DefaultRepositoryMetadataManager.java:[346,54]
cannot find symbol
symbol  : class TransferFailedException
location: class org.apache.maven.artifact.repository.metadata.DefaultRepositoryMetadataManager

/export/home/continuum/continuum_data/working-directory/165/src/main/java/org/apache/maven/artifact/deployer/DefaultArtifactDeployer.java:[89,16]
cannot find symbol
symbol  : class TransferFailedException
location: class org.apache.maven.artifact.deployer.DefaultArtifactDeployer

/export/home/continuum/continuum_data/working-directory/165/src/main/java/org/apache/maven/artifact/resolver/DefaultArtifactResolver.java:[192,28]
cannot find symbol
symbol  : class ResourceDoesNotExistException
location: class org.apache.maven.artifact.resolver.DefaultArtifactResolver

/export/home/continuum/continuum_data/working-directory/165/src/main/java/org/apache/maven/artifact/resolver/DefaultArtifactResolver.java:[196,28]
cannot find symbol
symbol  : class TransferFailedException
location: class org.apache.maven.artifact.resolver.DefaultArtifactResolver

/export/home/continuum/continuum_data/working-directory/165/src/main/java/org/apache/maven/artifact/repository/DefaultArtifactRepositoryFactory.java:[41,15]
incompatible types
found   : org.apache.maven.artifact.repository.DefaultArtifactRepository
required: org.apache.maven.artifact.repository.ArtifactRepository

/export/home/continuum/continuum_data/working-directory/165/src/main/java/org/apache/maven/artifact/repository/DefaultArtifactRepositoryFactory.java:[86,28]
put(java.lang.Object,java.lang.Object) in java.util.Map cannot be applied to (java.lang.String,org.apache.maven.artifact.repository.DefaultArtifactRepository)

/export/home/continuum/continuum_data/working-directory/165/src/main/java/org/apache/maven/artifact/repository/DefaultArtifactRepositoryFactory.java:[88,15]
incompatible types
found   : org.apache.maven.artifact.repository.DefaultArtifactRepository
required: org.apache.maven.artifact.repository.ArtifactRepository

/export/home/continuum/continuum_data/working-directory/165/src/main/java/org/apache/maven/artifact/manager/DefaultWagonManager.java:[104,8]
cannot find symbol
symbol  : class Repository
location: class org.apache.maven.artifact.manager.DefaultWagonManager

/export/home/continuum/continuum_data/working-directory/165/src/main/java/org/apache/maven/artifact/manager/DefaultWagonManager.java:[104,36]
cannot find symbol
symbol  : class Repository
location: class org.apache.maven.artifact.manager.DefaultWagonManager

/export/home/continuum/continuum_data/working-directory/165/src/main/java/org/apache/maven/artifact/manager/DefaultWagonManager.java:[159,8]
cannot access org.apache.maven.wagon.WagonException
file org/apache/maven/wagon/WagonException.class not found
        try


[INFO] ------------------------------------------------------------------------
[INFO] For more information, run Maven with the -e switch
[INFO] ------------------------------------------------------------------------
[INFO] Total time: 8 seconds
[INFO] Finished at: Tue Feb 13 17:36:43 GMT+00:00 2007
[INFO] Final Memory: 6M/48M
[INFO] ------------------------------------------------------------------------

****************************************************************************



Mime
View raw message