maven-notifications mailing list archives

Site index · List index
Message view « Date » · « Thread »
Top « Date » · « Thread »
From "Continuum@maven.zones.apache.org" <contin...@maven.zones.apache.org>
Subject [continuum] BUILD FAILURE: Maven Plugin Descriptor Model
Date Mon, 12 Feb 2007 04:32:14 GMT
Online report : http://maven.zones.apache.org/continuum/buildResult.action?buildId=6581&projectId=248
Build statistics:
  State: Failed
  Previous State: Ok
  Started at: Mon, 12 Feb 2007 04:31:56 +0000
  Finished at: Mon, 12 Feb 2007 04:32:11 +0000
  Total time: 14s
  Build Trigger: Schedule
  Build Number: 22
  Exit code: 1
  Building machine hostname: maven.zones.apache.org
  Operating system : SunOS(unknown)
  Java version : 1.5.0_10(Sun Microsystems Inc.)

****************************************************************************
SCM Changes:
****************************************************************************
Changed: jvanzyl @ Mon, 12 Feb 2007 03:00:40 +0000
Comment: [maven-release-plugin] prepare release maven-2.0.5
Files changed:
  /maven/components/branches/maven-2.0.x/maven-archiver/pom.xml ( 506241 )
  /maven/components/branches/maven-2.0.x/maven-artifact/pom.xml ( 506241 )
  /maven/components/branches/maven-2.0.x/maven-artifact-manager/pom.xml ( 506241 )
  /maven/components/branches/maven-2.0.x/maven-artifact-test/pom.xml ( 506241 )
  /maven/components/branches/maven-2.0.x/maven-core/pom.xml ( 506241 )
  /maven/components/branches/maven-2.0.x/maven-error-diagnostics/pom.xml ( 506241 )
  /maven/components/branches/maven-2.0.x/maven-model/pom.xml ( 506241 )
  /maven/components/branches/maven-2.0.x/maven-monitor/pom.xml ( 506241 )
  /maven/components/branches/maven-2.0.x/maven-plugin-api/pom.xml ( 506241 )
  /maven/components/branches/maven-2.0.x/maven-plugin-descriptor/pom.xml ( 506241 )
  /maven/components/branches/maven-2.0.x/maven-plugin-parameter-documenter/pom.xml ( 506241
)
  /maven/components/branches/maven-2.0.x/maven-plugin-registry/pom.xml ( 506241 )
  /maven/components/branches/maven-2.0.x/maven-profile/pom.xml ( 506241 )
  /maven/components/branches/maven-2.0.x/maven-project/pom.xml ( 506241 )
  /maven/components/branches/maven-2.0.x/maven-reporting/maven-reporting-api/pom.xml ( 506241
)
  /maven/components/branches/maven-2.0.x/maven-reporting/pom.xml ( 506241 )
  /maven/components/branches/maven-2.0.x/maven-repository-metadata/pom.xml ( 506241 )
  /maven/components/branches/maven-2.0.x/maven-script/maven-script-ant/pom.xml ( 506241 )
  /maven/components/branches/maven-2.0.x/maven-script/maven-script-beanshell/pom.xml ( 506241
)
  /maven/components/branches/maven-2.0.x/maven-script/pom.xml ( 506241 )
  /maven/components/branches/maven-2.0.x/maven-settings/pom.xml ( 506241 )
  /maven/components/branches/maven-2.0.x/pom.xml ( 506241 )

Changed: jvanzyl @ Mon, 12 Feb 2007 03:02:09 +0000
Comment: [maven-release-plugin] prepare for next development iteration
Files changed:
  /maven/components/branches/maven-2.0.x/maven-archiver/pom.xml ( 506245 )
  /maven/components/branches/maven-2.0.x/maven-artifact/pom.xml ( 506245 )
  /maven/components/branches/maven-2.0.x/maven-artifact-manager/pom.xml ( 506245 )
  /maven/components/branches/maven-2.0.x/maven-artifact-test/pom.xml ( 506245 )
  /maven/components/branches/maven-2.0.x/maven-core/pom.xml ( 506245 )
  /maven/components/branches/maven-2.0.x/maven-error-diagnostics/pom.xml ( 506245 )
  /maven/components/branches/maven-2.0.x/maven-model/pom.xml ( 506245 )
  /maven/components/branches/maven-2.0.x/maven-monitor/pom.xml ( 506245 )
  /maven/components/branches/maven-2.0.x/maven-plugin-api/pom.xml ( 506245 )
  /maven/components/branches/maven-2.0.x/maven-plugin-descriptor/pom.xml ( 506245 )
  /maven/components/branches/maven-2.0.x/maven-plugin-parameter-documenter/pom.xml ( 506245
)
  /maven/components/branches/maven-2.0.x/maven-plugin-registry/pom.xml ( 506245 )
  /maven/components/branches/maven-2.0.x/maven-profile/pom.xml ( 506245 )
  /maven/components/branches/maven-2.0.x/maven-project/pom.xml ( 506245 )
  /maven/components/branches/maven-2.0.x/maven-reporting/maven-reporting-api/pom.xml ( 506245
)
  /maven/components/branches/maven-2.0.x/maven-reporting/pom.xml ( 506245 )
  /maven/components/branches/maven-2.0.x/maven-repository-metadata/pom.xml ( 506245 )
  /maven/components/branches/maven-2.0.x/maven-script/maven-script-ant/pom.xml ( 506245 )
  /maven/components/branches/maven-2.0.x/maven-script/maven-script-beanshell/pom.xml ( 506245
)
  /maven/components/branches/maven-2.0.x/maven-script/pom.xml ( 506245 )
  /maven/components/branches/maven-2.0.x/maven-settings/pom.xml ( 506245 )
  /maven/components/branches/maven-2.0.x/pom.xml ( 506245 )

****************************************************************************
SCM Changes since last success:
****************************************************************************
****************************************************************************
Dependencies Changes:
****************************************************************************
No dependencies changed

****************************************************************************
Test Summary:
****************************************************************************
Tests: 0
Failures: 0
Total time: 0

****************************************************************************
Output:
****************************************************************************
[INFO] Scanning for projects...
[INFO] ----------------------------------------------------------------------------
[INFO] Building Maven Plugin Descriptor Model
[INFO]    task-segment: [clean, install]
[INFO] ----------------------------------------------------------------------------
[INFO] [clean:clean]
[INFO] Deleting directory /export/home/continuum/continuum_data/working-directory/248/target
[INFO] Deleting directory /export/home/continuum/continuum_data/working-directory/248/target/classes
[INFO] Deleting directory /export/home/continuum/continuum_data/working-directory/248/target/test-classes
[INFO] Setting property: classpath.resource.loader.class => 'org.codehaus.plexus.velocity.ContextClassLoaderResourceLoader'.
[INFO] Setting property: velocimacro.messages.on => 'false'.
[INFO] Setting property: resource.loader => 'classpath'.
[INFO] Setting property: resource.manager.logwhenfound => 'false'.
[INFO] ************************************************************** 
[INFO] Starting Jakarta Velocity v1.4
[INFO] RuntimeInstance initializing.
[INFO] Default Properties File: org/apache/velocity/runtime/defaults/velocity.properties
[INFO] Default ResourceManager initializing. (class org.apache.velocity.runtime.resource.ResourceManagerImpl)
[INFO] Resource Loader Instantiated: org.codehaus.plexus.velocity.ContextClassLoaderResourceLoader
[INFO] ClasspathResourceLoader : initialization starting.
[INFO] ClasspathResourceLoader : initialization complete.
[INFO] ResourceCache : initialized. (class org.apache.velocity.runtime.resource.ResourceCacheImpl)
[INFO] Default ResourceManager initialization complete.
[INFO] Loaded System Directive: org.apache.velocity.runtime.directive.Literal
[INFO] Loaded System Directive: org.apache.velocity.runtime.directive.Macro
[INFO] Loaded System Directive: org.apache.velocity.runtime.directive.Parse
[INFO] Loaded System Directive: org.apache.velocity.runtime.directive.Include
[INFO] Loaded System Directive: org.apache.velocity.runtime.directive.Foreach
[INFO] Created: 20 parsers.
[INFO] Velocimacro : initialization starting.
[INFO] Velocimacro : adding VMs from VM library template : VM_global_library.vm
[ERROR] ResourceManager : unable to find resource 'VM_global_library.vm' in any resource loader.
[INFO] Velocimacro : error using  VM library template VM_global_library.vm : org.apache.velocity.exception.ResourceNotFoundException:
Unable to find resource 'VM_global_library.vm'
[INFO] Velocimacro :  VM library template macro registration complete.
[INFO] Velocimacro : allowInline = true : VMs can be defined inline in templates
[INFO] Velocimacro : allowInlineToOverride = false : VMs defined inline may NOT replace previous
VM definitions
[INFO] Velocimacro : allowInlineLocal = false : VMs defined inline will be  global in scope
if allowed.
[INFO] Velocimacro : initialization complete.
[INFO] Velocity successfully started.
[INFO] [modello:java {execution: default}]
[INFO] outputDirectory: /export/home/continuum/continuum_data/working-directory/248/target/generated-sources/modello
[INFO] [modello:xpp3-reader {execution: default}]
[INFO] outputDirectory: /export/home/continuum/continuum_data/working-directory/248/target/generated-sources/modello
[INFO] [modello:xpp3-writer {execution: default}]
[INFO] outputDirectory: /export/home/continuum/continuum_data/working-directory/248/target/generated-sources/modello
[INFO] [resources:resources]
[INFO] Using default encoding to copy filtered resources.
[INFO] Resource directory does not exist: /export/home/continuum/continuum_data/working-directory/248/src/main/resources
Downloading: http://repo.mergere.com/maven2/org/apache/maven/maven-artifact/2.0.5/maven-artifact-2.0.5.pom
[WARNING] Unable to get resource from repository central (http://repo1.maven.org/maven2)
[WARNING] 
	Artifact junit:junit:jar:3.8.1:test retains local scope 'test' overriding broader scope 'compile'
	given by a dependency. If this is not intended, modify or remove the local scope.

Downloading: http://repo.mergere.com/maven2/org/apache/maven/maven-plugin-api/2.0.5/maven-plugin-api-2.0.5.pom
[WARNING] Unable to get resource from repository central (http://repo1.maven.org/maven2)
Downloading: http://repo.mergere.com/maven2/org/apache/maven/maven-artifact/2.0.5/maven-artifact-2.0.5.jar
[WARNING] Unable to get resource from repository central (http://repo1.maven.org/maven2)
Downloading: http://repo.mergere.com/maven2/org/apache/maven/maven-plugin-api/2.0.5/maven-plugin-api-2.0.5.jar
[WARNING] Unable to get resource from repository central (http://repo1.maven.org/maven2)
[INFO] ------------------------------------------------------------------------
[ERROR] BUILD ERROR
[INFO] ------------------------------------------------------------------------
[INFO] Failed to resolve artifact.

Missing:
----------
1) org.apache.maven:maven-artifact:jar:2.0.5

  Try downloading the file manually from the project website.

  Then, install it using the command: 
      mvn install:install-file -DgroupId=org.apache.maven -DartifactId=maven-artifact \
          -Dversion=2.0.5 -Dpackaging=jar -Dfile=/path/to/file

  Path to dependency: 
  	1) org.apache.maven:maven-plugin-descriptor:jar:2.0.6-SNAPSHOT
  	2) org.apache.maven:maven-artifact:jar:2.0.5

2) org.apache.maven:maven-plugin-api:jar:2.0.5

  Try downloading the file manually from the project website.

  Then, install it using the command: 
      mvn install:install-file -DgroupId=org.apache.maven -DartifactId=maven-plugin-api \
          -Dversion=2.0.5 -Dpackaging=jar -Dfile=/path/to/file

  Path to dependency: 
  	1) org.apache.maven:maven-plugin-descriptor:jar:2.0.6-SNAPSHOT
  	2) org.apache.maven:maven-plugin-api:jar:2.0.5

----------
2 required artifacts are missing.

for artifact: 
  org.apache.maven:maven-plugin-descriptor:jar:2.0.6-SNAPSHOT

from the specified remote repositories:
  central (http://repo1.maven.org/maven2),
  apache.snapshots (http://people.apache.org/repo/m2-snapshot-repository)


[INFO] ------------------------------------------------------------------------
[INFO] For more information, run Maven with the -e switch
[INFO] ------------------------------------------------------------------------
[INFO] Total time: 11 seconds
[INFO] Finished at: Mon Feb 12 04:32:11 GMT+00:00 2007
[INFO] Final Memory: 9M/59M
[INFO] ------------------------------------------------------------------------

****************************************************************************



Mime
View raw message