maven-notifications mailing list archives

Site index · List index
Message view « Date » · « Thread »
Top « Date » · « Thread »
From "Continuum@maven.zones.apache.org" <contin...@maven.zones.apache.org>
Subject [continuum] BUILD FAILURE: Maven AntRun Plugin
Date Fri, 02 Feb 2007 05:11:46 GMT
Online report : http://maven.zones.apache.org/continuum/buildResult.action?buildId=5368&projectId=4
Build statistics:
  State: Failed
  Previous State: Failed
  Started at: Fri, 2 Feb 2007 05:10:56 +0000
  Finished at: Fri, 2 Feb 2007 05:11:45 +0000
  Total time: 48s
  Build Trigger: Schedule
  Build Number: 0
  Exit code: 1
  Building machine hostname: maven.zones.apache.org
  Operating system : SunOS(unknown)
  Java version : 1.5.0_10(Sun Microsystems Inc.)

****************************************************************************
SCM Changes:
****************************************************************************
No files changed

****************************************************************************
SCM Changes since last success:
****************************************************************************
Changed: no author @ no date
Comment: no comment
Files changed:
  pom.xml ( no revision )

****************************************************************************
Dependencies Changes:
****************************************************************************
org.apache.maven.plugins:maven-plugins:8-SNAPSHOT

****************************************************************************
Test Summary:
****************************************************************************
Tests: 2
Failures: 0
Total time: 619

****************************************************************************
Output:
****************************************************************************
[INFO] Scanning for projects...
[INFO] ----------------------------------------------------------------------------
[INFO] Building Maven AntRun Plugin
[INFO]    task-segment: [clean, install]
[INFO] ----------------------------------------------------------------------------
[INFO] [clean:clean]
[INFO] Deleting directory /export/home/continuum/continuum_data/working-directory/4/target
[INFO] Deleting directory /export/home/continuum/continuum_data/working-directory/4/target/classes
[INFO] Deleting directory /export/home/continuum/continuum_data/working-directory/4/target/test-classes
[INFO] [plugin:descriptor]
[INFO] Using 2 extractors.
[INFO] Applying extractor for language: java
[INFO] Extractor for language: java found 1 mojo descriptors.
[INFO] Applying extractor for language: bsh
[INFO] Extractor for language: bsh found 0 mojo descriptors.
[INFO] [resources:resources]
[INFO] Using default encoding to copy filtered resources.
[INFO] Resource directory does not exist: /export/home/continuum/continuum_data/working-directory/4/src/main/resources
[INFO] [compiler:compile]
[INFO] Compiling 2 source files to /export/home/continuum/continuum_data/working-directory/4/target/classes
[INFO] [resources:testResources]
[INFO] Using default encoding to copy filtered resources.
[INFO] Copying 2 resources
[INFO] [compiler:testCompile]
[INFO] Compiling 1 source file to /export/home/continuum/continuum_data/working-directory/4/target/test-classes
[INFO] [surefire:test]
[INFO] Surefire report directory: /export/home/continuum/continuum_data/working-directory/4/target/surefire-reports

-------------------------------------------------------
 T E S T S
-------------------------------------------------------
Running org.apache.maven.plugin.antrun.AntRunMojoTest
Tests run: 2, Failures: 0, Errors: 0, Skipped: 0, Time elapsed: 0.63 sec

Results :

Tests run: 2, Failures: 0, Errors: 0, Skipped: 0

[INFO] [jar:jar]
[INFO] Building jar: /export/home/continuum/continuum_data/working-directory/4/target/maven-antrun-plugin-1.2-SNAPSHOT.jar
[INFO] [plugin:addPluginArtifactMetadata]
[INFO] [invoker:run {execution: integration-test}]
[INFO] Building: test1/pom.xml
[INFO] ...FAILED[code=1]. See /export/home/continuum/continuum_data/working-directory/4/src/it/test1/build.log
for details.
[INFO] Building: test2/pom.xml
[INFO] ...SUCCESS.
[INFO] Building: test3/pom.xml
[INFO] ...FAILED[code=1]. See /export/home/continuum/continuum_data/working-directory/4/src/it/test3/build.log
for details.
[INFO] Building: test4/pom.xml
[INFO] ...SUCCESS.
[INFO] Building: test5/pom.xml
[INFO] ...SUCCESS.
[INFO] Building: test6/pom.xml
[INFO] ...SUCCESS.
[INFO] Building: pom.xml
[INFO] ...FAILED[code=1]. See /export/home/continuum/continuum_data/working-directory/4/src/it/build.log
for details.
[INFO] 

---------------------------------------
Execution Summary:
Builds Passing: 4
Builds Failing: 3
---------------------------------------

The following builds failed:

*  test1/pom.xml
*  test3/pom.xml
*  pom.xml

[INFO] ------------------------------------------------------------------------
[ERROR] BUILD FAILURE
[INFO] ------------------------------------------------------------------------
[INFO] : org.apache.maven.plugin.invoker.InvokerMojo@1f8acdc
One or more builds failed.

3 builds failed.
[INFO] ------------------------------------------------------------------------
[INFO] For more information, run Maven with the -e switch
[INFO] ------------------------------------------------------------------------
[INFO] Total time: 47 seconds
[INFO] Finished at: Fri Feb 02 05:11:45 GMT+00:00 2007
[INFO] Final Memory: 11M/66M
[INFO] ------------------------------------------------------------------------

****************************************************************************



Mime
View raw message