maven-notifications mailing list archives

Site index · List index
Message view « Date » · « Thread »
Top « Date » · « Thread »
From "Continuum@maven.zones.apache.org" <contin...@maven.zones.apache.org>
Subject [continuum] BUILD SUCCESSFUL: Maven Artifact Manager
Date Fri, 09 Feb 2007 22:09:56 GMT
Online report : http://maven.zones.apache.org/continuum/buildResult.action?buildId=6283&projectId=165
Build statistics:
  State: Ok
  Previous State: Failed
  Started at: Fri, 9 Feb 2007 22:09:40 +0000
  Finished at: Fri, 9 Feb 2007 22:09:53 +0000
  Total time: 13s
  Build Trigger: Schedule
  Build Number: 53
  Exit code: 0
  Building machine hostname: maven.zones.apache.org
  Operating system : SunOS(unknown)
  Java version : 1.5.0_10(Sun Microsystems Inc.)

****************************************************************************
SCM Changes:
****************************************************************************
Changed: joakime @ Fri, 9 Feb 2007 21:53:27 +0000
Comment: * Migrating to wagon-manager 1.0-beta-3-SNAPSHOT
* Created org.apache.maven.artifact.manager.ArtifactManager
* Deprecated org.apache.maven.artifact.manager.WagonManager in favor of new ArtifactManager
* Updated the rest of maven to utilize this new ArtifactManager.
* The default wagon providers list is now managed from within wagon-manager's dependency list.
Files changed:
  /maven/components/trunk/maven-artifact-manager/pom.xml ( 505520 )
  /maven/components/trunk/maven-artifact-manager/src/main/java/org/apache/maven/artifact/deployer/DefaultArtifactDeployer.java
( 505520 )
  /maven/components/trunk/maven-artifact-manager/src/main/java/org/apache/maven/artifact/manager/ArtifactManager.java
( 505520 )
  /maven/components/trunk/maven-artifact-manager/src/main/java/org/apache/maven/artifact/manager/DefaultArtifactManager.java
(from /maven/components/trunk/maven-artifact-manager/src/main/java/org/apache/maven/artifact/manager/DefaultWagonManager.java:504920)
( 505520 )
  /maven/components/trunk/maven-artifact-manager/src/main/java/org/apache/maven/artifact/manager/DefaultWagonManager.java
( 505520 )
  /maven/components/trunk/maven-artifact-manager/src/main/java/org/apache/maven/artifact/manager/WagonConfigurationException.java
( 505520 )
  /maven/components/trunk/maven-artifact-manager/src/main/java/org/apache/maven/artifact/manager/WagonManager.java
( 505520 )
  /maven/components/trunk/maven-artifact-manager/src/main/java/org/apache/maven/artifact/repository/metadata/DefaultRepositoryMetadataManager.java
( 505520 )
  /maven/components/trunk/maven-artifact-manager/src/main/java/org/apache/maven/artifact/resolver/DefaultArtifactResolver.java
( 505520 )
  /maven/components/trunk/maven-artifact-manager/src/main/java/org/apache/maven/artifact/transform/AbstractVersionTransformation.java
( 505520 )
  /maven/components/trunk/maven-artifact-manager/src/main/java/org/apache/maven/artifact/transform/SnapshotTransformation.java
( 505520 )
  /maven/components/trunk/maven-artifact-manager/src/main/resources/META-INF/plexus/components.xml
( 505520 )
  /maven/components/trunk/maven-artifact-manager/src/test/java/org/apache/maven/artifact/manager/DefaultArtifactManagerTest.java
( 505520 )
  /maven/components/trunk/maven-artifact-manager/src/test/java/org/apache/maven/artifact/manager/DefaultWagonManagerTest.java
( 505520 )
  /maven/components/trunk/maven-artifact-manager/src/test/resources/org/apache/maven/artifact/manager/DefaultWagonManagerTest.xml
( 505520 )
  /maven/components/trunk/maven-cli/pom.xml ( 505520 )
  /maven/components/trunk/maven-cli/src/main/java/org/apache/maven/cli/AbstractConsoleDownloadMonitor.java
( 505520 )
  /maven/components/trunk/maven-cli/src/main/java/org/apache/maven/cli/BatchModeDownloadMonitor.java
( 505520 )
  /maven/components/trunk/maven-cli/src/main/java/org/apache/maven/cli/ConsoleDownloadMonitor.java
( 505520 )
  /maven/components/trunk/maven-cli/src/main/java/org/apache/maven/cli/MavenCli.java ( 505520
)
  /maven/components/trunk/maven-cli/src/test/java/org/apache/maven/cli/AbstractConsoleDownloadMonitorTest.java
( 505520 )
  /maven/components/trunk/maven-core/pom.xml ( 505520 )
  /maven/components/trunk/maven-core/src/main/java/org/apache/maven/MavenTransferListener.java
( 505520 )
  /maven/components/trunk/maven-core/src/main/java/org/apache/maven/extension/DefaultBuildExtensionScanner.java
( 505520 )
  /maven/components/trunk/maven-core/src/main/java/org/apache/maven/extension/DefaultExtensionManager.java
( 505520 )
  /maven/components/trunk/maven-core/src/main/java/org/apache/maven/extension/ExtensionManager.java
( 505520 )
  /maven/components/trunk/maven-core/src/main/java/org/apache/maven/usability/ArtifactNotFoundDiagnoser.java
( 505520 )
  /maven/components/trunk/maven-core/src/main/java/org/apache/maven/usability/ArtifactResolverDiagnoser.java
( 505520 )
  /maven/components/trunk/maven-core/src/main/resources/META-INF/plexus/components.xml ( 505520
)
  /maven/components/trunk/maven-embedder/pom.xml ( 505520 )
  /maven/components/trunk/maven-embedder/src/main/java/org/apache/maven/embedder/MavenEmbedder.java
( 505520 )
  /maven/components/trunk/maven-embedder/src/main/java/org/apache/maven/embedder/execution/DefaultMavenExecutionRequestDefaultsPopulator.java
( 505520 )
  /maven/components/trunk/maven-embedder/src/main/resources/META-INF/plexus/components.xml
( 505520 )
  /maven/components/trunk/maven-embedder/src/test/java/org/apache/maven/embedder/MavenEmbedderTest.java
( 505520 )
  /maven/components/trunk/maven-project/pom.xml ( 505520 )
  /maven/components/trunk/maven-project/src/main/java/org/apache/maven/project/DefaultMavenProjectBuilder.java
( 505520 )
  /maven/components/trunk/maven-project/src/main/resources/META-INF/plexus/components.xml
( 505520 )
  /maven/components/trunk/maven-project/src/test/resources/org/apache/maven/project/ProjectClasspathTest.xml
( 505520 )
  /maven/components/trunk/maven-settings/src/main/mdo/settings.mdo ( 505520 )
  /maven/components/trunk/pom.xml ( 505520 )

****************************************************************************
SCM Changes since last success:
****************************************************************************
****************************************************************************
Dependencies Changes:
****************************************************************************
org.apache.maven:maven-repository-metadata:2.1-SNAPSHOT

org.apache.maven.wagon:wagon-file:1.0-beta-3-SNAPSHOT

org.apache.maven:maven-artifact:2.1-SNAPSHOT

org.apache.maven.wagon:wagon-provider-api:1.0-beta-3-SNAPSHOT

org.apache.maven:maven:2.1-SNAPSHOT

****************************************************************************
Test Summary:
****************************************************************************
Tests: 12
Failures: 0
Total time: 1806

****************************************************************************
Output:
****************************************************************************
[INFO] Scanning for projects...
[INFO] ----------------------------------------------------------------------------
[INFO] Building Maven Artifact Manager
[INFO]    task-segment: [clean, install]
[INFO] ----------------------------------------------------------------------------
[INFO] [clean:clean]
[INFO] Deleting directory /export/home/continuum/continuum_data/working-directory/165/target
[INFO] Deleting directory /export/home/continuum/continuum_data/working-directory/165/target/classes
[INFO] Deleting directory /export/home/continuum/continuum_data/working-directory/165/target/test-classes
[INFO] Deleting directory /export/home/continuum/continuum_data/working-directory/165/target/site
[INFO] [resources:resources]
[INFO] Using default encoding to copy filtered resources.
[INFO] Copying 1 resource
[INFO] snapshot org.apache.maven.wagon:wagon-manager:1.0-beta-3-SNAPSHOT: checking for updates
from codehaus.snapshots
[INFO] snapshot org.apache.maven.wagon:wagon-manager:1.0-beta-3-SNAPSHOT: checking for updates
from apache.snapshots
Downloading: http://people.apache.org/repo/m2-snapshot-repository/org/apache/maven/wagon/wagon-manager/1.0-beta-3-SNAPSHOT/wagon-manager-1.0-beta-3-20070209.213958-1.pom
2K downloaded
[WARNING] 
	Artifact junit:junit:jar:3.8.1:test retains local scope 'test' overriding broader scope 'compile'
	given by a dependency. If this is not intended, modify or remove the local scope.

[INFO] snapshot org.apache.maven.wagon:wagon-webdav:1.0-beta-3-SNAPSHOT: checking for updates
from codehaus.snapshots
[INFO] snapshot org.apache.maven.wagon:wagon-webdav:1.0-beta-3-SNAPSHOT: checking for updates
from apache.snapshots
Downloading: http://people.apache.org/repo/m2-snapshot-repository/org/apache/maven/wagon/wagon-webdav/1.0-beta-3-SNAPSHOT/wagon-webdav-1.0-beta-3-20070209.213958-2.pom
1K downloaded
[INFO] snapshot org.apache.maven.wagon:wagon-ftp:1.0-beta-3-SNAPSHOT: checking for updates
from codehaus.snapshots
[INFO] snapshot org.apache.maven.wagon:wagon-ftp:1.0-beta-3-SNAPSHOT: checking for updates
from apache.snapshots
Downloading: http://people.apache.org/repo/m2-snapshot-repository/org/apache/maven/wagon/wagon-ftp/1.0-beta-3-SNAPSHOT/wagon-ftp-1.0-beta-3-20070209.213958-2.pom
1K downloaded
Downloading: http://people.apache.org/repo/m2-snapshot-repository/org/apache/maven/wagon/wagon-ftp/1.0-beta-3-SNAPSHOT/wagon-ftp-1.0-beta-3-20070209.213958-2.jar
8K downloaded
Downloading: http://people.apache.org/repo/m2-snapshot-repository/org/apache/maven/wagon/wagon-webdav/1.0-beta-3-SNAPSHOT/wagon-webdav-1.0-beta-3-20070209.213958-2.jar
13K downloaded
Downloading: http://people.apache.org/repo/m2-snapshot-repository/org/apache/maven/wagon/wagon-manager/1.0-beta-3-SNAPSHOT/wagon-manager-1.0-beta-3-20070209.213958-1.jar
22K downloaded
[INFO] [compiler:compile]
[INFO] Compiling 24 source files to /export/home/continuum/continuum_data/working-directory/165/target/classes
[INFO] [resources:testResources]
[INFO] Using default encoding to copy filtered resources.
[INFO] Copying 5 resources
[INFO] [compiler:testCompile]
[INFO] Compiling 12 source files to /export/home/continuum/continuum_data/working-directory/165/target/test-classes
[INFO] [surefire:test]
[INFO] Surefire report directory: /export/home/continuum/continuum_data/working-directory/165/target/surefire-reports

-------------------------------------------------------
 T E S T S
-------------------------------------------------------
Running org.apache.maven.artifact.manager.DefaultArtifactManagerTest
[WARNING] *** CHECKSUM FAILED - Error retrieving checksum file for test/jars/testLib-1.0.jar
- IGNORING
Tests run: 2, Failures: 0, Errors: 0, Skipped: 0, Time elapsed: 1.097 sec
Running org.apache.maven.artifact.installer.ArtifactInstallerTest
[INFO] Installing /export/home/continuum/continuum_data/working-directory/165/src/test/resources/artifact-install/artifact-1.0.jar
to /export/home/continuum/continuum_data/working-directory/165/target/test-classes/repositories/installer/local-repository/org.apache.maven/jars/artifact-1.0.jar
Tests run: 1, Failures: 0, Errors: 0, Skipped: 0, Time elapsed: 0.144 sec
Running org.apache.maven.artifact.repository.metadata.AbstractRepositoryMetadataTest
Tests run: 2, Failures: 0, Errors: 0, Skipped: 0, Time elapsed: 0.111 sec
Running org.apache.maven.artifact.deployer.ArtifactDeployerTest
[INFO] Retrieving previous metadata from test
[INFO] Uploading repository metadata for: 'artifact org.apache.maven:artifact'
Tests run: 1, Failures: 0, Errors: 0, Skipped: 0, Time elapsed: 0.108 sec
Running org.apache.maven.artifact.resolver.ArtifactResolverTest
[WARNING] *** CHECKSUM FAILED - Error retrieving checksum file for org.apache.maven/jars/b-1.0.jar
- IGNORING
[WARNING] *** CHECKSUM FAILED - Error retrieving checksum file for org.apache.maven/jars/j-1.0.jar
- IGNORING
[WARNING] *** CHECKSUM FAILED - Error retrieving checksum file for org.apache.maven/jars/i-1.0.jar
- IGNORING
[WARNING] Unable to get resource 'org.apache.maven:k:jar:1.0' from repository test (file:///export/home/continuum/continuum_data/working-directory/165/target/test-classes/repositories/resolver/remote-repository)
[WARNING] *** CHECKSUM FAILED - Error retrieving checksum file for org.apache.maven/jars/l-1.0.jar
- IGNORING
Tests run: 6, Failures: 0, Errors: 0, Skipped: 0, Time elapsed: 0.369 sec

Results :

Tests run: 12, Failures: 0, Errors: 0, Skipped: 0

[INFO] [jar:jar]
[INFO] Building jar: /export/home/continuum/continuum_data/working-directory/165/target/maven-artifact-manager-2.1-SNAPSHOT.jar
[INFO] [install:install]
[INFO] Installing /export/home/continuum/continuum_data/working-directory/165/target/maven-artifact-manager-2.1-SNAPSHOT.jar
to /export/home/continuum/maven-repo-local/org/apache/maven/maven-artifact-manager/2.1-SNAPSHOT/maven-artifact-manager-2.1-SNAPSHOT.jar
[INFO] ------------------------------------------------------------------------
[INFO] BUILD SUCCESSFUL
[INFO] ------------------------------------------------------------------------
[INFO] Total time: 11 seconds
[INFO] Finished at: Fri Feb 09 22:09:53 GMT+00:00 2007
[INFO] Final Memory: 9M/69M
[INFO] ------------------------------------------------------------------------

****************************************************************************



Mime
View raw message