maven-notifications mailing list archives

Site index · List index
Message view « Date » · « Thread »
Top « Date » · « Thread »
From "Continuum@maven.zones.apache.org" <contin...@maven.zones.apache.org>
Subject [continuum] BUILD FAILURE: Maven Tools
Date Tue, 13 Feb 2007 16:29:55 GMT
Online report : http://maven.zones.apache.org/continuum/buildResult.action?buildId=6895&projectId=186
Build statistics:
  State: Failed
  Previous State: Failed
  Started at: Tue, 13 Feb 2007 16:29:45 +0000
  Finished at: Tue, 13 Feb 2007 16:29:53 +0000
  Total time: 7s
  Build Trigger: Schedule
  Build Number: 59
  Exit code: 1
  Building machine hostname: maven.zones.apache.org
  Operating system : SunOS(unknown)
  Java version : 1.5.0_10(Sun Microsystems Inc.)

****************************************************************************
SCM Changes:
****************************************************************************
No files changed

****************************************************************************
SCM Changes since last success:
****************************************************************************
****************************************************************************
Dependencies Changes:
****************************************************************************
org.apache.maven:maven-settings:2.1-SNAPSHOT

****************************************************************************
Test Summary:
****************************************************************************
Tests: 0
Failures: 0
Total time: 0

****************************************************************************
Output:
****************************************************************************
[INFO] Scanning for projects...
[INFO] ----------------------------------------------------------------------------
[INFO] Building Maven Tools
[INFO]    task-segment: [clean, install]
[INFO] ----------------------------------------------------------------------------
[INFO] [clean:clean]
[INFO] Deleting directory /export/home/continuum/continuum_data/working-directory/186/target
[INFO] Deleting directory /export/home/continuum/continuum_data/working-directory/186/target/classes
[INFO] Deleting directory /export/home/continuum/continuum_data/working-directory/186/target/test-classes
[INFO] Deleting directory /export/home/continuum/continuum_data/working-directory/186/target/site
[INFO] [resources:resources]
[INFO] Using default encoding to copy filtered resources.
[INFO] Copying 1 resource
[WARNING] POM for 'org.apache.maven.wagon:wagon-manager:pom:1.0-beta-3-SNAPSHOT:compile' is
invalid. It will be ignored for artifact resolution. Reason: Failed to validate POM
[WARNING] 
	Artifact junit:junit:jar:3.8.1:test retains local scope 'test' overriding broader scope 'compile'
	given by a dependency. If this is not intended, modify or remove the local scope.

[INFO] [compiler:compile]
[INFO] Compiling 2 source files to /export/home/continuum/continuum_data/working-directory/186/target/classes
[INFO] ------------------------------------------------------------------------
[ERROR] BUILD FAILURE
[INFO] ------------------------------------------------------------------------
[INFO] Compilation failure
/export/home/continuum/continuum_data/working-directory/186/src/main/java/org/apache/maven/DefaultMavenTools.java:[71,12]
cannot access org.apache.maven.wagon.repository.Repository
file org/apache/maven/wagon/repository/Repository.class not found
            new DefaultArtifactRepository( repositoryId, repositoryUrl, repositoryLayout );



/export/home/continuum/continuum_data/working-directory/186/src/main/java/org/apache/maven/DefaultMavenTools.java:[71,12]
cannot access org.apache.maven.wagon.repository.Repository
file org/apache/maven/wagon/repository/Repository.class not found
            new DefaultArtifactRepository( repositoryId, repositoryUrl, repositoryLayout );


[INFO] ------------------------------------------------------------------------
[INFO] For more information, run Maven with the -e switch
[INFO] ------------------------------------------------------------------------
[INFO] Total time: 5 seconds
[INFO] Finished at: Tue Feb 13 16:29:53 GMT+00:00 2007
[INFO] Final Memory: 6M/48M
[INFO] ------------------------------------------------------------------------

****************************************************************************



Mime
View raw message