maven-notifications mailing list archives

Site index · List index
Message view « Date » · « Thread »
Top « Date » · « Thread »
From "Continuum@maven.zones.apache.org" <contin...@maven.zones.apache.org>
Subject [continuum] BUILD FAILURE: Archiva Core
Date Mon, 12 Feb 2007 06:12:23 GMT
Online report : http://maven.zones.apache.org/continuum/buildResult.action?buildId=6608&projectId=75
Build statistics:
  State: Failed
  Previous State: Ok
  Started at: Mon, 12 Feb 2007 06:11:46 +0000
  Finished at: Mon, 12 Feb 2007 06:12:11 +0000
  Total time: 24s
  Build Trigger: Schedule
  Build Number: 31
  Exit code: 1
  Building machine hostname: maven.zones.apache.org
  Operating system : SunOS(unknown)
  Java version : 1.5.0_10(Sun Microsystems Inc.)

****************************************************************************
SCM Changes:
****************************************************************************
Changed: brett @ Mon, 12 Feb 2007 05:34:22 +0000
Comment: more practical use of configuration change listeners
Files changed:
  /maven/archiva/trunk/archiva-configuration/src/main/java/org/apache/maven/archiva/configuration/DefaultArchivaConfiguration.java
( 506292 )
  /maven/archiva/trunk/archiva-configuration/src/main/mdo/configuration.mdo ( 506292 )
  /maven/archiva/trunk/archiva-core/src/main/java/org/apache/maven/archiva/repositories/DefaultActiveManagedRepositories.java
( 506292 )
  /maven/archiva/trunk/archiva-core/src/main/java/org/apache/maven/archiva/scheduler/DefaultRepositoryTaskScheduler.java
( 506292 )
  /maven/archiva/trunk/archiva-webapp/src/main/java/org/apache/maven/archiva/web/repository/RepositoryServlet.java
( 506292 )

****************************************************************************
SCM Changes since last success:
****************************************************************************
****************************************************************************
Dependencies Changes:
****************************************************************************
org.apache.maven.archiva:archiva-discoverer:1.0-SNAPSHOT

org.apache.maven.archiva:archiva-proxy:1.0-SNAPSHOT

org.apache.maven.archiva:archiva-reports-standard:1.0-SNAPSHOT

org.apache.maven.archiva:archiva-converter:1.0-SNAPSHOT

org.apache.maven.archiva:archiva:1.0-SNAPSHOT

****************************************************************************
Test Summary:
****************************************************************************
Tests: 0
Failures: 0
Total time: 0

****************************************************************************
Output:
****************************************************************************
[INFO] Scanning for projects...
[INFO] ----------------------------------------------------------------------------
[INFO] Building Archiva Core
[INFO]    task-segment: [clean, install]
[INFO] ----------------------------------------------------------------------------
[INFO] [clean:clean]
[INFO] Deleting directory /export/home/continuum/continuum_data/working-directory/75/target
[INFO] Deleting directory /export/home/continuum/continuum_data/working-directory/75/target/classes
[INFO] Deleting directory /export/home/continuum/continuum_data/working-directory/75/target/test-classes
[INFO] [plexus:descriptor {execution: default}]
[INFO] [resources:resources]
[INFO] Using default encoding to copy filtered resources.
[INFO] Copying 1 resource
[INFO] Copying 1 resource
[INFO] [plexus:merge-descriptors {execution: default}]
[WARNING] 
	Artifact junit:junit:jar:3.8.1:test retains local scope 'test' overriding broader scope 'compile'
	given by a dependency. If this is not intended, modify or remove the local scope.

[WARNING] 
	Artifact org.codehaus.plexus:plexus-container-default:jar:1.0-alpha-17:test retains local
scope 'test' overriding broader scope 'compile'
	given by a dependency. If this is not intended, modify or remove the local scope.

[INFO] [compiler:compile]
[INFO] Compiling 17 source files to /export/home/continuum/continuum_data/working-directory/75/target/classes
[INFO] ------------------------------------------------------------------------
[ERROR] BUILD FAILURE
[INFO] ------------------------------------------------------------------------
[INFO] Compilation failure

/export/home/continuum/continuum_data/working-directory/75/src/main/java/org/apache/maven/archiva/scheduler/DefaultRepositoryTaskScheduler.java:[54,7]
org.apache.maven.archiva.scheduler.DefaultRepositoryTaskScheduler is not abstract and does
not override abstract method notifyOfConfigurationChange(org.codehaus.plexus.registry.Registry)
in org.codehaus.plexus.registry.RegistryListener

/export/home/continuum/continuum_data/working-directory/75/src/main/java/org/apache/maven/archiva/repositories/DefaultActiveManagedRepositories.java:[56,7]
org.apache.maven.archiva.repositories.DefaultActiveManagedRepositories is not abstract and
does not override abstract method notifyOfConfigurationChange(org.codehaus.plexus.registry.Registry)
in org.codehaus.plexus.registry.RegistryListener


[INFO] ------------------------------------------------------------------------
[INFO] For more information, run Maven with the -e switch
[INFO] ------------------------------------------------------------------------
[INFO] Total time: 22 seconds
[INFO] Finished at: Mon Feb 12 06:12:10 GMT+00:00 2007
[INFO] Final Memory: 11M/66M
[INFO] ------------------------------------------------------------------------

****************************************************************************



Mime
View raw message