maven-notifications mailing list archives

Site index · List index
Message view « Date » · « Thread »
Top « Date » · « Thread »
From "Continuum@maven.zones.apache.org" <contin...@maven.zones.apache.org>
Subject [continuum] BUILD FAILURE: Archiva Configuration
Date Mon, 12 Feb 2007 13:21:11 GMT
Online report : http://maven.zones.apache.org/continuum/buildResult.action?buildId=6650&projectId=76
Build statistics:
  State: Failed
  Previous State: Failed
  Started at: Mon, 12 Feb 2007 13:20:46 +0000
  Finished at: Mon, 12 Feb 2007 13:21:08 +0000
  Total time: 21s
  Build Trigger: Schedule
  Build Number: 30
  Exit code: 1
  Building machine hostname: maven.zones.apache.org
  Operating system : SunOS(unknown)
  Java version : 1.5.0_10(Sun Microsystems Inc.)

****************************************************************************
SCM Changes:
****************************************************************************
Changed: brett @ Mon, 12 Feb 2007 13:11:22 +0000
Comment: don't assume we are being sent back the same config object
Files changed:
  /maven/archiva/trunk/archiva-configuration/src/main/java/org/apache/maven/archiva/configuration/DefaultArchivaConfiguration.java
( 506438 )

****************************************************************************
SCM Changes since last success:
****************************************************************************
Changed: brett @ Mon, 12 Feb 2007 06:12:07 +0000
Comment: fix back-to-front expressions
Files changed:
  /maven/archiva/trunk/archiva-configuration/src/main/mdo/configuration.mdo ( 506313 )

Changed: brett @ Mon, 12 Feb 2007 05:34:22 +0000
Comment: more practical use of configuration change listeners
Files changed:
  /maven/archiva/trunk/archiva-configuration/src/main/java/org/apache/maven/archiva/configuration/DefaultArchivaConfiguration.java
( 506292 )
  /maven/archiva/trunk/archiva-configuration/src/main/mdo/configuration.mdo ( 506292 )
  /maven/archiva/trunk/archiva-core/src/main/java/org/apache/maven/archiva/repositories/DefaultActiveManagedRepositories.java
( 506292 )
  /maven/archiva/trunk/archiva-core/src/main/java/org/apache/maven/archiva/scheduler/DefaultRepositoryTaskScheduler.java
( 506292 )
  /maven/archiva/trunk/archiva-webapp/src/main/java/org/apache/maven/archiva/web/repository/RepositoryServlet.java
( 506292 )

Changed: brett @ Mon, 12 Feb 2007 05:47:16 +0000
Comment: fix NPE
Files changed:
  /maven/archiva/trunk/archiva-configuration/src/main/mdo/configuration.mdo ( 506295 )

Changed: brett @ Mon, 12 Feb 2007 05:55:51 +0000
Comment: fix NPE
Files changed:
  /maven/archiva/trunk/archiva-configuration/src/main/mdo/configuration.mdo ( 506300 )

****************************************************************************
Dependencies Changes:
****************************************************************************
org.apache.maven.archiva:archiva:1.0-SNAPSHOT

****************************************************************************
Test Summary:
****************************************************************************
Tests: 0
Failures: 0
Total time: 0

****************************************************************************
Output:
****************************************************************************
[INFO] Scanning for projects...
[INFO] ----------------------------------------------------------------------------
[INFO] Building Archiva Configuration
[INFO]    task-segment: [clean, install]
[INFO] ----------------------------------------------------------------------------
[INFO] [clean:clean]
[INFO] Deleting directory /export/home/continuum/continuum_data/working-directory/76/target
[INFO] Deleting directory /export/home/continuum/continuum_data/working-directory/76/target/classes
[INFO] Deleting directory /export/home/continuum/continuum_data/working-directory/76/target/test-classes
[INFO] [modello:java {execution: default}]
[INFO] outputDirectory: /export/home/continuum/continuum_data/working-directory/76/target/generated-sources/modello
[INFO] Generating current version: 1.0.0
[INFO] [modello:registry-reader {execution: default}]
[INFO] outputDirectory: /export/home/continuum/continuum_data/working-directory/76/target/generated-sources/modello
[INFO] Generating current version: 1.0.0
[INFO] [modello:registry-writer {execution: default}]
[INFO] outputDirectory: /export/home/continuum/continuum_data/working-directory/76/target/generated-sources/modello
[INFO] Generating current version: 1.0.0
[INFO] [plexus:descriptor {execution: default}]
[INFO] [resources:resources]
[INFO] Using default encoding to copy filtered resources.
[INFO] Copying 1 resource
[INFO] Copying 1 resource
[INFO] [plexus:merge-descriptors {execution: default}]
[WARNING] 
	Artifact junit:junit:jar:3.8.1:test retains local scope 'test' overriding broader scope 'compile'
	given by a dependency. If this is not intended, modify or remove the local scope.

[INFO] [compiler:compile]
[INFO] Compiling 12 source files to /export/home/continuum/continuum_data/working-directory/76/target/classes
[INFO] ------------------------------------------------------------------------
[ERROR] BUILD FAILURE
[INFO] ------------------------------------------------------------------------
[INFO] Compilation failure
/export/home/continuum/continuum_data/working-directory/76/src/main/java/org/apache/maven/archiva/configuration/DefaultArchivaConfiguration.java:[35,7]
org.apache.maven.archiva.configuration.DefaultArchivaConfiguration is not abstract and does
not override abstract method notifyOfConfigurationChange(org.codehaus.plexus.registry.Registry)
in org.codehaus.plexus.registry.RegistryListener



/export/home/continuum/continuum_data/working-directory/76/src/main/java/org/apache/maven/archiva/configuration/DefaultArchivaConfiguration.java:[35,7]
org.apache.maven.archiva.configuration.DefaultArchivaConfiguration is not abstract and does
not override abstract method notifyOfConfigurationChange(org.codehaus.plexus.registry.Registry)
in org.codehaus.plexus.registry.RegistryListener


[INFO] ------------------------------------------------------------------------
[INFO] For more information, run Maven with the -e switch
[INFO] ------------------------------------------------------------------------
[INFO] Total time: 19 seconds
[INFO] Finished at: Mon Feb 12 13:21:07 GMT+00:00 2007
[INFO] Final Memory: 12M/68M
[INFO] ------------------------------------------------------------------------

****************************************************************************



Mime
View raw message