maven-notifications mailing list archives

Site index · List index
Message view « Date » · « Thread »
Top « Date » · « Thread »
From Continuum Build Server <contin...@ci.codehaus.org>
Subject [continuum] BUILD SUCCESSFUL: Doxia Site Renderer Component
Date Tue, 01 Aug 2006 14:13:36 GMT
Online report : http://ci.codehaus.org/continuum-maven/servlet/continuum/target/ProjectBuild.vm/view/ProjectBuild/id/119/buildId/7265
Build statistics:
  State: Ok
  Previous State: Error
  Started at: Tue, 1 Aug 2006 07:01:18 -0700
  Finished at: Tue, 1 Aug 2006 07:13:36 -0700
  Total time: 12m 17s
  Build Trigger: Schedule
  Exit code: 0
  Building machine hostname: cheddar.simulalabs.com
  Operating system : Linux(unknown)
  Java version : 1.5.0_03(Sun Microsystems Inc.)

Changes
         vsiveton          o reviewed XdocSink and XhtmlSink for nesting items in list and
add unit tests (thanks trygve)
o HtmlToolsTest is now a PlexusTestCase
o updated doxia-site-renderer test case
- added htmlunit 1.9 as dependency in test scope to test renderer files
- updated template and site descriptor
- added an xml test file to test nested items in list
             /maven/doxia/trunk/doxia-core/src/main/java/org/apache/maven/doxia/module/xdoc/XdocSink.java
            /maven/doxia/trunk/doxia-core/src/main/java/org/apache/maven/doxia/module/xhtml/XhtmlSink.java
            /maven/doxia/trunk/doxia-core/src/test/java/org/apache/maven/doxia/module/HtmlToolsTest.java
            /maven/doxia/trunk/doxia-site-renderer/pom.xml
            /maven/doxia/trunk/doxia-site-renderer/src/test/java/org/apache/maven/doxia/siterenderer/DefaultSiteRendererTest.java
            /maven/doxia/trunk/doxia-site-renderer/src/test/resources/default-site.vm
            /maven/doxia/trunk/doxia-site-renderer/src/test/resources/log4j.properties
            /maven/doxia/trunk/doxia-site-renderer/src/test/site/site.xml
            /maven/doxia/trunk/doxia-site-renderer/src/test/site/xdoc
            /maven/doxia/trunk/doxia-site-renderer/src/test/site/xdoc/nestedItems.xml
        
****************************************************************************
Output:
****************************************************************************
[INFO] Scanning for projects...
[INFO] ----------------------------------------------------------------------------
[INFO] Building Doxia Site Renderer Component
[INFO]    task-segment: [clean, install]
[INFO] ----------------------------------------------------------------------------
[INFO] [clean:clean]
[INFO] Deleting directory /home/continuum/continuum-maven/working-directory/119/target
[INFO] Deleting directory /home/continuum/continuum-maven/working-directory/119/target/classes
[INFO] Deleting directory /home/continuum/continuum-maven/working-directory/119/target/test-classes
[INFO] Deleting directory /home/continuum/continuum-maven/working-directory/119/target/site
[INFO] [plexus:descriptor {execution: default}]
[INFO] [resources:resources]
[INFO] Using default encoding to copy filtered resources.
Downloading: http://repo1.maven.org/maven2/htmlunit/htmlunit/1.9/htmlunit-1.9.pom
9K downloaded
Downloading: http://repo1.maven.org/maven2/commons-jelly/commons-jelly-tags-log/1.0/commons-jelly-tags-log-1.0.pom
167b downloaded
Downloading: http://repo1.maven.org/maven2/commons-jelly/commons-jelly/1.0/commons-jelly-1.0.pom
13K downloaded
Downloading: http://repo1.maven.org/maven2/dom4j/dom4j/1.5.2/dom4j-1.5.2.pom
6K downloaded
Downloading: http://repo1.maven.org/maven2/pull-parser/pull-parser/2/pull-parser-2.pom
152b downloaded
Downloading: http://repo1.maven.org/maven2/jaxme/jaxme-api/0.3/jaxme-api-0.3.pom
146b downloaded
Downloading: http://repo1.maven.org/maven2/msv/xsdlib/20030807/xsdlib-20030807.pom
146b downloaded
Downloading: http://repo1.maven.org/maven2/jaxen/jaxen/1.1-beta-4/jaxen-1.1-beta-4.pom
6K downloaded
Downloading: http://repo1.maven.org/maven2/msv/relaxngDatatype/20030807/relaxngDatatype-20030807.pom
155b downloaded
Downloading: http://repo1.maven.org/maven2/forehead/forehead/1.0-beta-5/forehead-1.0-beta-5.pom
156b downloaded
Downloading: http://repo1.maven.org/maven2/jstl/jstl/1.0.6/jstl-1.0.6.pom
689b downloaded
Downloading: http://repo1.maven.org/maven2/xerces/xerces/2.2.1/xerces-2.2.1.pom
322b downloaded
Downloading: http://repo1.maven.org/maven2/jdom/jdom/b10/jdom-b10.pom
141b downloaded
Downloading: http://repo1.maven.org/maven2/commons-lang/commons-lang/1.0/commons-lang-1.0.pom
2K downloaded
Downloading: http://repo1.maven.org/maven2/commons-discovery/commons-discovery/20030211.213356/commons-discovery-20030211.213356.pom
532b downloaded
Downloading: http://repo1.maven.org/maven2/commons-jexl/commons-jexl/1.0/commons-jexl-1.0.pom
156b downloaded
Downloading: http://repo1.maven.org/maven2/gsbase/gsbase/2.0.1/gsbase-2.0.1.pom
2K downloaded
Downloading: http://repo1.maven.org/maven2/junitperf/junitperf/1.8/junitperf-1.8.pom
150b downloaded
Downloading: http://repo1.maven.org/maven2/commons-logging/commons-logging/1.1/commons-logging-1.1.pom
6K downloaded
Downloading: http://repo1.maven.org/maven2/avalon-framework/avalon-framework/4.1.3/avalon-framework-4.1.3.pom
167b downloaded
Downloading: http://repo1.maven.org/maven2/log4j/log4j/1.2.12/log4j-1.2.12.pom
145b downloaded
Downloading: http://repo1.maven.org/maven2/rhino/js/1.6R2/js-1.6R2.pom
162b downloaded
Downloading: http://repo1.maven.org/maven2/commons-jelly/commons-jelly-tags-junit/1.0/commons-jelly-tags-junit-1.0.pom
169b downloaded
Downloading: http://repo1.maven.org/maven2/commons-collections/commons-collections/3.2/commons-collections-3.2.pom
10K downloaded
Downloading: http://repo1.maven.org/maven2/nekohtml/nekohtml/0.9.5/nekohtml-0.9.5.pom
346b downloaded
Downloading: http://repo1.maven.org/maven2/commons-jelly/commons-jelly-tags-xml/1.0/commons-jelly-tags-xml-1.0.pom
167b downloaded
Downloading: http://repo1.maven.org/maven2/jaxen/jaxen/1.1-beta-9/jaxen-1.1-beta-9.pom
7K downloaded
Downloading: http://repo1.maven.org/maven2/commons-io/commons-io/1.2/commons-io-1.2.pom
6K downloaded
Downloading: http://repo1.maven.org/maven2/commons-httpclient/commons-httpclient/3.0.1/commons-httpclient-3.0.1.pom
7K downloaded
Downloading: http://repo1.maven.org/maven2/commons-codec/commons-codec/1.2/commons-codec-1.2.pom
3K downloaded
Downloading: http://repo1.maven.org/maven2/commons-collections/commons-collections/3.2/commons-collections-3.2.jar
557K downloaded
[INFO] [compiler:compile]
Compiling 8 source files to /home/continuum/continuum-maven/working-directory/119/target/classes
[INFO] [resources:testResources]
[INFO] Using default encoding to copy filtered resources.
Downloading: http://repo1.maven.org/maven2/commons-jelly/commons-jelly-tags-junit/1.0/commons-jelly-tags-junit-1.0.jar
22K downloaded
Downloading: http://repo1.maven.org/maven2/gsbase/gsbase/2.0.1/gsbase-2.0.1.jar
139K downloaded
Downloading: http://repo1.maven.org/maven2/junitperf/junitperf/1.8/junitperf-1.8.jar
27K downloaded
Downloading: http://repo1.maven.org/maven2/commons-httpclient/commons-httpclient/3.0.1/commons-httpclient-3.0.1.jar
273K downloaded
Downloading: http://repo1.maven.org/maven2/commons-io/commons-io/1.2/commons-io-1.2.jar
64K downloaded
Downloading: http://repo1.maven.org/maven2/forehead/forehead/1.0-beta-5/forehead-1.0-beta-5.jar
12K downloaded
Downloading: http://repo1.maven.org/maven2/commons-logging/commons-logging/1.1/commons-logging-1.1.jar
51K downloaded
Downloading: http://repo1.maven.org/maven2/commons-jelly/commons-jelly/1.0/commons-jelly-1.0.jar
167K downloaded
Downloading: http://repo1.maven.org/maven2/htmlunit/htmlunit/1.9/htmlunit-1.9.jar
361K downloaded
Downloading: http://repo1.maven.org/maven2/commons-discovery/commons-discovery/20030211.213356/commons-discovery-20030211.213356.jar
70K downloaded
Downloading: http://repo1.maven.org/maven2/avalon-framework/avalon-framework/4.1.3/avalon-framework-4.1.3.jar
62K downloaded
Downloading: http://repo1.maven.org/maven2/commons-jelly/commons-jelly-tags-log/1.0/commons-jelly-tags-log-1.0.jar
10K downloaded
Downloading: http://repo1.maven.org/maven2/nekohtml/nekohtml/0.9.5/nekohtml-0.9.5.jar
103K downloaded
Downloading: http://repo1.maven.org/maven2/commons-jelly/commons-jelly-tags-xml/1.0/commons-jelly-tags-xml-1.0.jar
34K downloaded
Downloading: http://repo1.maven.org/maven2/log4j/log4j/1.2.12/log4j-1.2.12.jar
349K downloaded
Downloading: http://repo1.maven.org/maven2/commons-jexl/commons-jexl/1.0/commons-jexl-1.0.jar
128K downloaded
Downloading: http://repo1.maven.org/maven2/jaxen/jaxen/1.1-beta-9/jaxen-1.1-beta-9.jar
226K downloaded
Downloading: http://repo1.maven.org/maven2/rhino/js/1.6R2/js-1.6R2.jar
684K downloaded
[INFO] [compiler:testCompile]
Compiling 1 source file to /home/continuum/continuum-maven/working-directory/119/target/test-classes
[INFO] [surefire:test]
[INFO] Surefire report directory: /home/continuum/continuum-maven/working-directory/119/target/surefire-reports

-------------------------------------------------------
 T E S T S
-------------------------------------------------------
Running org.apache.maven.doxia.siterenderer.DefaultSiteRendererTest
[INFO] Setting property: classpath.resource.loader.class => 'org.codehaus.plexus.velocity.ContextClassLoaderResourceLoader'.
[INFO] Setting property: velocimacro.messages.on => 'false'.
[INFO] Setting property: resource.loader => 'classpath'.
[INFO] Setting property: resource.manager.logwhenfound => 'false'.
[ERROR] VM #displayTree: error : too few arguments to macro. Wanted 2 got 0
[ERROR] VM #menuItem: error : too few arguments to macro. Wanted 1 got 0
Item 11.
Tests run: 1, Failures: 0, Errors: 0, Skipped: 0, Time elapsed: 4.902 sec

Results :

Tests run: 1, Failures: 0, Errors: 0, Skipped: 0

[INFO] [jar:jar]
[INFO] Building jar: /home/continuum/continuum-maven/working-directory/119/target/doxia-site-renderer-1.0-alpha-9-SNAPSHOT.jar
[INFO] [install:install]
[INFO] Installing /home/continuum/continuum-maven/working-directory/119/target/doxia-site-renderer-1.0-alpha-9-SNAPSHOT.jar
to /home/continuum/.m2/repository/org/apache/maven/doxia/doxia-site-renderer/1.0-alpha-9-SNAPSHOT/doxia-site-renderer-1.0-alpha-9-SNAPSHOT.jar
[INFO] ------------------------------------------------------------------------
[INFO] BUILD SUCCESSFUL
[INFO] ------------------------------------------------------------------------
[INFO] Total time: 12 minutes 16 seconds
[INFO] Finished at: Tue Aug 01 07:13:35 PDT 2006
[INFO] Final Memory: 13M/158M
[INFO] ------------------------------------------------------------------------

****************************************************************************



Mime
View raw message