maven-notifications mailing list archives

Site index · List index
Message view « Date » · « Thread »
Top « Date » · « Thread »
From Continuum Build Server <contin...@ci.codehaus.org>
Subject [continuum] BUILD FAILURE: Maven Install Plugin
Date Thu, 06 Jul 2006 15:03:50 GMT
Online report : http://ci.codehaus.org/continuum-maven/servlet/continuum/target/ProjectBuild.vm/view/ProjectBuild/id/46/buildId/6117
Build statistics:
  State: Failed
  Previous State: Failed
  Started at: Thu, 6 Jul 2006 08:03:43 -0700
  Finished at: Thu, 6 Jul 2006 08:03:50 -0700
  Total time: 7s
  Build Trigger: Schedule
  Exit code: 1
  Building machine hostname: cheddar.simulalabs.com
  Operating system : Linux(unknown)
  Java version : 1.5.0_03(Sun Microsystems Inc.)

Changes
         aramirez          PR: MINSTALL-27

-added examples
             /maven/plugins/trunk/maven-install-plugin/pom.xml
            /maven/plugins/trunk/maven-install-plugin/src/site/apt/examples/customed-pom-installation.apt
            /maven/plugins/trunk/maven-install-plugin/src/site/apt/examples/generic-pom-generation.apt
            /maven/plugins/trunk/maven-install-plugin/src/site/apt/examples/install-updateReleaseInfo.apt
            /maven/plugins/trunk/maven-install-plugin/src/site/apt/examples/installingChecksums.apt
            /maven/plugins/trunk/maven-install-plugin/src/site/apt/examples/updateReleaseInfo.apt
(from /maven/plugins/trunk/maven-install-plugin/src/site/apt/examples/install-updateReleaseInfo.apt:419401)
        
****************************************************************************
Output:
****************************************************************************
[INFO] Scanning for projects...
[INFO] ----------------------------------------------------------------------------
[INFO] Building Maven Install Plugin
[INFO]    task-segment: [clean, install]
[INFO] ----------------------------------------------------------------------------
[INFO] [clean:clean]
[INFO] Deleting directory /home/continuum/continuum-maven/working-directory/46/target
[INFO] Deleting directory /home/continuum/continuum-maven/working-directory/46/target/classes
[INFO] Deleting directory /home/continuum/continuum-maven/working-directory/46/target/test-classes
[INFO] [plugin:descriptor]
[INFO] Using 2 extractors.
[INFO] Applying extractor for language: java
[INFO] Extractor for language: java found 2 mojo descriptors.
[INFO] Applying extractor for language: bsh
[INFO] Extractor for language: bsh found 0 mojo descriptors.
[INFO] [resources:resources]
[INFO] Using default encoding to copy filtered resources.
[INFO] [compiler:compile]
Compiling 3 source files to /home/continuum/continuum-maven/working-directory/46/target/classes
[INFO] ------------------------------------------------------------------------
[ERROR] BUILD FAILURE
[INFO] ------------------------------------------------------------------------
[INFO] Compilation failure

/home/continuum/continuum-maven/working-directory/46/src/main/java/org/apache/maven/plugin/install/AbstractInstallMojo.java:[125,38]
unreported exception org.apache.maven.repository.digest.DigesterException; must be caught
or declared to be thrown


[INFO] ------------------------------------------------------------------------
[INFO] For more information, run Maven with the -e switch
[INFO] ------------------------------------------------------------------------
[INFO] Total time: 6 seconds
[INFO] Finished at: Thu Jul 06 08:03:50 PDT 2006
[INFO] Final Memory: 10M/140M
[INFO] ------------------------------------------------------------------------

****************************************************************************



Mime
View raw message