maven-notifications mailing list archives

Site index · List index
Message view « Date » · « Thread »
Top « Date » · « Thread »
From Continuum Build Server <contin...@ci.codehaus.org>
Subject [continuum] BUILD FAILURE: Maven Repository Artifact Discovery
Date Mon, 24 Jul 2006 06:03:24 GMT
Online report : http://ci.codehaus.org/continuum-maven/servlet/continuum/target/ProjectBuild.vm/view/ProjectBuild/id/110/buildId/6919
Build statistics:
  State: Failed
  Previous State: Ok
  Started at: Sun, 23 Jul 2006 23:03:09 -0700
  Finished at: Sun, 23 Jul 2006 23:03:24 -0700
  Total time: 14s
  Build Trigger: Schedule
  Exit code: 1
  Building machine hostname: cheddar.simulalabs.com
  Operating system : Linux(unknown)
  Java version : 1.5.0_03(Sun Microsystems Inc.)

Changes
         brett          [MRM-125] implement timestamp based discovery
             /maven/repository-manager/trunk/maven-repository-discovery/src/main/java/org/apache/maven/repository/discovery/AbstractArtifactDiscoverer.java
            /maven/repository-manager/trunk/maven-repository-discovery/src/main/java/org/apache/maven/repository/discovery/AbstractDiscoverer.java
            /maven/repository-manager/trunk/maven-repository-discovery/src/main/java/org/apache/maven/repository/discovery/ArtifactDiscoverer.java
            /maven/repository-manager/trunk/maven-repository-discovery/src/main/java/org/apache/maven/repository/discovery/DefaultMetadataDiscoverer.java
            /maven/repository-manager/trunk/maven-repository-discovery/src/main/java/org/apache/maven/repository/discovery/MetadataDiscoverer.java
            /maven/repository-manager/trunk/maven-repository-discovery/src/test/java/org/apache/maven/repository/discovery/AbstractArtifactDiscovererTest.java
            /maven/repository-manager/trunk/maven-repository-discovery/src/test/java/org/apache/maven/repository/discovery/DefaultMetadataDiscovererTest.java
            /maven/repository-manager/trunk/maven-repository-discovery/src/test/legacy-repository/org.apache.maven.update
            /maven/repository-manager/trunk/maven-repository-discovery/src/test/legacy-repository/org.apache.maven.update/jars
            /maven/repository-manager/trunk/maven-repository-discovery/src/test/legacy-repository/org.apache.maven.update/jars/test-not-updated-1.0.jar
            /maven/repository-manager/trunk/maven-repository-discovery/src/test/legacy-repository/org.apache.maven.update/jars/test-updated-1.0.jar
            /maven/repository-manager/trunk/maven-repository-discovery/src/test/repository/org/apache/maven/update
            /maven/repository-manager/trunk/maven-repository-discovery/src/test/repository/org/apache/maven/update/test-not-updated
            /maven/repository-manager/trunk/maven-repository-discovery/src/test/repository/org/apache/maven/update/test-not-updated/1.0
            /maven/repository-manager/trunk/maven-repository-discovery/src/test/repository/org/apache/maven/update/test-not-updated/1.0/test-not-updated-1.0.jar
            /maven/repository-manager/trunk/maven-repository-discovery/src/test/repository/org/apache/maven/update/test-not-updated/1.0/test-not-updated-1.0.pom
            /maven/repository-manager/trunk/maven-repository-discovery/src/test/repository/org/apache/maven/update/test-updated
            /maven/repository-manager/trunk/maven-repository-discovery/src/test/repository/org/apache/maven/update/test-updated/1.0
            /maven/repository-manager/trunk/maven-repository-discovery/src/test/repository/org/apache/maven/update/test-updated/1.0/test-updated-1.0.jar
            /maven/repository-manager/trunk/maven-repository-discovery/src/test/repository/org/apache/maven/update/test-updated/1.0/test-updated-1.0.pom
        
****************************************************************************
Output:
****************************************************************************
[INFO] Scanning for projects...
[INFO] ----------------------------------------------------------------------------
[INFO] Building Maven Repository Artifact Discovery
[INFO]    task-segment: [clean, install]
[INFO] ----------------------------------------------------------------------------
[INFO] [clean:clean]
[INFO] Deleting directory /home/continuum/continuum-maven/working-directory/110/target
[INFO] Deleting directory /home/continuum/continuum-maven/working-directory/110/target/classes
[INFO] Deleting directory /home/continuum/continuum-maven/working-directory/110/target/test-classes
[INFO] [plexus:descriptor {execution: default}]
[INFO] [resources:resources]
[INFO] Using default encoding to copy filtered resources.
[WARNING] 
	Artifact junit:junit:jar:3.8.1:test retains local scope 'test' overriding broader scope 'compile'
	given by a dependency. If this is not intended, modify or remove the local scope.

[INFO] [compiler:compile]
Compiling 10 source files to /home/continuum/continuum-maven/working-directory/110/target/classes
[INFO] [resources:testResources]
[INFO] Using default encoding to copy filtered resources.
[INFO] [compiler:testCompile]
Compiling 4 source files to /home/continuum/continuum-maven/working-directory/110/target/test-classes
[INFO] ------------------------------------------------------------------------
[ERROR] BUILD FAILURE
[INFO] ------------------------------------------------------------------------
[INFO] Compilation failure

/home/continuum/continuum-maven/working-directory/110/src/test/java/org/apache/maven/repository/discovery/LegacyArtifactDiscovererTest.java:[48,35]
discoverArtifacts(org.apache.maven.artifact.repository.ArtifactRepository,java.lang.String,java.lang.String,boolean)
in org.apache.maven.repository.discovery.ArtifactDiscoverer cannot be applied to (org.apache.maven.artifact.repository.ArtifactRepository,<nulltype>,boolean)

/home/continuum/continuum-maven/working-directory/110/src/test/java/org/apache/maven/repository/discovery/LegacyArtifactDiscovererTest.java:[74,35]
discoverArtifacts(org.apache.maven.artifact.repository.ArtifactRepository,java.lang.String,java.lang.String,boolean)
in org.apache.maven.repository.discovery.ArtifactDiscoverer cannot be applied to (org.apache.maven.artifact.repository.ArtifactRepository,<nulltype>,boolean)

/home/continuum/continuum-maven/working-directory/110/src/test/java/org/apache/maven/repository/discovery/LegacyArtifactDiscovererTest.java:[100,35]
discoverArtifacts(org.apache.maven.artifact.repository.ArtifactRepository,java.lang.String,java.lang.String,boolean)
in org.apache.maven.repository.discovery.ArtifactDiscoverer cannot be applied to (org.apache.maven.artifact.repository.ArtifactRepository,java.lang.String,boolean)

/home/continuum/continuum-maven/working-directory/110/src/test/java/org/apache/maven/repository/discovery/LegacyArtifactDiscovererTest.java:[123,35]
discoverArtifacts(org.apache.maven.artifact.repository.ArtifactRepository,java.lang.String,java.lang.String,boolean)
in org.apache.maven.repository.discovery.ArtifactDiscoverer cannot be applied to (org.apache.maven.artifact.repository.ArtifactRepository,<nulltype>,boolean)

/home/continuum/continuum-maven/working-directory/110/src/test/java/org/apache/maven/repository/discovery/LegacyArtifactDiscovererTest.java:[150,35]
discoverArtifacts(org.apache.maven.artifact.repository.ArtifactRepository,java.lang.String,java.lang.String,boolean)
in org.apache.maven.repository.discovery.ArtifactDiscoverer cannot be applied to (org.apache.maven.artifact.repository.ArtifactRepository,<nulltype>,boolean)

/home/continuum/continuum-maven/working-directory/110/src/test/java/org/apache/maven/repository/discovery/LegacyArtifactDiscovererTest.java:[177,35]
discoverArtifacts(org.apache.maven.artifact.repository.ArtifactRepository,java.lang.String,java.lang.String,boolean)
in org.apache.maven.repository.discovery.ArtifactDiscoverer cannot be applied to (org.apache.maven.artifact.repository.ArtifactRepository,<nulltype>,boolean)

/home/continuum/continuum-maven/working-directory/110/src/test/java/org/apache/maven/repository/discovery/LegacyArtifactDiscovererTest.java:[204,35]
discoverArtifacts(org.apache.maven.artifact.repository.ArtifactRepository,java.lang.String,java.lang.String,boolean)
in org.apache.maven.repository.discovery.ArtifactDiscoverer cannot be applied to (org.apache.maven.artifact.repository.ArtifactRepository,<nulltype>,boolean)

/home/continuum/continuum-maven/working-directory/110/src/test/java/org/apache/maven/repository/discovery/LegacyArtifactDiscovererTest.java:[231,35]
discoverArtifacts(org.apache.maven.artifact.repository.ArtifactRepository,java.lang.String,java.lang.String,boolean)
in org.apache.maven.repository.discovery.ArtifactDiscoverer cannot be applied to (org.apache.maven.artifact.repository.ArtifactRepository,<nulltype>,boolean)

/home/continuum/continuum-maven/working-directory/110/src/test/java/org/apache/maven/repository/discovery/LegacyArtifactDiscovererTest.java:[258,35]
discoverArtifacts(org.apache.maven.artifact.repository.ArtifactRepository,java.lang.String,java.lang.String,boolean)
in org.apache.maven.repository.discovery.ArtifactDiscoverer cannot be applied to (org.apache.maven.artifact.repository.ArtifactRepository,<nulltype>,boolean)

/home/continuum/continuum-maven/working-directory/110/src/test/java/org/apache/maven/repository/discovery/LegacyArtifactDiscovererTest.java:[284,35]
discoverArtifacts(org.apache.maven.artifact.repository.ArtifactRepository,java.lang.String,java.lang.String,boolean)
in org.apache.maven.repository.discovery.ArtifactDiscoverer cannot be applied to (org.apache.maven.artifact.repository.ArtifactRepository,<nulltype>,boolean)

/home/continuum/continuum-maven/working-directory/110/src/test/java/org/apache/maven/repository/discovery/LegacyArtifactDiscovererTest.java:[293,35]
discoverArtifacts(org.apache.maven.artifact.repository.ArtifactRepository,java.lang.String,java.lang.String,boolean)
in org.apache.maven.repository.discovery.ArtifactDiscoverer cannot be applied to (org.apache.maven.artifact.repository.ArtifactRepository,<nulltype>,boolean)

/home/continuum/continuum-maven/working-directory/110/src/test/java/org/apache/maven/repository/discovery/LegacyArtifactDiscovererTest.java:[302,35]
discoverArtifacts(org.apache.maven.artifact.repository.ArtifactRepository,java.lang.String,java.lang.String,boolean)
in org.apache.maven.repository.discovery.ArtifactDiscoverer cannot be applied to (org.apache.maven.artifact.repository.ArtifactRepository,<nulltype>,boolean)

/home/continuum/continuum-maven/working-directory/110/src/test/java/org/apache/maven/repository/discovery/LegacyArtifactDiscovererTest.java:[311,35]
discoverArtifacts(org.apache.maven.artifact.repository.ArtifactRepository,java.lang.String,java.lang.String,boolean)
in org.apache.maven.repository.discovery.ArtifactDiscoverer cannot be applied to (org.apache.maven.artifact.repository.ArtifactRepository,<nulltype>,boolean)

/home/continuum/continuum-maven/working-directory/110/src/test/java/org/apache/maven/repository/discovery/LegacyArtifactDiscovererTest.java:[320,35]
discoverArtifacts(org.apache.maven.artifact.repository.ArtifactRepository,java.lang.String,java.lang.String,boolean)
in org.apache.maven.repository.discovery.ArtifactDiscoverer cannot be applied to (org.apache.maven.artifact.repository.ArtifactRepository,<nulltype>,boolean)

/home/continuum/continuum-maven/working-directory/110/src/test/java/org/apache/maven/repository/discovery/LegacyArtifactDiscovererTest.java:[332,35]
discoverArtifacts(org.apache.maven.artifact.repository.ArtifactRepository,java.lang.String,java.lang.String,boolean)
in org.apache.maven.repository.discovery.ArtifactDiscoverer cannot be applied to (org.apache.maven.artifact.repository.ArtifactRepository,<nulltype>,boolean)

/home/continuum/continuum-maven/working-directory/110/src/test/java/org/apache/maven/repository/discovery/LegacyArtifactDiscovererTest.java:[342,35]
discoverArtifacts(org.apache.maven.artifact.repository.ArtifactRepository,java.lang.String,java.lang.String,boolean)
in org.apache.maven.repository.discovery.ArtifactDiscoverer cannot be applied to (org.apache.maven.artifact.repository.ArtifactRepository,<nulltype>,boolean)

/home/continuum/continuum-maven/working-directory/110/src/test/java/org/apache/maven/repository/discovery/LegacyArtifactDiscovererTest.java:[352,35]
discoverArtifacts(org.apache.maven.artifact.repository.ArtifactRepository,java.lang.String,java.lang.String,boolean)
in org.apache.maven.repository.discovery.ArtifactDiscoverer cannot be applied to (org.apache.maven.artifact.repository.ArtifactRepository,<nulltype>,boolean)

/home/continuum/continuum-maven/working-directory/110/src/test/java/org/apache/maven/repository/discovery/LegacyArtifactDiscovererTest.java:[365,35]
discoverArtifacts(org.apache.maven.artifact.repository.ArtifactRepository,java.lang.String,java.lang.String,boolean)
in org.apache.maven.repository.discovery.ArtifactDiscoverer cannot be applied to (org.apache.maven.artifact.repository.ArtifactRepository,<nulltype>,boolean)

/home/continuum/continuum-maven/working-directory/110/src/test/java/org/apache/maven/repository/discovery/DefaultArtifactDiscovererTest.java:[52,35]
discoverArtifacts(org.apache.maven.artifact.repository.ArtifactRepository,java.lang.String,java.lang.String,boolean)
in org.apache.maven.repository.discovery.ArtifactDiscoverer cannot be applied to (org.apache.maven.artifact.repository.ArtifactRepository,<nulltype>,boolean)

/home/continuum/continuum-maven/working-directory/110/src/test/java/org/apache/maven/repository/discovery/DefaultArtifactDiscovererTest.java:[79,35]
discoverArtifacts(org.apache.maven.artifact.repository.ArtifactRepository,java.lang.String,java.lang.String,boolean)
in org.apache.maven.repository.discovery.ArtifactDiscoverer cannot be applied to (org.apache.maven.artifact.repository.ArtifactRepository,<nulltype>,boolean)

/home/continuum/continuum-maven/working-directory/110/src/test/java/org/apache/maven/repository/discovery/DefaultArtifactDiscovererTest.java:[105,35]
discoverArtifacts(org.apache.maven.artifact.repository.ArtifactRepository,java.lang.String,java.lang.String,boolean)
in org.apache.maven.repository.discovery.ArtifactDiscoverer cannot be applied to (org.apache.maven.artifact.repository.ArtifactRepository,java.lang.String,boolean)

/home/continuum/continuum-maven/working-directory/110/src/test/java/org/apache/maven/repository/discovery/DefaultArtifactDiscovererTest.java:[128,35]
discoverArtifacts(org.apache.maven.artifact.repository.ArtifactRepository,java.lang.String,java.lang.String,boolean)
in org.apache.maven.repository.discovery.ArtifactDiscoverer cannot be applied to (org.apache.maven.artifact.repository.ArtifactRepository,<nulltype>,boolean)

/home/continuum/continuum-maven/working-directory/110/src/test/java/org/apache/maven/repository/discovery/DefaultArtifactDiscovererTest.java:[156,35]
discoverArtifacts(org.apache.maven.artifact.repository.ArtifactRepository,java.lang.String,java.lang.String,boolean)
in org.apache.maven.repository.discovery.ArtifactDiscoverer cannot be applied to (org.apache.maven.artifact.repository.ArtifactRepository,<nulltype>,boolean)

/home/continuum/continuum-maven/working-directory/110/src/test/java/org/apache/maven/repository/discovery/DefaultArtifactDiscovererTest.java:[185,35]
discoverArtifacts(org.apache.maven.artifact.repository.ArtifactRepository,java.lang.String,java.lang.String,boolean)
in org.apache.maven.repository.discovery.ArtifactDiscoverer cannot be applied to (org.apache.maven.artifact.repository.ArtifactRepository,<nulltype>,boolean)

/home/continuum/continuum-maven/working-directory/110/src/test/java/org/apache/maven/repository/discovery/DefaultArtifactDiscovererTest.java:[212,35]
discoverArtifacts(org.apache.maven.artifact.repository.ArtifactRepository,java.lang.String,java.lang.String,boolean)
in org.apache.maven.repository.discovery.ArtifactDiscoverer cannot be applied to (org.apache.maven.artifact.repository.ArtifactRepository,<nulltype>,boolean)

/home/continuum/continuum-maven/working-directory/110/src/test/java/org/apache/maven/repository/discovery/DefaultArtifactDiscovererTest.java:[239,35]
discoverArtifacts(org.apache.maven.artifact.repository.ArtifactRepository,java.lang.String,java.lang.String,boolean)
in org.apache.maven.repository.discovery.ArtifactDiscoverer cannot be applied to (org.apache.maven.artifact.repository.ArtifactRepository,<nulltype>,boolean)

/home/continuum/continuum-maven/working-directory/110/src/test/java/org/apache/maven/repository/discovery/DefaultArtifactDiscovererTest.java:[266,35]
discoverArtifacts(org.apache.maven.artifact.repository.ArtifactRepository,java.lang.String,java.lang.String,boolean)
in org.apache.maven.repository.discovery.ArtifactDiscoverer cannot be applied to (org.apache.maven.artifact.repository.ArtifactRepository,<nulltype>,boolean)

/home/continuum/continuum-maven/working-directory/110/src/test/java/org/apache/maven/repository/discovery/DefaultArtifactDiscovererTest.java:[294,35]
discoverArtifacts(org.apache.maven.artifact.repository.ArtifactRepository,java.lang.String,java.lang.String,boolean)
in org.apache.maven.repository.discovery.ArtifactDiscoverer cannot be applied to (org.apache.maven.artifact.repository.ArtifactRepository,<nulltype>,boolean)

/home/continuum/continuum-maven/working-directory/110/src/test/java/org/apache/maven/repository/discovery/DefaultArtifactDiscovererTest.java:[324,35]
discoverArtifacts(org.apache.maven.artifact.repository.ArtifactRepository,java.lang.String,java.lang.String,boolean)
in org.apache.maven.repository.discovery.ArtifactDiscoverer cannot be applied to (org.apache.maven.artifact.repository.ArtifactRepository,<nulltype>,boolean)

/home/continuum/continuum-maven/working-directory/110/src/test/java/org/apache/maven/repository/discovery/DefaultArtifactDiscovererTest.java:[333,35]
discoverArtifacts(org.apache.maven.artifact.repository.ArtifactRepository,java.lang.String,java.lang.String,boolean)
in org.apache.maven.repository.discovery.ArtifactDiscoverer cannot be applied to (org.apache.maven.artifact.repository.ArtifactRepository,<nulltype>,boolean)

/home/continuum/continuum-maven/working-directory/110/src/test/java/org/apache/maven/repository/discovery/DefaultArtifactDiscovererTest.java:[342,35]
discoverArtifacts(org.apache.maven.artifact.repository.ArtifactRepository,java.lang.String,java.lang.String,boolean)
in org.apache.maven.repository.discovery.ArtifactDiscoverer cannot be applied to (org.apache.maven.artifact.repository.ArtifactRepository,<nulltype>,boolean)

/home/continuum/continuum-maven/working-directory/110/src/test/java/org/apache/maven/repository/discovery/DefaultArtifactDiscovererTest.java:[351,35]
discoverArtifacts(org.apache.maven.artifact.repository.ArtifactRepository,java.lang.String,java.lang.String,boolean)
in org.apache.maven.repository.discovery.ArtifactDiscoverer cannot be applied to (org.apache.maven.artifact.repository.ArtifactRepository,<nulltype>,boolean)

/home/continuum/continuum-maven/working-directory/110/src/test/java/org/apache/maven/repository/discovery/DefaultArtifactDiscovererTest.java:[363,35]
discoverArtifacts(org.apache.maven.artifact.repository.ArtifactRepository,java.lang.String,java.lang.String,boolean)
in org.apache.maven.repository.discovery.ArtifactDiscoverer cannot be applied to (org.apache.maven.artifact.repository.ArtifactRepository,<nulltype>,boolean)

/home/continuum/continuum-maven/working-directory/110/src/test/java/org/apache/maven/repository/discovery/DefaultArtifactDiscovererTest.java:[373,35]
discoverArtifacts(org.apache.maven.artifact.repository.ArtifactRepository,java.lang.String,java.lang.String,boolean)
in org.apache.maven.repository.discovery.ArtifactDiscoverer cannot be applied to (org.apache.maven.artifact.repository.ArtifactRepository,<nulltype>,boolean)

/home/continuum/continuum-maven/working-directory/110/src/test/java/org/apache/maven/repository/discovery/DefaultArtifactDiscovererTest.java:[382,35]
discoverArtifacts(org.apache.maven.artifact.repository.ArtifactRepository,java.lang.String,java.lang.String,boolean)
in org.apache.maven.repository.discovery.ArtifactDiscoverer cannot be applied to (org.apache.maven.artifact.repository.ArtifactRepository,<nulltype>,boolean)

/home/continuum/continuum-maven/working-directory/110/src/test/java/org/apache/maven/repository/discovery/DefaultArtifactDiscovererTest.java:[392,35]
discoverArtifacts(org.apache.maven.artifact.repository.ArtifactRepository,java.lang.String,java.lang.String,boolean)
in org.apache.maven.repository.discovery.ArtifactDiscoverer cannot be applied to (org.apache.maven.artifact.repository.ArtifactRepository,<nulltype>,boolean)

/home/continuum/continuum-maven/working-directory/110/src/test/java/org/apache/maven/repository/discovery/DefaultArtifactDiscovererTest.java:[405,35]
discoverArtifacts(org.apache.maven.artifact.repository.ArtifactRepository,java.lang.String,java.lang.String,boolean)
in org.apache.maven.repository.discovery.ArtifactDiscoverer cannot be applied to (org.apache.maven.artifact.repository.ArtifactRepository,<nulltype>,boolean)


[INFO] ------------------------------------------------------------------------
[INFO] For more information, run Maven with the -e switch
[INFO] ------------------------------------------------------------------------
[INFO] Total time: 9 seconds
[INFO] Finished at: Sun Jul 23 23:03:24 PDT 2006
[INFO] Final Memory: 10M/123M
[INFO] ------------------------------------------------------------------------

****************************************************************************



Mime
View raw message