maven-notifications mailing list archives

Site index · List index
Message view « Date » · « Thread »
Top « Date » · « Thread »
From Continuum Build Server <contin...@ci.codehaus.org>
Subject [continuum] BUILD FAILURE: Maven Local Settings Model
Date Sat, 08 Jul 2006 18:02:49 GMT
Online report : http://ci.codehaus.org/continuum-maven/servlet/continuum/target/ProjectBuild.vm/view/ProjectBuild/id/31/buildId/6171
Build statistics:
  State: Failed
  Previous State: Ok
  Started at: Sat, 8 Jul 2006 11:02:33 -0700
  Finished at: Sat, 8 Jul 2006 11:02:47 -0700
  Total time: 13s
  Build Trigger: Schedule
  Exit code: 1
  Building machine hostname: cheddar.simulalabs.com
  Operating system : Linux(unknown)
  Java version : 1.5.0_03(Sun Microsystems Inc.)

Changes
         carlos          Merged rev# 419865-419886 from trunk
pom cleanup, fix site generation, svn properties
             /maven/components/branches/maven-2.0.x/integration-tests/maven-core-it-plugin/pom.xml
            /maven/components/branches/maven-2.0.x/integration-tests/maven-core-it-support/1.0/pom.xml
            /maven/components/branches/maven-2.0.x/integration-tests/maven-core-it-support/1.1/pom.xml
            /maven/components/branches/maven-2.0.x/integration-tests/maven-core-it-support/1.1-old-location/pom.xml
            /maven/components/branches/maven-2.0.x/integration-tests/maven-core-it-support/1.2/pom.xml
            /maven/components/branches/maven-2.0.x/integration-tests/maven-core-it-support/1.3/pom.xml
            /maven/components/branches/maven-2.0.x/integration-tests/maven-core-it-support/1.4/pom.xml
            /maven/components/branches/maven-2.0.x/maven-artifact/pom.xml
            /maven/components/branches/maven-2.0.x/maven-artifact-ant/pom.xml
            /maven/components/branches/maven-2.0.x/maven-artifact-manager/pom.xml
            /maven/components/branches/maven-2.0.x/maven-artifact-test/pom.xml
            /maven/components/branches/maven-2.0.x/maven-core/pom.xml
            /maven/components/branches/maven-2.0.x/maven-core-it-verifier/pom.xml
            /maven/components/branches/maven-2.0.x/maven-embedder/pom.xml
            /maven/components/branches/maven-2.0.x/maven-embedder-it/pom.xml
            /maven/components/branches/maven-2.0.x/maven-embedder-it/src/main/java/org/apache/maven/embedder/it/MockPlugin.java
            /maven/components/branches/maven-2.0.x/maven-embedder-it/src/test/java/org/apache/maven/embedder/it/MockPluginTest.java
            /maven/components/branches/maven-2.0.x/maven-error-diagnostics/pom.xml
            /maven/components/branches/maven-2.0.x/maven-meeper/pom.xml
            /maven/components/branches/maven-2.0.x/maven-model/pom.xml
            /maven/components/branches/maven-2.0.x/maven-model-converter/pom.xml
            /maven/components/branches/maven-2.0.x/maven-model-converter/src/main/java/org/apache/maven/model/converter/PomTranslationException.java
            /maven/components/branches/maven-2.0.x/maven-monitor/pom.xml
            /maven/components/branches/maven-2.0.x/maven-plugin-api/pom.xml
            /maven/components/branches/maven-2.0.x/maven-plugin-descriptor/pom.xml
            /maven/components/branches/maven-2.0.x/maven-plugin-parameter-documenter/pom.xml
            /maven/components/branches/maven-2.0.x/maven-plugin-registry/plugin-registry.mdo
            /maven/components/branches/maven-2.0.x/maven-plugin-registry/pom.xml
            /maven/components/branches/maven-2.0.x/maven-plugin-registry/src/main/java/org/apache/maven/plugin/registry/DefaultPluginRegistryBuilder.java
            /maven/components/branches/maven-2.0.x/maven-plugin-registry/src/main/java/org/apache/maven/plugin/registry/MavenPluginRegistryBuilder.java
            /maven/components/branches/maven-2.0.x/maven-plugin-registry/src/main/java/org/apache/maven/plugin/registry/PluginRegistryUtils.java
            /maven/components/branches/maven-2.0.x/maven-plugin-registry/src/main/java/org/apache/maven/plugin/registry/RuntimeInfo.java
            /maven/components/branches/maven-2.0.x/maven-plugin-registry/src/main/resources/META-INF/plexus/components.xml
            /maven/components/branches/maven-2.0.x/maven-plugin-tools/maven-plugin-tools-ant/pom.xml
            /maven/components/branches/maven-2.0.x/maven-plugin-tools/maven-plugin-tools-api/pom.xml
            /maven/components/branches/maven-2.0.x/maven-plugin-tools/maven-plugin-tools-beanshell/pom.xml
            /maven/components/branches/maven-2.0.x/maven-plugin-tools/maven-plugin-tools-java/pom.xml
            /maven/components/branches/maven-2.0.x/maven-plugin-tools/maven-plugin-tools-model/pom.xml
            /maven/components/branches/maven-2.0.x/maven-plugin-tools/maven-plugin-tools-pluggy/pom.xml
            /maven/components/branches/maven-2.0.x/maven-plugin-tools/pom.xml
            /maven/components/branches/maven-2.0.x/maven-profile/pom.xml
            /maven/components/branches/maven-2.0.x/maven-profile/profiles.mdo
            /maven/components/branches/maven-2.0.x/maven-profile/src/main/java/org/apache/maven/profiles/AlwaysOnActivation.java
            /maven/components/branches/maven-2.0.x/maven-profile/src/main/java/org/apache/maven/profiles/DefaultMavenProfilesBuilder.java
            /maven/components/branches/maven-2.0.x/maven-profile/src/main/java/org/apache/maven/profiles/MavenProfilesBuilder.java
            /maven/components/branches/maven-2.0.x/maven-profile/src/main/java/org/apache/maven/profiles/ProfilesConversionUtils.java
            /maven/components/branches/maven-2.0.x/maven-profile/src/main/resources/META-INF/plexus/components.xml
            /maven/components/branches/maven-2.0.x/maven-project/pom.xml
            /maven/components/branches/maven-2.0.x/maven-reporting/maven-reporting-api/pom.xml
            /maven/components/branches/maven-2.0.x/maven-reporting/maven-reporting-impl/pom.xml
            /maven/components/branches/maven-2.0.x/maven-reporting/pom.xml
            /maven/components/branches/maven-2.0.x/maven-repository-metadata/pom.xml
            /maven/components/branches/maven-2.0.x/maven-repository-tools/pom.xml
            /maven/components/branches/maven-2.0.x/maven-script/maven-script-ant/pom.xml
            /maven/components/branches/maven-2.0.x/maven-script/maven-script-beanshell/pom.xml
            /maven/components/branches/maven-2.0.x/maven-script/pom.xml
            /maven/components/branches/maven-2.0.x/maven-settings/pom.xml
            /maven/components/branches/maven-2.0.x/maven-settings/src/main/java/org/apache/maven/settings/DefaultMavenSettingsBuilder.java
           carlos          Merged rev# 420152 from trunk. Set svn properties
             /maven/components/branches/maven-2.0.x/integration-tests/maven-core-it-plugin/src/main/java/org/apache/maven/plugin/coreit/CoreItMojoWithSetters.java
            /maven/components/branches/maven-2.0.x/maven-artifact/src/main/java/org/apache/maven/artifact/InvalidArtifactRTException.java
            /maven/components/branches/maven-2.0.x/maven-artifact/src/main/java/org/apache/maven/artifact/handler/DefaultArtifactHandler.java
            /maven/components/branches/maven-2.0.x/maven-artifact/src/main/java/org/apache/maven/artifact/resolver/CyclicDependencyException.java
            /maven/components/branches/maven-2.0.x/maven-artifact/src/main/java/org/apache/maven/artifact/resolver/ResolutionListener.java
            /maven/components/branches/maven-2.0.x/maven-artifact/src/main/java/org/apache/maven/artifact/resolver/filter/InversionArtifactFilter.java
            /maven/components/branches/maven-2.0.x/maven-artifact/src/main/java/org/apache/maven/artifact/versioning/ArtifactVersion.java
            /maven/components/branches/maven-2.0.x/maven-artifact-ant/src/main/java/org/apache/maven/artifact/ant/AntResolutionListener.java
            /maven/components/branches/maven-2.0.x/maven-artifact-manager/src/main/java/org/apache/maven/artifact/resolver/DebugResolutionListener.java
            /maven/components/branches/maven-2.0.x/maven-artifact-manager/src/main/java/org/apache/maven/artifact/transform/AbstractVersionTransformation.java
            /maven/components/branches/maven-2.0.x/maven-artifact-manager/src/main/java/org/apache/maven/artifact/transform/ReleaseArtifactTransformation.java
            /maven/components/branches/maven-2.0.x/maven-core/src/main/java/org/apache/maven/plugin/MojoExecution.java
            /maven/components/branches/maven-2.0.x/maven-core/src/main/java/org/apache/maven/plugin/PluginParameterException.java
            /maven/components/branches/maven-2.0.x/maven-core/src/main/java/org/apache/maven/plugin/version/DefaultPluginVersionManager.java
            /maven/components/branches/maven-2.0.x/maven-core/src/main/java/org/apache/maven/plugin/version/IntervalUtils.java
            /maven/components/branches/maven-2.0.x/maven-core/src/main/java/org/apache/maven/plugin/version/PluginVersionManager.java
            /maven/components/branches/maven-2.0.x/maven-core/src/main/java/org/apache/maven/plugin/version/PluginVersionResolutionException.java
            /maven/components/branches/maven-2.0.x/maven-core/src/main/java/org/apache/maven/usability/ArtifactResolverDiagnoser.java
            /maven/components/branches/maven-2.0.x/maven-core/src/main/java/org/apache/maven/usability/InvalidArtifactDiagnoser.java
            /maven/components/branches/maven-2.0.x/maven-core/src/main/java/org/apache/maven/usability/PluginConfigurationDiagnoser.java
            /maven/components/branches/maven-2.0.x/maven-core/src/test/java/org/apache/maven/plugin/version/IntervalUtilsTest.java
            /maven/components/branches/maven-2.0.x/maven-core/src/test/java/org/apache/maven/usability/InvalidArtifactDiagnoserTest.java
            /maven/components/branches/maven-2.0.x/maven-core/src/test/java/org/apache/maven/usability/PluginErrorDiagnoserTest.java
            /maven/components/branches/maven-2.0.x/maven-core-it/it0021/pom.xml
            /maven/components/branches/maven-2.0.x/maven-core-it/it0021/src/main/java/org/apache/maven/it0021/Person.java
            /maven/components/branches/maven-2.0.x/maven-core-it/it0022/pom.xml
            /maven/components/branches/maven-2.0.x/maven-core-it/it0022/src/main/java/org/apache/maven/it0022/Person.java
            /maven/components/branches/maven-2.0.x/maven-core-it/it0023/pom.xml
            /maven/components/branches/maven-2.0.x/maven-core-it/it0023/src/main/java/org/apache/maven/it0023/Person.java
            /maven/components/branches/maven-2.0.x/maven-core-it/it0024/pom.xml
            /maven/components/branches/maven-2.0.x/maven-core-it/it0024/src/main/java/org/apache/maven/it0001/Person.java
            /maven/components/branches/maven-2.0.x/maven-core-it/it0024/src/test/java/org/apache/maven/it0001/PersonTest.java
            /maven/components/branches/maven-2.0.x/maven-core-it/it0025/pom.xml
            /maven/components/branches/maven-2.0.x/maven-core-it/it0025/src/main/java/org/apache/maven/it0023/Person.java
            /maven/components/branches/maven-2.0.x/maven-core-it/it0026/pom.xml
            /maven/components/branches/maven-2.0.x/maven-core-it/it0026/src/main/java/org/apache/maven/it0023/Person.java
            /maven/components/branches/maven-2.0.x/maven-core-it/it0028/pom.xml
            /maven/components/branches/maven-2.0.x/maven-core-it/it0028/src/main/java/org/apache/maven/it0001/Person.java
            /maven/components/branches/maven-2.0.x/maven-core-it/it0028/src/test/java/org/apache/maven/it0001/PersonTest.java
            /maven/components/branches/maven-2.0.x/maven-core-it/it0064/pom.xml
            /maven/components/branches/maven-2.0.x/maven-core-it/it0070/pom.xml
            /maven/components/branches/maven-2.0.x/maven-core-it/it1005/pom.xml
            /maven/components/branches/maven-2.0.x/maven-core-it/it1005/src/main/java/org/apache/maven/plugin/coreit/CoreIt1005Mojo.java
            /maven/components/branches/maven-2.0.x/maven-core-it/it1005/src/main/java/org/apache/maven/plugin/coreit/CoreIt1005Mojo2.java
            /maven/components/branches/maven-2.0.x/maven-embedder/pom.xml
            /maven/components/branches/maven-2.0.x/maven-embedder/src/main/java/org/apache/maven/embedder/MavenEmbedder.java
            /maven/components/branches/maven-2.0.x/maven-embedder/src/main/java/org/apache/maven/embedder/MavenEmbedderException.java
            /maven/components/branches/maven-2.0.x/maven-embedder/src/test/java/org/apache/maven/embedder/MavenEmbedderTest.java
            /maven/components/branches/maven-2.0.x/maven-embedder/src/test/resources/pom.xml
            /maven/components/branches/maven-2.0.x/maven-plugin-descriptor/src/main/java/org/apache/maven/plugin/descriptor/DuplicateMojoDescriptorException.java
            /maven/components/branches/maven-2.0.x/maven-plugin-descriptor/src/main/java/org/apache/maven/plugin/descriptor/DuplicateParameterException.java
            /maven/components/branches/maven-2.0.x/maven-plugin-descriptor/src/main/java/org/apache/maven/plugin/descriptor/InvalidPluginDescriptorException.java
            /maven/components/branches/maven-2.0.x/maven-plugin-tools/maven-plugin-tools-api/src/main/java/org/apache/maven/tools/plugin/extractor/ExtractionException.java
            /maven/components/branches/maven-2.0.x/maven-project/src/main/java/org/apache/maven/profiles/activation/AlwaysOnProfileActivator.java
            /maven/components/branches/maven-2.0.x/maven-project/src/main/java/org/apache/maven/profiles/activation/DetectedProfileActivator.java
            /maven/components/branches/maven-2.0.x/maven-project/src/main/java/org/apache/maven/profiles/activation/JdkPrefixProfileActivator.java
            /maven/components/branches/maven-2.0.x/maven-project/src/main/java/org/apache/maven/profiles/activation/ProfileActivator.java
            /maven/components/branches/maven-2.0.x/maven-project/src/main/java/org/apache/maven/profiles/activation/SystemPropertyProfileActivator.java
            /maven/components/branches/maven-2.0.x/maven-project/src/main/java/org/apache/maven/project/ModelUtils.java
            /maven/components/branches/maven-2.0.x/maven-project/src/main/java/org/apache/maven/project/ProjectUtils.java
            /maven/components/branches/maven-2.0.x/maven-project/src/test/java/org/apache/maven/project/ModelUtilsTest.java
            /maven/components/branches/maven-2.0.x/maven-reporting/maven-reporting-api/pom.xml
            /maven/components/branches/maven-2.0.x/maven-reporting/maven-reporting-api/src/main/java/org/apache/maven/reporting/MavenReport.java
            /maven/components/branches/maven-2.0.x/maven-reporting/maven-reporting-api/src/main/java/org/apache/maven/reporting/MavenReportException.java
            /maven/components/branches/maven-2.0.x/maven-reporting/maven-reporting-api/src/main/java/org/apache/maven/reporting/MavenReportRenderer.java
            /maven/components/branches/maven-2.0.x/maven-reporting/maven-reporting-impl/src/main/java/org/apache/maven/reporting/AbstractMavenMultiPageReport.java
            /maven/components/branches/maven-2.0.x/maven-reporting/maven-reporting-impl/src/main/java/org/apache/maven/reporting/AbstractMavenReport.java
            /maven/components/branches/maven-2.0.x/maven-reporting/maven-reporting-impl/src/main/java/org/apache/maven/reporting/AbstractMavenReportRenderer.java
            /maven/components/branches/maven-2.0.x/maven-reporting/maven-reporting-impl/src/main/java/org/apache/maven/reporting/sink/MultiPageSink.java
            /maven/components/branches/maven-2.0.x/maven-reporting/maven-reporting-impl/src/main/java/org/apache/maven/reporting/sink/SinkFactory.java
            /maven/components/branches/maven-2.0.x/maven-reporting/pom.xml
            /maven/components/branches/maven-2.0.x/maven-settings/src/main/java/org/apache/maven/settings/DefaultMavenSettingsBuilder.java
            /maven/components/branches/maven-2.0.x/maven-settings/src/main/java/org/apache/maven/settings/MavenSettingsBuilder.java
            /maven/components/branches/maven-2.0.x/maven-settings/src/main/java/org/apache/maven/settings/RuntimeInfo.java
            /maven/components/branches/maven-2.0.x/maven-settings/src/main/java/org/apache/maven/settings/SettingsUtils.java
        
****************************************************************************
Output:
****************************************************************************
[INFO] Scanning for projects...
[INFO] ----------------------------------------------------------------------------
[INFO] Building Maven Local Settings Model
[INFO]    task-segment: [clean, install]
[INFO] ----------------------------------------------------------------------------
[INFO] [clean:clean]
[INFO] Deleting directory /home/continuum/continuum-maven/working-directory/31/target
[INFO] Deleting directory /home/continuum/continuum-maven/working-directory/31/target/classes
[INFO] Deleting directory /home/continuum/continuum-maven/working-directory/31/target/test-classes
[INFO] Setting property: classpath.resource.loader.class => 'org.codehaus.plexus.velocity.ContextClassLoaderResourceLoader'.
[INFO] Setting property: velocimacro.messages.on => 'false'.
[INFO] Setting property: resource.loader => 'classpath'.
[INFO] Setting property: resource.manager.logwhenfound => 'false'.
[INFO] ************************************************************** 
[INFO] Starting Jakarta Velocity v1.4
[INFO] RuntimeInstance initializing.
[INFO] Default Properties File: org/apache/velocity/runtime/defaults/velocity.properties
[INFO] Default ResourceManager initializing. (class org.apache.velocity.runtime.resource.ResourceManagerImpl)
[INFO] Resource Loader Instantiated: org.codehaus.plexus.velocity.ContextClassLoaderResourceLoader
[INFO] ClasspathResourceLoader : initialization starting.
[INFO] ClasspathResourceLoader : initialization complete.
[INFO] ResourceCache : initialized. (class org.apache.velocity.runtime.resource.ResourceCacheImpl)
[INFO] Default ResourceManager initialization complete.
[INFO] Loaded System Directive: org.apache.velocity.runtime.directive.Literal
[INFO] Loaded System Directive: org.apache.velocity.runtime.directive.Macro
[INFO] Loaded System Directive: org.apache.velocity.runtime.directive.Parse
[INFO] Loaded System Directive: org.apache.velocity.runtime.directive.Include
[INFO] Loaded System Directive: org.apache.velocity.runtime.directive.Foreach
[INFO] Created: 20 parsers.
[INFO] Velocimacro : initialization starting.
[INFO] Velocimacro : adding VMs from VM library template : VM_global_library.vm
[ERROR] ResourceManager : unable to find resource 'VM_global_library.vm' in any resource loader.
[INFO] Velocimacro : error using  VM library template VM_global_library.vm : org.apache.velocity.exception.ResourceNotFoundException:
Unable to find resource 'VM_global_library.vm'
[INFO] Velocimacro :  VM library template macro registration complete.
[INFO] Velocimacro : allowInline = true : VMs can be defined inline in templates
[INFO] Velocimacro : allowInlineToOverride = false : VMs defined inline may NOT replace previous
VM definitions
[INFO] Velocimacro : allowInlineLocal = false : VMs defined inline will be  global in scope
if allowed.
[INFO] Velocimacro : initialization complete.
[INFO] Velocity successfully started.
[INFO] [modello:xpp3-writer {execution: default}]
[INFO] outputDirectory: /home/continuum/continuum-maven/working-directory/31/target/generated-sources/modello
[INFO] [modello:java {execution: default}]
[INFO] outputDirectory: /home/continuum/continuum-maven/working-directory/31/target/generated-sources/modello
[INFO] [modello:xpp3-reader {execution: default}]
[INFO] outputDirectory: /home/continuum/continuum-maven/working-directory/31/target/generated-sources/modello
[INFO] [resources:resources]
[INFO] Using default encoding to copy filtered resources.
[WARNING] 
	Artifact junit:junit:jar:3.8.1:test retains local scope 'test' overriding broader scope 'compile'
	given by a dependency. If this is not intended, modify or remove the local scope.

[INFO] snapshot org.apache.maven:maven-model:2.0.5-SNAPSHOT: checking for updates from apache.snapshots
[INFO] [compiler:compile]
Compiling 20 source files to /home/continuum/continuum-maven/working-directory/31/target/classes
[INFO] ------------------------------------------------------------------------
[ERROR] BUILD FAILURE
[INFO] ------------------------------------------------------------------------
[INFO] Compilation failure

/home/continuum/continuum-maven/working-directory/31/src/main/java/org/apache/maven/settings/DefaultMavenSettingsBuilder.java:[69,12]
cannot find symbol
symbol  : method getFile(java.lang.String,java.lang.String,java.lang.String)
location: class org.apache.maven.settings.DefaultMavenSettingsBuilder

/home/continuum/continuum-maven/working-directory/31/src/main/java/org/apache/maven/settings/DefaultMavenSettingsBuilder.java:[72,12]
cannot find symbol
symbol  : method getFile(java.lang.String,java.lang.String,java.lang.String)
location: class org.apache.maven.settings.DefaultMavenSettingsBuilder

/home/continuum/continuum-maven/working-directory/31/src/main/java/org/apache/maven/settings/DefaultMavenSettingsBuilder.java:[164,12]
cannot find symbol
symbol  : method setLocalRepository(org.apache.maven.settings.Settings)
location: class org.apache.maven.settings.DefaultMavenSettingsBuilder


[INFO] ------------------------------------------------------------------------
[INFO] For more information, run Maven with the -e switch
[INFO] ------------------------------------------------------------------------
[INFO] Total time: 8 seconds
[INFO] Finished at: Sat Jul 08 11:02:45 PDT 2006
[INFO] Final Memory: 11M/141M
[INFO] ------------------------------------------------------------------------

****************************************************************************



Mime
View raw message