maven-notifications mailing list archives

Site index · List index
Message view « Date » · « Thread »
Top « Date » · « Thread »
From Continuum Build Server <contin...@ci.codehaus.org>
Subject [continuum] BUILD FAILURE: Maven Javadoc Plugin
Date Tue, 11 Jul 2006 17:04:21 GMT
Online report : http://ci.codehaus.org/continuum-maven/servlet/continuum/target/ProjectBuild.vm/view/ProjectBuild/id/48/buildId/6264
Build statistics:
  State: Failed
  Previous State: Failed
  Started at: Tue, 11 Jul 2006 10:04:01 -0700
  Finished at: Tue, 11 Jul 2006 10:04:21 -0700
  Total time: 19s
  Build Trigger: Schedule
  Exit code: 1
  Building machine hostname: cheddar.simulalabs.com
  Operating system : Linux(unknown)
  Java version : 1.5.0_03(Sun Microsystems Inc.)

Changes
         mperham          Documentation review updates
             /maven/plugins/trunk/maven-javadoc-plugin/src/site/apt/examples/aggregate.apt
            /maven/plugins/trunk/maven-javadoc-plugin/src/site/apt/examples/alternate-doclet.apt
(from /maven/plugins/trunk/maven-javadoc-plugin/src/site/apt/examples/alternatedoclet.apt:420895)
            /maven/plugins/trunk/maven-javadoc-plugin/src/site/apt/examples/alternatedoclet.apt
            /maven/plugins/trunk/maven-javadoc-plugin/src/site/apt/examples/exclude-package-names.apt
(from /maven/plugins/trunk/maven-javadoc-plugin/src/site/apt/examples/excludepackagenames.apt:420895)
            /maven/plugins/trunk/maven-javadoc-plugin/src/site/apt/examples/excludepackagenames.apt
            /maven/plugins/trunk/maven-javadoc-plugin/src/site/apt/examples/group-configuration.apt
(from /maven/plugins/trunk/maven-javadoc-plugin/src/site/apt/examples/groupconfiguration.apt:420895)
            /maven/plugins/trunk/maven-javadoc-plugin/src/site/apt/examples/groupconfiguration.apt
            /maven/plugins/trunk/maven-javadoc-plugin/src/site/apt/examples/stylesheet-configuration.apt
(from /maven/plugins/trunk/maven-javadoc-plugin/src/site/apt/examples/stylesheetconfiguration.apt:420895)
            /maven/plugins/trunk/maven-javadoc-plugin/src/site/apt/examples/stylesheetconfiguration.apt
            /maven/plugins/trunk/maven-javadoc-plugin/src/site/apt/examples/tag-configuration.apt
(from /maven/plugins/trunk/maven-javadoc-plugin/src/site/apt/examples/tagconfiguration.apt:420895)
            /maven/plugins/trunk/maven-javadoc-plugin/src/site/apt/examples/tagconfiguration.apt
            /maven/plugins/trunk/maven-javadoc-plugin/src/site/apt/index.apt
            /maven/plugins/trunk/maven-javadoc-plugin/src/site/apt/usage.apt
            /maven/plugins/trunk/maven-javadoc-plugin/src/site/fml/faq.fml
            /maven/plugins/trunk/maven-javadoc-plugin/src/site/site.xml
        
****************************************************************************
Output:
****************************************************************************
[INFO] Scanning for projects...
[INFO] ----------------------------------------------------------------------------
[INFO] Building Maven Javadoc Plugin
[INFO]    task-segment: [clean, install]
[INFO] ----------------------------------------------------------------------------
[INFO] [clean:clean]
[INFO] Deleting directory /home/continuum/continuum-maven/working-directory/48/target
[INFO] Deleting directory /home/continuum/continuum-maven/working-directory/48/target/classes
[INFO] Deleting directory /home/continuum/continuum-maven/working-directory/48/target/test-classes
[INFO] Setting property: classpath.resource.loader.class => 'org.codehaus.plexus.velocity.ContextClassLoaderResourceLoader'.
[INFO] Setting property: velocimacro.messages.on => 'false'.
[INFO] Setting property: resource.loader => 'classpath'.
[INFO] Setting property: resource.manager.logwhenfound => 'false'.
[INFO] ************************************************************** 
[INFO] Starting Jakarta Velocity v1.4
[INFO] RuntimeInstance initializing.
[INFO] Default Properties File: org/apache/velocity/runtime/defaults/velocity.properties
[INFO] Default ResourceManager initializing. (class org.apache.velocity.runtime.resource.ResourceManagerImpl)
[INFO] Resource Loader Instantiated: org.codehaus.plexus.velocity.ContextClassLoaderResourceLoader
[INFO] ClasspathResourceLoader : initialization starting.
[INFO] ClasspathResourceLoader : initialization complete.
[INFO] ResourceCache : initialized. (class org.apache.velocity.runtime.resource.ResourceCacheImpl)
[INFO] Default ResourceManager initialization complete.
[INFO] Loaded System Directive: org.apache.velocity.runtime.directive.Literal
[INFO] Loaded System Directive: org.apache.velocity.runtime.directive.Macro
[INFO] Loaded System Directive: org.apache.velocity.runtime.directive.Parse
[INFO] Loaded System Directive: org.apache.velocity.runtime.directive.Include
[INFO] Loaded System Directive: org.apache.velocity.runtime.directive.Foreach
[INFO] Created: 20 parsers.
[INFO] Velocimacro : initialization starting.
[INFO] Velocimacro : adding VMs from VM library template : VM_global_library.vm
[ERROR] ResourceManager : unable to find resource 'VM_global_library.vm' in any resource loader.
[INFO] Velocimacro : error using  VM library template VM_global_library.vm : org.apache.velocity.exception.ResourceNotFoundException:
Unable to find resource 'VM_global_library.vm'
[INFO] Velocimacro :  VM library template macro registration complete.
[INFO] Velocimacro : allowInline = true : VMs can be defined inline in templates
[INFO] Velocimacro : allowInlineToOverride = false : VMs defined inline may NOT replace previous
VM definitions
[INFO] Velocimacro : allowInlineLocal = false : VMs defined inline will be  global in scope
if allowed.
[INFO] Velocimacro : initialization complete.
[INFO] Velocity successfully started.
[INFO] [modello:java {execution: default}]
[INFO] outputDirectory: /home/continuum/continuum-maven/working-directory/48/target/generated-sources/modello
[INFO] [plugin:descriptor]
[INFO] Using 2 extractors.
[INFO] Applying extractor for language: java
[INFO] ------------------------------------------------------------------------
[ERROR] FATAL ERROR
[INFO] ------------------------------------------------------------------------
[INFO] org.apache.maven.plugin.descriptor.Parameter.setImplementation(Ljava/lang/String;)V
[INFO] ------------------------------------------------------------------------
[INFO] Trace
java.lang.NoSuchMethodError: org.apache.maven.plugin.descriptor.Parameter.setImplementation(Ljava/lang/String;)V
	at org.apache.maven.tools.plugin.extractor.java.JavaMojoDescriptorExtractor.extractParameters(JavaMojoDescriptorExtractor.java:431)
	at org.apache.maven.tools.plugin.extractor.java.JavaMojoDescriptorExtractor.createMojoDescriptor(JavaMojoDescriptorExtractor.java:303)
	at org.apache.maven.tools.plugin.extractor.java.JavaMojoDescriptorExtractor.execute(JavaMojoDescriptorExtractor.java:500)
	at org.apache.maven.tools.plugin.scanner.DefaultMojoScanner.populatePluginDescriptor(DefaultMojoScanner.java:69)
	at org.apache.maven.plugin.plugin.AbstractGeneratorMojo.execute(AbstractGeneratorMojo.java:99)
	at org.apache.maven.plugin.DefaultPluginManager.executeMojo(DefaultPluginManager.java:412)
	at org.apache.maven.lifecycle.DefaultLifecycleExecutor.executeGoals(DefaultLifecycleExecutor.java:534)
	at org.apache.maven.lifecycle.DefaultLifecycleExecutor.executeGoalWithLifecycle(DefaultLifecycleExecutor.java:475)
	at org.apache.maven.lifecycle.DefaultLifecycleExecutor.executeGoal(DefaultLifecycleExecutor.java:454)
	at org.apache.maven.lifecycle.DefaultLifecycleExecutor.executeGoalAndHandleFailures(DefaultLifecycleExecutor.java:306)
	at org.apache.maven.lifecycle.DefaultLifecycleExecutor.executeTaskSegments(DefaultLifecycleExecutor.java:273)
	at org.apache.maven.lifecycle.DefaultLifecycleExecutor.execute(DefaultLifecycleExecutor.java:140)
	at org.apache.maven.DefaultMaven.doExecute(DefaultMaven.java:322)
	at org.apache.maven.DefaultMaven.execute(DefaultMaven.java:115)
	at org.apache.maven.cli.MavenCli.main(MavenCli.java:256)
	at sun.reflect.NativeMethodAccessorImpl.invoke0(Native Method)
	at sun.reflect.NativeMethodAccessorImpl.invoke(NativeMethodAccessorImpl.java:39)
	at sun.reflect.DelegatingMethodAccessorImpl.invoke(DelegatingMethodAccessorImpl.java:25)
	at java.lang.reflect.Method.invoke(Method.java:585)
	at org.codehaus.classworlds.Launcher.launchEnhanced(Launcher.java:315)
	at org.codehaus.classworlds.Launcher.launch(Launcher.java:255)
	at org.codehaus.classworlds.Launcher.mainWithExitCode(Launcher.java:430)
	at org.codehaus.classworlds.Launcher.main(Launcher.java:375)
[INFO] ------------------------------------------------------------------------
[INFO] Total time: 16 seconds
[INFO] Finished at: Tue Jul 11 10:04:20 PDT 2006
[INFO] Final Memory: 14M/156M
[INFO] ------------------------------------------------------------------------

****************************************************************************



Mime
View raw message