maven-notifications mailing list archives

Site index · List index
Message view « Date » · « Thread »
Top « Date » · « Thread »
From Continuum Build Server <contin...@ci.codehaus.org>
Subject [continuum] BUILD FAILURE: Maven SCM CVS Provider - CVS Executable Impl.
Date Thu, 06 Jul 2006 10:23:55 GMT
Online report : http://ci.codehaus.org/continuum-maven/servlet/continuum/target/ProjectBuild.vm/view/ProjectBuild/id/87/buildId/6104
Build statistics:
  State: Failed
  Previous State: Failed
  Started at: Thu, 6 Jul 2006 03:23:13 -0700
  Finished at: Thu, 6 Jul 2006 03:23:55 -0700
  Total time: 41s
  Build Trigger: Forced
  Exit code: 1
  Building machine hostname: cheddar.simulalabs.com
  Operating system : Linux(unknown)
  Java version : 1.5.0_03(Sun Microsystems Inc.)

Changes
      No files changed
  
****************************************************************************
Output:
****************************************************************************
[INFO] Scanning for projects...
[INFO] ----------------------------------------------------------------------------
[INFO] Building Maven SCM CVS Provider - CVS Executable Impl.
[INFO]    task-segment: [clean, install]
[INFO] ----------------------------------------------------------------------------
[INFO] [clean:clean]
[INFO] Deleting directory /home/continuum/continuum-maven/working-directory/87/target
[INFO] Deleting directory /home/continuum/continuum-maven/working-directory/87/target/classes
[INFO] Deleting directory /home/continuum/continuum-maven/working-directory/87/target/test-classes
[INFO] [resources:resources]
[INFO] Using default encoding to copy filtered resources.
[INFO] snapshot org.apache.maven.scm:maven-scm-provider-cvstest:1.0-SNAPSHOT: checking for
updates from apache.snapshots
[INFO] snapshot org.apache.maven.scm:maven-scm-api:1.0-SNAPSHOT: checking for updates from
apache.snapshots
[INFO] snapshot org.apache.maven.scm:maven-scm-test:1.0-SNAPSHOT: checking for updates from
apache.snapshots
[INFO] snapshot org.apache.maven.scm:maven-scm-manager-plexus:1.0-SNAPSHOT: checking for updates
from apache.snapshots
[INFO] snapshot org.apache.maven.scm:maven-scm-managers:1.0-SNAPSHOT: checking for updates
from apache.snapshots
[INFO] snapshot org.apache.maven.scm:maven-scm-provider-cvs-commons:1.0-SNAPSHOT: checking
for updates from apache.snapshots
[INFO] [compiler:compile]
Compiling 16 source files to /home/continuum/continuum-maven/working-directory/87/target/classes
[INFO] [resources:testResources]
[INFO] Using default encoding to copy filtered resources.
[INFO] [compiler:testCompile]
Compiling 9 source files to /home/continuum/continuum-maven/working-directory/87/target/test-classes
[INFO] [surefire:test]
[INFO] Surefire report directory: /home/continuum/continuum-maven/working-directory/87/target/surefire-reports

-------------------------------------------------------
 T E S T S
-------------------------------------------------------
Running org.apache.maven.scm.provider.cvslib.cvsexe.command.diff.CvsExeDiffCommandTckTest
[INFO] Executing: cvs -z3 -f -d /home/continuum/continuum-maven/working-directory/87/target/scm-test/repository
-q checkout -d working-copy test-repo/module
[INFO] Working directory: /home/continuum/continuum-maven/working-directory/87/target/scm-test
[INFO] Executing: cvs -z3 -f -d /home/continuum/continuum-maven/working-directory/87/target/scm-test/repository
-q add project.xml
[INFO] Working directory: /home/continuum/continuum-maven/working-directory/87/target/scm-test/working-copy
[INFO] Executing: cvs -z3 -f -d /home/continuum/continuum-maven/working-directory/87/target/scm-test/repository
-q add src/test/java/org
[INFO] Working directory: /home/continuum/continuum-maven/working-directory/87/target/scm-test/working-copy
[INFO] Executing: cvs -z3 -f -d /home/continuum/continuum-maven/working-directory/87/target/scm-test/repository
-q add src/main/java/org
[INFO] Working directory: /home/continuum/continuum-maven/working-directory/87/target/scm-test/working-copy
[INFO] Executing: cvs -z3 -f -d /home/continuum/continuum-maven/working-directory/87/target/scm-test/repository
-q add src/main/java/org/Foo.java
[INFO] Working directory: /home/continuum/continuum-maven/working-directory/87/target/scm-test/working-copy
[INFO] Executing: cvs -z3 -f -d /home/continuum/continuum-maven/working-directory/87/target/scm-test/repository
-q diff -u -N
[INFO] Working directory: /home/continuum/continuum-maven/working-directory/87/target/scm-test/working-copy
Tests run: 1, Failures: 0, Errors: 0, Skipped: 0, Time elapsed: 1.787 sec
Running org.apache.maven.scm.provider.cvslib.cvsexe.command.update.CvsExeUpdateCommandTckTest
[INFO] Executing: cvs -z3 -f -d /home/continuum/continuum-maven/working-directory/87/target/scm-test/repository
-q checkout -d working-copy test-repo/module
[INFO] Working directory: /home/continuum/continuum-maven/working-directory/87/target/scm-test
[INFO] Executing: cvs -z3 -f -d /home/continuum/continuum-maven/working-directory/87/target/scm-test/repository
-q checkout -d updating-copy test-repo/module
[INFO] Working directory: /home/continuum/continuum-maven/working-directory/87/target/scm-test
[INFO] Executing: cvs -z3 -f -d /home/continuum/continuum-maven/working-directory/87/target/scm-test/repository
-q add project.xml
[INFO] Working directory: /home/continuum/continuum-maven/working-directory/87/target/scm-test/working-copy
[INFO] Executing: cvs -z3 -f -d /home/continuum/continuum-maven/working-directory/87/target/scm-test/repository
-q add src/test/java/org
[INFO] Working directory: /home/continuum/continuum-maven/working-directory/87/target/scm-test/working-copy
[INFO] Executing: cvs -z3 -f -d /home/continuum/continuum-maven/working-directory/87/target/scm-test/repository
-q add src/main/java/org
[INFO] Working directory: /home/continuum/continuum-maven/working-directory/87/target/scm-test/working-copy
[INFO] Executing: cvs -z3 -f -d /home/continuum/continuum-maven/working-directory/87/target/scm-test/repository
-q add src/main/java/org/Foo.java
[INFO] Working directory: /home/continuum/continuum-maven/working-directory/87/target/scm-test/working-copy
[INFO] Executing: cvs -z3 -f -d /home/continuum/continuum-maven/working-directory/87/target/scm-test/repository
-q commit -R -F /tmp/scm-commit-message33047.txt
[INFO] Working directory: /home/continuum/continuum-maven/working-directory/87/target/scm-test/working-copy
[INFO] Executing: cvs -z3 -f -d /home/continuum/continuum-maven/working-directory/87/target/scm-test/repository
-q update -d
[INFO] Working directory: /home/continuum/continuum-maven/working-directory/87/target/scm-test/updating-copy
[INFO] Executing: cvs -z3 -f -d /home/continuum/continuum-maven/working-directory/87/target/scm-test/repository
-q log -d '">2006-07-06T03:23:26-0700"'
[INFO] Working directory: /home/continuum/continuum-maven/working-directory/87/target/scm-test/updating-copy
Tests run: 1, Failures: 1, Errors: 0, Skipped: 0, Time elapsed: 4.94 sec <<< FAILURE!
Running org.apache.maven.scm.provider.cvslib.cvsexe.command.status.CvsExeStatusCommandTckTest
[INFO] Executing: cvs -z3 -f -d /home/continuum/continuum-maven/working-directory/87/target/scm-test/repository
-q checkout -d working-copy test-repo/module
[INFO] Working directory: /home/continuum/continuum-maven/working-directory/87/target/scm-test
[INFO] Executing: cvs -z3 -f -d /home/continuum/continuum-maven/working-directory/87/target/scm-test/repository
-q checkout -d updating-copy test-repo/module
[INFO] Working directory: /home/continuum/continuum-maven/working-directory/87/target/scm-test
[INFO] Executing: cvs -z3 -f -d /home/continuum/continuum-maven/working-directory/87/target/scm-test/repository
-q add project.xml
[INFO] Working directory: /home/continuum/continuum-maven/working-directory/87/target/scm-test/working-copy
[INFO] Executing: cvs -z3 -f -d /home/continuum/continuum-maven/working-directory/87/target/scm-test/repository
-q commit -R -F /tmp/scm-commit-message33048.txt
[INFO] Working directory: /home/continuum/continuum-maven/working-directory/87/target/scm-test/working-copy
[INFO] Executing: cvs -z3 -f -d /home/continuum/continuum-maven/working-directory/87/target/scm-test/repository
-q add src/test/java/org
[INFO] Working directory: /home/continuum/continuum-maven/working-directory/87/target/scm-test/updating-copy
[INFO] Executing: cvs -z3 -f -d /home/continuum/continuum-maven/working-directory/87/target/scm-test/repository
-q add src/main/java/org
[INFO] Working directory: /home/continuum/continuum-maven/working-directory/87/target/scm-test/updating-copy
[INFO] Executing: cvs -z3 -f -d /home/continuum/continuum-maven/working-directory/87/target/scm-test/repository
-q add src/main/java/org/Foo.java
[INFO] Working directory: /home/continuum/continuum-maven/working-directory/87/target/scm-test/updating-copy
[INFO] Executing: cvs -z3 -f -d /home/continuum/continuum-maven/working-directory/87/target/scm-test/repository
-n -q update -d
[INFO] Working directory: /home/continuum/continuum-maven/working-directory/87/target/scm-test/updating-copy
Tests run: 1, Failures: 0, Errors: 0, Skipped: 0, Time elapsed: 3.984 sec
Running org.apache.maven.scm.provider.cvslib.cvsexe.command.checkout.CvsExeCheckOutCommandTckTest
[INFO] Executing: cvs -z3 -f -d /home/continuum/continuum-maven/working-directory/87/target/scm-test/repository
-q checkout -d working-copy test-repo/module
[INFO] Working directory: /home/continuum/continuum-maven/working-directory/87/target/scm-test
[INFO] Executing: cvs -z3 -f -d /home/continuum/continuum-maven/working-directory/87/target/scm-test/repository
-q checkout -d working-copy test-repo/module
[INFO] Working directory: /home/continuum/continuum-maven/working-directory/87/target/scm-test
Tests run: 1, Failures: 0, Errors: 0, Skipped: 0, Time elapsed: 1.994 sec
Running org.apache.maven.scm.provider.cvslib.cvsexe.command.checkin.CvsExeCheckInCommandTckTest
[INFO] Executing: cvs -z3 -f -d /home/continuum/continuum-maven/working-directory/87/target/scm-test/repository
-q checkout -d working-copy test-repo/module
[INFO] Working directory: /home/continuum/continuum-maven/working-directory/87/target/scm-test
[INFO] Executing: cvs -z3 -f -d /home/continuum/continuum-maven/working-directory/87/target/scm-test/repository
-q add src/main/java/Foo.java
[INFO] Working directory: /home/continuum/continuum-maven/working-directory/87/target/scm-test/working-copy
[INFO] Executing: cvs -z3 -f -d /home/continuum/continuum-maven/working-directory/87/target/scm-test/repository
-q commit -R -F /tmp/scm-commit-message33049.txt
[INFO] Working directory: /home/continuum/continuum-maven/working-directory/87/target/scm-test/working-copy
[INFO] Executing: cvs -z3 -f -d /home/continuum/continuum-maven/working-directory/87/target/scm-test/repository
-q checkout -d assertion-copy test-repo/module
[INFO] Working directory: /home/continuum/continuum-maven/working-directory/87/target/scm-test
[INFO] Executing: cvs -z3 -f -d /home/continuum/continuum-maven/working-directory/87/target/scm-test/repository
-q checkout -d working-copy test-repo/module
[INFO] Working directory: /home/continuum/continuum-maven/working-directory/87/target/scm-test
[INFO] Executing: cvs -z3 -f -d /home/continuum/continuum-maven/working-directory/87/target/scm-test/repository
-q add src/main/java/Foo.java
[INFO] Working directory: /home/continuum/continuum-maven/working-directory/87/target/scm-test/working-copy
[INFO] Executing: cvs -z3 -f -d /home/continuum/continuum-maven/working-directory/87/target/scm-test/repository
-q commit -R -F /tmp/scm-commit-message33050.txt src/main/java/Foo.java
[INFO] Working directory: /home/continuum/continuum-maven/working-directory/87/target/scm-test/working-copy
[INFO] Executing: cvs -z3 -f -d /home/continuum/continuum-maven/working-directory/87/target/scm-test/repository
-q checkout -d assertion-copy test-repo/module
[INFO] Working directory: /home/continuum/continuum-maven/working-directory/87/target/scm-test
Tests run: 2, Failures: 0, Errors: 0, Skipped: 0, Time elapsed: 6 sec
Running org.apache.maven.scm.provider.cvslib.cvsexe.command.update.CvsExeUpdateCommandTest
Test command line: cvs -f -d /home/continuum/continuum-maven/working-directory/87/target/update-test/repository
co -d working-directory test-repo/update
Test command line: cvs -f -d /home/continuum/continuum-maven/working-directory/87/target/update-test/repository
co -d assertion-directory test-repo/update
[INFO] Executing: cvs -z3 -f -d /home/continuum/continuum-maven/working-directory/87/target/update-test/repository
-q update -d
[INFO] Working directory: /home/continuum/continuum-maven/working-directory/87/target/update-test/assertion-directory
Test command line: cvs -f -d /home/continuum/continuum-maven/working-directory/87/target/update-test/repository
add New.txt
Test command line: cvs -f -d /home/continuum/continuum-maven/working-directory/87/target/update-test/repository
commit -m .
[INFO] Executing: cvs -z3 -f -d /home/continuum/continuum-maven/working-directory/87/target/update-test/repository
-q update -d
[INFO] Working directory: /home/continuum/continuum-maven/working-directory/87/target/update-test/assertion-directory
[INFO] Executing: cvs -z3 -f -d /home/continuum/continuum-maven/working-directory/87/target/update-test/repository
-q log
[INFO] Working directory: /home/continuum/continuum-maven/working-directory/87/target/update-test/assertion-directory
Tests run: 1, Failures: 0, Errors: 0, Skipped: 0, Time elapsed: 5.026 sec
Running org.apache.maven.scm.provider.cvslib.cvsexe.command.checkout.CvsExeCheckoutCommandTest
[INFO] Executing: cvs -z3 -f -d /home/continuum/continuum-maven/working-directory/87/src/test/repository
-q checkout -d working-copy test-repo/checkout
[INFO] Working directory: /home/continuum/continuum-maven/working-directory/87/target/scm-test
[INFO] Executing: cvs -z3 -f -d /home/continuum/continuum-maven/working-directory/87/src/test/repository
-q checkout -r MAVEN_1_0 -d working-copy test-repo/checkout
[INFO] Working directory: /home/continuum/continuum-maven/working-directory/87/target/scm-test
Tests run: 2, Failures: 0, Errors: 0, Skipped: 0, Time elapsed: 1.972 sec
Running org.apache.maven.scm.provider.cvslib.cvsexe.command.changelog.CvsExeChangeLogCommandTest
Test command line: cvs -f -d /home/continuum/continuum-maven/working-directory/87/src/test/repository
co test-repo/changelog
[INFO] Executing: cvs -z3 -f -d /home/continuum/continuum-maven/working-directory/87/src/test/repository
-q log -d '"2003-02-01T00:00:00-0800<2004-02-01T00:00:00-0800"'
[INFO] Working directory: /home/continuum/continuum-maven/working-directory/87/target/scm-test/working-copy
Test command line: cvs -f -d /home/continuum/continuum-maven/working-directory/87/src/test/repository
co test-repo/changelog
[INFO] Executing: cvs -z3 -f -d /home/continuum/continuum-maven/working-directory/87/src/test/repository
-q log -d '">2003-02-01T00:00:00-0800"'
[INFO] Working directory: /home/continuum/continuum-maven/working-directory/87/target/scm-test/working-copy
Test command line: cvs -f -d /home/continuum/continuum-maven/working-directory/87/src/test/repository
co test-repo/changelog
[INFO] Executing: cvs -z3 -f -d /home/continuum/continuum-maven/working-directory/87/src/test/repository
-q log -r1.107.4
[INFO] Working directory: /home/continuum/continuum-maven/working-directory/87/target/scm-test/working-copy
Tests run: 3, Failures: 2, Errors: 0, Skipped: 0, Time elapsed: 3.035 sec <<< FAILURE!
Running org.apache.maven.scm.provider.cvslib.cvsexe.command.tag.CvsExeTagCommandTckTest
[INFO] Executing: cvs -z3 -f -d /home/continuum/continuum-maven/working-directory/87/target/scm-test/repository
-q checkout -d working-copy test-repo/module
[INFO] Working directory: /home/continuum/continuum-maven/working-directory/87/target/scm-test
[INFO] Executing: cvs -z3 -f -d /home/continuum/continuum-maven/working-directory/87/target/scm-test/repository
-q tag -F -c test-tag
[INFO] Working directory: /home/continuum/continuum-maven/working-directory/87/target/scm-test/working-copy
[INFO] Executing: cvs -z3 -f -d /home/continuum/continuum-maven/working-directory/87/target/scm-test/repository
-q commit -R -F /tmp/scm-commit-message33051.txt
[INFO] Working directory: /home/continuum/continuum-maven/working-directory/87/target/scm-test/working-copy
[INFO] Executing: cvs -z3 -f -d /home/continuum/continuum-maven/working-directory/87/target/scm-test/repository
-q checkout -d assertion-copy test-repo/module
[INFO] Working directory: /home/continuum/continuum-maven/working-directory/87/target/scm-test
[INFO] Executing: cvs -z3 -f -d /home/continuum/continuum-maven/working-directory/87/target/scm-test/repository
-q checkout -r test-tag -d assertion-copy test-repo/module
[INFO] Working directory: /home/continuum/continuum-maven/working-directory/87/target/scm-test
Tests run: 1, Failures: 0, Errors: 0, Skipped: 0, Time elapsed: 3.964 sec

Results :
Tests run: 13, Failures: 3, Errors: 0, Skipped: 0

[INFO] ------------------------------------------------------------------------
[ERROR] BUILD FAILURE
[INFO] ------------------------------------------------------------------------
[INFO] There are test failures.
[INFO] ------------------------------------------------------------------------
[INFO] For more information, run Maven with the -e switch
[INFO] ------------------------------------------------------------------------
[INFO] Total time: 41 seconds
[INFO] Finished at: Thu Jul 06 03:23:55 PDT 2006
[INFO] Final Memory: 9M/123M
[INFO] ------------------------------------------------------------------------

****************************************************************************



Mime
View raw message