maven-notifications mailing list archives

Site index · List index
Message view « Date » · « Thread »
Top « Date » · « Thread »
From Continuum Build Server <contin...@ci.codehaus.org>
Subject [continuum] BUILD FAILURE: Maven PLUGIN Plugin
Date Thu, 13 Jul 2006 08:06:25 GMT
Online report : http://ci.codehaus.org/continuum-maven/servlet/continuum/target/ProjectBuild.vm/view/ProjectBuild/id/50/buildId/6314
Build statistics:
  State: Failed
  Previous State: Failed
  Started at: Thu, 13 Jul 2006 01:06:23 -0700
  Finished at: Thu, 13 Jul 2006 01:06:25 -0700
  Total time: 1s
  Build Trigger: Forced
  Exit code: 1
  Building machine hostname: cheddar.simulalabs.com
  Operating system : Linux(unknown)
  Java version : 1.5.0_03(Sun Microsystems Inc.)

Changes
         brett          fix versions

             /maven/plugins/trunk/maven-plugin-plugin/pom.xml
        
****************************************************************************
Output:
****************************************************************************
[INFO] Scanning for projects...
[INFO] ------------------------------------------------------------------------
[ERROR] BUILD FAILURE
[INFO] ------------------------------------------------------------------------
[INFO] Unable to build project '/home/continuum/continuum-maven/working-directory/50/pom.xml;
it requires Maven version 2.0.5-SNAPSHOT
[INFO] ------------------------------------------------------------------------
[INFO] For more information, run Maven with the -e switch
[INFO] ------------------------------------------------------------------------
[INFO] Total time: < 1 second
[INFO] Finished at: Thu Jul 13 01:06:25 PDT 2006
[INFO] Final Memory: 1M/66M
[INFO] ------------------------------------------------------------------------

****************************************************************************



Mime
View raw message