maven-notifications mailing list archives

Site index · List index
Message view « Date » · « Thread »
Top « Date » · « Thread »
From Continuum Build Server <contin...@ci.codehaus.org>
Subject [continuum] BUILD FAILURE: Maven Install Plugin
Date Mon, 03 Jul 2006 19:07:14 GMT
Online report : http://ci.codehaus.org/continuum-maven/servlet/continuum/target/ProjectBuild.vm/view/ProjectBuild/id/46/buildId/6041
Build statistics:
  State: Failed
  Previous State: Ok
  Started at: Mon, 3 Jul 2006 12:07:09 -0700
  Finished at: Mon, 3 Jul 2006 12:07:14 -0700
  Total time: 5s
  Build Trigger: Forced
  Exit code: 1
  Building machine hostname: cheddar.simulalabs.com
  Operating system : Linux(unknown)
  Java version : 1.5.0_03(Sun Microsystems Inc.)

Changes
      No files changed
  
****************************************************************************
Output:
****************************************************************************
[INFO] Scanning for projects...
[INFO] ----------------------------------------------------------------------------
[INFO] Building Maven Install Plugin
[INFO]    task-segment: [clean, install]
[INFO] ----------------------------------------------------------------------------
[INFO] [clean:clean]
[INFO] Deleting directory /home/continuum/continuum-maven/working-directory/46/target
[INFO] Deleting directory /home/continuum/continuum-maven/working-directory/46/target/classes
[INFO] Deleting directory /home/continuum/continuum-maven/working-directory/46/target/test-classes
[INFO] [plugin:descriptor]
[INFO] Using 2 extractors.
[INFO] Applying extractor for language: java
[INFO] Extractor for language: java found 2 mojo descriptors.
[INFO] Applying extractor for language: bsh
[INFO] Extractor for language: bsh found 0 mojo descriptors.
[INFO] [resources:resources]
[INFO] Using default encoding to copy filtered resources.
[INFO] snapshot org.apache.maven:maven-plugin-testing-harness:1.0-SNAPSHOT: checking for updates
from snapshots
[INFO] snapshot org.apache.maven:maven-plugin-testing-harness:1.0-SNAPSHOT: checking for updates
from apache.snapshots
[INFO] [compiler:compile]
Compiling 3 source files to /home/continuum/continuum-maven/working-directory/46/target/classes
[INFO] ------------------------------------------------------------------------
[ERROR] BUILD FAILURE
[INFO] ------------------------------------------------------------------------
[INFO] Compilation failure

/home/continuum/continuum-maven/working-directory/46/src/main/java/org/apache/maven/plugin/install/AbstractInstallMojo.java:[123,38]
unreported exception org.apache.maven.repository.digest.DigesterException; must be caught
or declared to be thrown


[INFO] ------------------------------------------------------------------------
[INFO] For more information, run Maven with the -e switch
[INFO] ------------------------------------------------------------------------
[INFO] Total time: 4 seconds
[INFO] Finished at: Mon Jul 03 12:07:14 PDT 2006
[INFO] Final Memory: 11M/141M
[INFO] ------------------------------------------------------------------------

****************************************************************************



Mime
View raw message