maven-notifications mailing list archives

Site index · List index
Message view « Date » · « Thread »
Top « Date » · « Thread »
From Continuum Build Server <contin...@ci.codehaus.org>
Subject [continuum] BUILD SUCCESSFUL: Maven Wagon WebDav Provider
Date Mon, 19 Jun 2006 15:06:44 GMT
Online report : http://ci.codehaus.org/continuum-maven/servlet/continuum/target/ProjectBuild.vm/view/ProjectBuild/id/152/buildId/5864
Build statistics:
  State: Ok
  Previous State: Error
  Started at: Mon, 19 Jun 2006 08:06:28 -0700
  Finished at: Mon, 19 Jun 2006 08:06:43 -0700
  Total time: 15s
  Build Trigger: Schedule
  Exit code: 0
  Building machine hostname: cheddar.simulalabs.com
  Operating system : Linux(unknown)
  Java version : 1.5.0_03(Sun Microsystems Inc.)

Changes
         evenisse          [maven-release-plugin] prepare release wagon-1.0-beta-1
             /maven/wagon/trunk/pom.xml
            /maven/wagon/trunk/wagon-provider-api/pom.xml
            /maven/wagon/trunk/wagon-provider-test/pom.xml
            /maven/wagon/trunk/wagon-providers/pom.xml
            /maven/wagon/trunk/wagon-providers/wagon-file/pom.xml
            /maven/wagon/trunk/wagon-providers/wagon-ftp/pom.xml
            /maven/wagon/trunk/wagon-providers/wagon-http/pom.xml
            /maven/wagon/trunk/wagon-providers/wagon-http-lightweight/pom.xml
            /maven/wagon/trunk/wagon-providers/wagon-ssh/pom.xml
            /maven/wagon/trunk/wagon-providers/wagon-ssh-external/pom.xml
            /maven/wagon/trunk/wagon-providers/wagon-webdav/pom.xml
           evenisse          [maven-release-plugin] prepare for next development iteration
             /maven/wagon/trunk/pom.xml
            /maven/wagon/trunk/wagon-provider-api/pom.xml
            /maven/wagon/trunk/wagon-provider-test/pom.xml
            /maven/wagon/trunk/wagon-providers/pom.xml
            /maven/wagon/trunk/wagon-providers/wagon-file/pom.xml
            /maven/wagon/trunk/wagon-providers/wagon-ftp/pom.xml
            /maven/wagon/trunk/wagon-providers/wagon-http/pom.xml
            /maven/wagon/trunk/wagon-providers/wagon-http-lightweight/pom.xml
            /maven/wagon/trunk/wagon-providers/wagon-ssh/pom.xml
            /maven/wagon/trunk/wagon-providers/wagon-ssh-external/pom.xml
            /maven/wagon/trunk/wagon-providers/wagon-webdav/pom.xml
        
****************************************************************************
Output:
****************************************************************************
[INFO] Scanning for projects...
[INFO] ----------------------------------------------------------------------------
[INFO] Building Maven Wagon WebDav Provider
[INFO]    task-segment: [clean, install]
[INFO] ----------------------------------------------------------------------------
[INFO] [clean:clean]
[INFO] Deleting directory /home/continuum/continuum-maven/working-directory/152/target
[INFO] Deleting directory /home/continuum/continuum-maven/working-directory/152/target/classes
[INFO] Deleting directory /home/continuum/continuum-maven/working-directory/152/target/test-classes
[INFO] [resources:resources]
[INFO] Using default encoding to copy filtered resources.
Downloading: http://repo1.maven.org/maven2/org/mortbay/jetty/jetty/4.2.12/jetty-4.2.12.pom
[WARNING] Unable to get resource from repository central (http://repo1.maven.org/maven2)
[INFO] [compiler:compile]
Compiling 3 source files to /home/continuum/continuum-maven/working-directory/152/target/classes
[INFO] [resources:testResources]
[INFO] Using default encoding to copy filtered resources.
[INFO] [compiler:testCompile]
Compiling 6 source files to /home/continuum/continuum-maven/working-directory/152/target/test-classes
[INFO] [surefire:test]
[INFO] Surefire report directory: /home/continuum/continuum-maven/working-directory/152/target/surefire-reports

-------------------------------------------------------
 T E S T S
-------------------------------------------------------
Running org.apache.maven.wagon.providers.webdav.PutInputStreamTest
Tests run: 1, Failures: 0, Errors: 0, Skipped: 0, Time elapsed: 0.061 sec
Running org.apache.maven.wagon.providers.webdav.WebDavWagonTest
Local repository: file:///home/continuum/continuum-maven/working-directory/152/target/test-output/local-repository
08:06:41.702 EVENT  Starting Jetty/4.2.12
08:06:41.732 EVENT  Started ServletHttpContext[/dav]
08:06:41.744 EVENT  Started SocketListener on 0.0.0.0:10007
08:06:41.745 EVENT  Started org.mortbay.jetty.Server@110c424
File round trip testing ...
Putting test artifact: test-resource into test repository dav:http://localhost:10007/dav/newfolder/folder2
http://localhost:10007/dav/newfolder/folder2 - Session: Opened  
08:06:42.080 EVENT  [LOCALREPO] Initialized from /home/continuum/continuum-maven/working-directory/152/target/test-output/dav-repository
Invalid resource: /it/could/webdav/webdav.props
Invalid resource: /it/could/webdav/mime.types
Uploading: test-resource to http://localhost:10007/dav/newfolder/folder2

#
Transfer finished. 18 bytes copied in 0.021 seconds
http://localhost:10007/dav/newfolder/folder2 - Session: Disconnecting  
http://localhost:10007/dav/newfolder/folder2 - Session: Disconnected
Getting test artifact from test repository http://localhost:10007/dav/newfolder/folder2
http://localhost:10007/dav/newfolder/folder2 - Session: Opened  
attempting to create parent directories for destination: testWagon
Downloading: test-resource from http://localhost:10007/dav/newfolder/folder2

#
Transfer finished. 18 bytes copied in 0.0010 seconds
http://localhost:10007/dav/newfolder/folder2 - Session: Disconnecting  
http://localhost:10007/dav/newfolder/folder2 - Session: Disconnected
08:06:42.171 EVENT  Stopping Acceptor ServerSocket[addr=0.0.0.0/0.0.0.0,port=0,localport=10007]
08:06:42.173 EVENT  Stopped SocketListener on 0.0.0.0:10007
08:06:42.174 EVENT  Stopped ServletHttpContext[/dav]
08:06:42.174 EVENT  Stopped org.mortbay.jetty.Server@110c424
Local repository: file:///home/continuum/continuum-maven/working-directory/152/target/test-output/local-repository
08:06:42.222 EVENT  Starting Jetty/4.2.12
08:06:42.224 EVENT  Started ServletHttpContext[/dav]
08:06:42.225 EVENT  Started SocketListener on 0.0.0.0:10007
08:06:42.226 EVENT  Started org.mortbay.jetty.Server@888e6c
http://localhost:10007/dav/newfolder/folder2 - Session: Opened  
08:06:42.233 EVENT  [LOCALREPO] Initialized from /home/continuum/continuum-maven/working-directory/152/target/test-output/dav-repository
attempting to create parent directories for destination: testWagonPutDirectory
Downloading: directory-copy/test-resource-1.txt from http://localhost:10007/dav/newfolder/folder2

#
Transfer finished. 19 bytes copied in 0.0010 seconds
attempting to create parent directories for destination: testWagonPutDirectory
Downloading: directory-copy/a/test-resource-2.txt from http://localhost:10007/dav/newfolder/folder2

#
Transfer finished. 21 bytes copied in 0.0010 seconds
attempting to create parent directories for destination: testWagonPutDirectory
Downloading: directory-copy/a/b/test-resource-3.txt from http://localhost:10007/dav/newfolder/folder2

#
Transfer finished. 23 bytes copied in 0.0 seconds
attempting to create parent directories for destination: testWagonPutDirectory
Downloading: directory-copy/c/test-resource-4.txt from http://localhost:10007/dav/newfolder/folder2

#
Transfer finished. 21 bytes copied in 0.0010 seconds
http://localhost:10007/dav/newfolder/folder2 - Session: Disconnecting  
http://localhost:10007/dav/newfolder/folder2 - Session: Disconnected
08:06:42.351 EVENT  Stopping Acceptor ServerSocket[addr=0.0.0.0/0.0.0.0,port=0,localport=10007]
08:06:42.353 EVENT  Stopped SocketListener on 0.0.0.0:10007
08:06:42.353 EVENT  Stopped ServletHttpContext[/dav]
08:06:42.354 EVENT  Stopped org.mortbay.jetty.Server@888e6c
08:06:42.399 EVENT  Starting Jetty/4.2.12
Local repository: file:///home/continuum/continuum-maven/working-directory/152/target/test-output/local-repository
08:06:42.400 EVENT  Started ServletHttpContext[/dav]
08:06:42.401 EVENT  Started SocketListener on 0.0.0.0:10007
08:06:42.402 EVENT  Started org.mortbay.jetty.Server@1950198
http://localhost:10007/dav/newfolder/folder2 - Session: Opened  
08:06:42.406 EVENT  [LOCALREPO] Initialized from /home/continuum/continuum-maven/working-directory/152/target/test-output/dav-repository
 Transfer error: java.io.IOException: Couldn't get file
 Transfer error: java.io.IOException: Couldn't get file
 Transfer error: java.io.IOException: Couldn't get file
http://localhost:10007/dav/newfolder/folder2 - Session: Disconnecting  
http://localhost:10007/dav/newfolder/folder2 - Session: Disconnected
http://localhost:10007/dav/newfolder/folder2 - Session: Opened  
http://localhost:10007/dav/newfolder/folder2 - Session: Opened  
attempting to create parent directories for destination: test-resource-1.txt
Downloading: directory-copy-existing/test-resource-1.txt from http://localhost:10007/dav/newfolder/folder2

#
Transfer finished. 19 bytes copied in 0.0010 seconds
attempting to create parent directories for destination: test-resource-2.txt
Downloading: directory-copy-existing/a/test-resource-2.txt from http://localhost:10007/dav/newfolder/folder2

#
Transfer finished. 21 bytes copied in 0.0010 seconds
attempting to create parent directories for destination: test-resource-3.txt
Downloading: directory-copy-existing/a/b/test-resource-3.txt from http://localhost:10007/dav/newfolder/folder2

#
Transfer finished. 23 bytes copied in 0.0010 seconds
attempting to create parent directories for destination: test-resource-4.txt
Downloading: directory-copy-existing/c/test-resource-4.txt from http://localhost:10007/dav/newfolder/folder2

#
Transfer finished. 21 bytes copied in 0.0 seconds
http://localhost:10007/dav/newfolder/folder2 - Session: Disconnecting  
http://localhost:10007/dav/newfolder/folder2 - Session: Disconnected
08:06:42.561 EVENT  Stopping Acceptor ServerSocket[addr=0.0.0.0/0.0.0.0,port=0,localport=10007]
08:06:42.563 EVENT  Stopped SocketListener on 0.0.0.0:10007
08:06:42.563 EVENT  Stopped ServletHttpContext[/dav]
08:06:42.564 EVENT  Stopped org.mortbay.jetty.Server@1950198
08:06:42.604 EVENT  Starting Jetty/4.2.12
Local repository: file:///home/continuum/continuum-maven/working-directory/152/target/test-output/local-repository
08:06:42.605 EVENT  Started ServletHttpContext[/dav]
08:06:42.606 EVENT  Started SocketListener on 0.0.0.0:10007
08:06:42.607 EVENT  Started org.mortbay.jetty.Server@914f6a
Getting test artifact from test repository dav:http://localhost:10007/dav/newfolder/folder2
http://localhost:10007/dav/newfolder/folder2 - Session: Opened  
08:06:42.613 EVENT  [LOCALREPO] Initialized from /home/continuum/continuum-maven/working-directory/152/target/test-output/dav-repository
 Transfer error: java.io.IOException: Couldn't get file
http://localhost:10007/dav/newfolder/folder2 - Session: Disconnecting  
http://localhost:10007/dav/newfolder/folder2 - Session: Disconnected
08:06:42.617 EVENT  Stopping Acceptor ServerSocket[addr=0.0.0.0/0.0.0.0,port=0,localport=10007]
08:06:42.618 EVENT  Stopped SocketListener on 0.0.0.0:10007
08:06:42.619 EVENT  Stopped ServletHttpContext[/dav]
08:06:42.619 EVENT  Stopped org.mortbay.jetty.Server@914f6a
Tests run: 4, Failures: 0, Errors: 0, Skipped: 0, Time elapsed: 1.455 sec
Running org.apache.maven.wagon.providers.webdav.AuthenticatedWebDavWagonTest
Local repository: file:///home/continuum/continuum-maven/working-directory/152/target/test-output/local-repository
08:06:42.691 EVENT  Starting Jetty/4.2.12
08:06:42.692 EVENT  Started ServletHttpContext[/authdav]
08:06:42.693 EVENT  Started SocketListener on 0.0.0.0:10007
08:06:42.693 EVENT  Started org.mortbay.jetty.Server@1af33d6
File round trip testing ...
Putting test artifact: test-resource into test repository dav:http://localhost:10007/authdav/newfolder/folder2
http://localhost:10007/authdav/newfolder/folder2 - Session: Opened  
08:06:42.720 EVENT  [LOCALREPO] Initialized from /home/continuum/continuum-maven/working-directory/152/target/test-output/authdav-repository
Uploading: test-resource to http://localhost:10007/authdav/newfolder/folder2

#
Transfer finished. 18 bytes copied in 0.01 seconds
http://localhost:10007/authdav/newfolder/folder2 - Session: Disconnecting  
http://localhost:10007/authdav/newfolder/folder2 - Session: Disconnected
Getting test artifact from test repository http://localhost:10007/authdav/newfolder/folder2
http://localhost:10007/authdav/newfolder/folder2 - Session: Opened  
attempting to create parent directories for destination: testWagon
Downloading: test-resource from http://localhost:10007/authdav/newfolder/folder2

#
Transfer finished. 18 bytes copied in 0.0 seconds
http://localhost:10007/authdav/newfolder/folder2 - Session: Disconnecting  
http://localhost:10007/authdav/newfolder/folder2 - Session: Disconnected
08:06:42.763 EVENT  Stopping Acceptor ServerSocket[addr=0.0.0.0/0.0.0.0,port=0,localport=10007]
08:06:42.764 EVENT  Stopped SocketListener on 0.0.0.0:10007
08:06:42.765 EVENT  Stopped ServletHttpContext[/authdav]
08:06:42.766 EVENT  Stopped org.mortbay.jetty.Server@1af33d6
Local repository: file:///home/continuum/continuum-maven/working-directory/152/target/test-output/local-repository
08:06:42.816 EVENT  Starting Jetty/4.2.12
08:06:42.818 EVENT  Started ServletHttpContext[/authdav]
08:06:42.819 EVENT  Started SocketListener on 0.0.0.0:10007
08:06:42.820 EVENT  Started org.mortbay.jetty.Server@1e232b5
http://localhost:10007/authdav/newfolder/folder2 - Session: Opened  
08:06:42.828 EVENT  [LOCALREPO] Initialized from /home/continuum/continuum-maven/working-directory/152/target/test-output/authdav-repository
attempting to create parent directories for destination: testWagonPutDirectory
Downloading: directory-copy/test-resource-1.txt from http://localhost:10007/authdav/newfolder/folder2

#
Transfer finished. 19 bytes copied in 0.0 seconds
attempting to create parent directories for destination: testWagonPutDirectory
Downloading: directory-copy/a/test-resource-2.txt from http://localhost:10007/authdav/newfolder/folder2

#
Transfer finished. 21 bytes copied in 0.0010 seconds
attempting to create parent directories for destination: testWagonPutDirectory
Downloading: directory-copy/a/b/test-resource-3.txt from http://localhost:10007/authdav/newfolder/folder2

#
Transfer finished. 23 bytes copied in 0.0 seconds
attempting to create parent directories for destination: testWagonPutDirectory
08:06:42.961 EVENT  Stopping Acceptor ServerSocket[addr=0.0.0.0/0.0.0.0,port=0,localport=10007]
Downloading: directory-copy/c/test-resource-4.txt from http://localhost:10007/authdav/newfolder/folder2

#
Transfer finished. 21 bytes copied in 0.0 seconds
http://localhost:10007/authdav/newfolder/folder2 - Session: Disconnecting  
http://localhost:10007/authdav/newfolder/folder2 - Session: Disconnected
08:06:42.962 EVENT  Stopped SocketListener on 0.0.0.0:10007
08:06:42.963 EVENT  Stopped ServletHttpContext[/authdav]
08:06:42.964 EVENT  Stopped org.mortbay.jetty.Server@1e232b5
Local repository: file:///home/continuum/continuum-maven/working-directory/152/target/test-output/local-repository
08:06:43.000 EVENT  Starting Jetty/4.2.12
08:06:43.001 EVENT  Started ServletHttpContext[/authdav]
08:06:43.002 EVENT  Started SocketListener on 0.0.0.0:10007
08:06:43.003 EVENT  Started org.mortbay.jetty.Server@54c4ad
http://localhost:10007/authdav/newfolder/folder2 - Session: Opened  
08:06:43.010 EVENT  [LOCALREPO] Initialized from /home/continuum/continuum-maven/working-directory/152/target/test-output/authdav-repository
 Transfer error: java.io.IOException: Couldn't get file
 Transfer error: java.io.IOException: Couldn't get file
 Transfer error: java.io.IOException: Couldn't get file
http://localhost:10007/authdav/newfolder/folder2 - Session: Disconnecting  
http://localhost:10007/authdav/newfolder/folder2 - Session: Disconnected
http://localhost:10007/authdav/newfolder/folder2 - Session: Opened  
http://localhost:10007/authdav/newfolder/folder2 - Session: Opened  
attempting to create parent directories for destination: test-resource-1.txt
Downloading: directory-copy-existing/test-resource-1.txt from http://localhost:10007/authdav/newfolder/folder2

#
Transfer finished. 19 bytes copied in 0.0010 seconds
attempting to create parent directories for destination: test-resource-2.txt
Downloading: directory-copy-existing/a/test-resource-2.txt from http://localhost:10007/authdav/newfolder/folder2

#
Transfer finished. 21 bytes copied in 0.0010 seconds
attempting to create parent directories for destination: test-resource-3.txt
Downloading: directory-copy-existing/a/b/test-resource-3.txt from http://localhost:10007/authdav/newfolder/folder2

#
Transfer finished. 23 bytes copied in 0.0010 seconds
attempting to create parent directories for destination: test-resource-4.txt
Downloading: directory-copy-existing/c/test-resource-4.txt from http://localhost:10007/authdav/newfolder/folder2

#
Transfer finished. 21 bytes copied in 0.0010 seconds
http://localhost:10007/authdav/newfolder/folder2 - Session: Disconnecting  
http://localhost:10007/authdav/newfolder/folder2 - Session: Disconnected
08:06:43.150 EVENT  Stopping Acceptor ServerSocket[addr=0.0.0.0/0.0.0.0,port=0,localport=10007]
08:06:43.151 EVENT  Stopped SocketListener on 0.0.0.0:10007
08:06:43.152 EVENT  Stopped ServletHttpContext[/authdav]
08:06:43.153 EVENT  Stopped org.mortbay.jetty.Server@54c4ad
Local repository: file:///home/continuum/continuum-maven/working-directory/152/target/test-output/local-repository
08:06:43.187 EVENT  Starting Jetty/4.2.12
08:06:43.188 EVENT  Started ServletHttpContext[/authdav]
08:06:43.190 EVENT  Started SocketListener on 0.0.0.0:10007
08:06:43.191 EVENT  Started org.mortbay.jetty.Server@e61a35
Getting test artifact from test repository dav:http://localhost:10007/authdav/newfolder/folder2
http://localhost:10007/authdav/newfolder/folder2 - Session: Opened  
08:06:43.196 EVENT  [LOCALREPO] Initialized from /home/continuum/continuum-maven/working-directory/152/target/test-output/authdav-repository
 Transfer error: java.io.IOException: Couldn't get file
http://localhost:10007/authdav/newfolder/folder2 - Session: Disconnecting  
http://localhost:10007/authdav/newfolder/folder2 - Session: Disconnected
08:06:43.200 EVENT  Stopping Acceptor ServerSocket[addr=0.0.0.0/0.0.0.0,port=0,localport=10007]
08:06:43.201 EVENT  Stopped SocketListener on 0.0.0.0:10007
08:06:43.202 EVENT  Stopped ServletHttpContext[/authdav]
08:06:43.202 EVENT  Stopped org.mortbay.jetty.Server@e61a35
Tests run: 4, Failures: 0, Errors: 0, Skipped: 0, Time elapsed: 0.581 sec

Results :
Tests run: 9, Failures: 0, Errors: 0, Skipped: 0

[INFO] [jar:jar]
[INFO] Building jar: /home/continuum/continuum-maven/working-directory/152/target/wagon-webdav-1.0-beta-2-SNAPSHOT.jar
[INFO] [install:install]
[INFO] Installing /home/continuum/continuum-maven/working-directory/152/target/wagon-webdav-1.0-beta-2-SNAPSHOT.jar
to /home/continuum/.m2/repository/org/apache/maven/wagon/wagon-webdav/1.0-beta-2-SNAPSHOT/wagon-webdav-1.0-beta-2-SNAPSHOT.jar
[INFO] ------------------------------------------------------------------------
[INFO] BUILD SUCCESSFUL
[INFO] ------------------------------------------------------------------------
[INFO] Total time: 14 seconds
[INFO] Finished at: Mon Jun 19 08:06:43 PDT 2006
[INFO] Final Memory: 9M/141M
[INFO] ------------------------------------------------------------------------

****************************************************************************



Mime
View raw message