maven-notifications mailing list archives

Site index · List index
Message view « Date » · « Thread »
Top « Date » · « Thread »
From Continuum Build Server <contin...@ci.codehaus.org>
Subject [continuum] BUILD FAILURE: Maven War Plugin
Date Thu, 22 Jun 2006 22:05:03 GMT
Online report : http://ci.codehaus.org/continuum-maven/servlet/continuum/target/ProjectBuild.vm/view/ProjectBuild/id/61/buildId/5908
Build statistics:
  State: Failed
  Previous State: Failed
  Started at: Thu, 22 Jun 2006 15:04:44 -0700
  Finished at: Thu, 22 Jun 2006 15:05:03 -0700
  Total time: 19s
  Build Trigger: Schedule
  Exit code: 1
  Building machine hostname: cheddar.simulalabs.com
  Operating system : Linux(unknown)
  Java version : 1.5.0_03(Sun Microsystems Inc.)

Changes
         dennisl          [MWAR-51] documentation missing on website
             /maven/plugins/trunk/maven-war-plugin/src/site/apt/introduction.apt
        
****************************************************************************
Output:
****************************************************************************
[INFO] Scanning for projects...
[INFO] ----------------------------------------------------------------------------
[INFO] Building Maven War Plugin
[INFO]    task-segment: [clean, install]
[INFO] ----------------------------------------------------------------------------
[INFO] [clean:clean]
[INFO] Deleting directory /home/continuum/continuum-maven/working-directory/61/target
[INFO] Deleting directory /home/continuum/continuum-maven/working-directory/61/target/classes
[INFO] Deleting directory /home/continuum/continuum-maven/working-directory/61/target/test-classes
[INFO] [plugin:descriptor]
[INFO] Using 2 extractors.
[INFO] Applying extractor for language: java
[INFO] Extractor for language: java found 4 mojo descriptors.
[INFO] Applying extractor for language: bsh
[INFO] Extractor for language: bsh found 0 mojo descriptors.
[INFO] [resources:resources]
[INFO] Using default encoding to copy filtered resources.
[INFO] snapshot org.apache.maven:maven-archiver:2.1-SNAPSHOT: checking for updates from snapshots
[INFO] snapshot org.apache.maven:maven-archiver:2.1-SNAPSHOT: checking for updates from apache.snapshots
[INFO] snapshot org.apache.maven.shared:maven-shared-components:2-SNAPSHOT: checking for updates
from snapshots
[INFO] snapshot org.apache.maven.shared:maven-shared-components:2-SNAPSHOT: checking for updates
from apache.snapshots
[WARNING] 
	Artifact junit:junit:jar:3.8.1:test retains local scope 'test' overriding broader scope 'compile'
	given by a dependency. If this is not intended, modify or remove the local scope.

[INFO] [compiler:compile]
Compiling 6 source files to /home/continuum/continuum-maven/working-directory/61/target/classes
[INFO] [resources:testResources]
[INFO] Using default encoding to copy filtered resources.
[INFO] [compiler:testCompile]
Compiling 21 source files to /home/continuum/continuum-maven/working-directory/61/target/test-classes
[INFO] [surefire:test]
[INFO] Surefire report directory: /home/continuum/continuum-maven/working-directory/61/target/surefire-reports

-------------------------------------------------------
 T E S T S
-------------------------------------------------------
Running org.apache.maven.plugin.war.PropertyUtilsTest
Tests run: 3, Failures: 0, Errors: 0, Skipped: 0, Time elapsed: 0.797 sec
Running org.apache.maven.plugin.war.WarManifestMojoTest
Tests run: 5, Failures: 1, Errors: 0, Skipped: 0, Time elapsed: 0.445 sec <<< FAILURE!
Running org.apache.maven.plugin.war.WarMojoTest
[INFO] Exploding webapp...
[INFO] Copy webapp webResources to /home/continuum/continuum-maven/working-directory/61/target/test-classes/unit/warmojotest/SimpleWar
[INFO] Assembling webapp maven-war-plugin-test in /home/continuum/continuum-maven/working-directory/61/target/test-classes/unit/warmojotest/SimpleWar
[INFO] Generating war /home/continuum/continuum-maven/working-directory/61/target/test-classes/unit/warmojotest/SimpleWar-output/simple.war
[INFO] Building war: /home/continuum/continuum-maven/working-directory/61/target/test-classes/unit/warmojotest/SimpleWar-output/simple.war
[INFO] Exploding webapp...
[INFO] Copy webapp webResources to /home/continuum/continuum-maven/working-directory/61/target/test-classes/unit/warmojotest/Classifier
[INFO] Assembling webapp maven-war-plugin-test in /home/continuum/continuum-maven/working-directory/61/target/test-classes/unit/warmojotest/Classifier
[INFO] Generating war /home/continuum/continuum-maven/working-directory/61/target/test-classes/unit/warmojotest/Classifier-output/simple-test-classifier.war
[INFO] Building war: /home/continuum/continuum-maven/working-directory/61/target/test-classes/unit/warmojotest/Classifier-output/simple-test-classifier.war
[INFO] Exploding webapp...
[INFO] Copy webapp webResources to /home/continuum/continuum-maven/working-directory/61/target/test-classes/unit/warmojotest/PrimaryArtifact
[INFO] Assembling webapp maven-war-plugin-test in /home/continuum/continuum-maven/working-directory/61/target/test-classes/unit/warmojotest/PrimaryArtifact
[INFO] Generating war /home/continuum/continuum-maven/working-directory/61/target/test-classes/unit/warmojotest/PrimaryArtifact-output/simple.war
[INFO] Building war: /home/continuum/continuum-maven/working-directory/61/target/test-classes/unit/warmojotest/PrimaryArtifact-output/simple.war
[INFO] Exploding webapp...
[INFO] Copy webapp webResources to /home/continuum/continuum-maven/working-directory/61/target/test-classes/unit/warmojotest/NotPrimaryArtifact
[INFO] Assembling webapp maven-war-plugin-test in /home/continuum/continuum-maven/working-directory/61/target/test-classes/unit/warmojotest/NotPrimaryArtifact
[INFO] Generating war /home/continuum/continuum-maven/working-directory/61/target/test-classes/unit/warmojotest/NotPrimaryArtifact-output/simple.war
[INFO] Building war: /home/continuum/continuum-maven/working-directory/61/target/test-classes/unit/warmojotest/NotPrimaryArtifact-output/simple.war
Tests run: 5, Failures: 0, Errors: 0, Skipped: 0, Time elapsed: 0.48 sec
Running org.apache.maven.plugin.war.WarExplodedMojoTest
[INFO] Exploding webapp...
[INFO] Copy webapp webResources to /home/continuum/continuum-maven/working-directory/61/target/test-classes/unit/warexplodedmojo/test-dir/SimpleExplodedWar
[INFO] Copy webapp webResources to /home/continuum/continuum-maven/working-directory/61/target/test-classes/unit/warexplodedmojo/test-dir/SimpleExplodedWar
[INFO] Assembling webapp maven-war-plugin-test in /home/continuum/continuum-maven/working-directory/61/target/test-classes/unit/warexplodedmojo/test-dir/SimpleExplodedWar
[INFO] Exploding webapp...
[INFO] Copy webapp webResources to /home/continuum/continuum-maven/working-directory/61/target/test-classes/unit/warexplodedmojo/test-dir/ExplodedWar_WithCustomWebXML
[INFO] Assembling webapp maven-war-plugin-test in /home/continuum/continuum-maven/working-directory/61/target/test-classes/unit/warexplodedmojo/test-dir/ExplodedWar_WithCustomWebXML
[INFO] Exploding webapp...
[INFO] Copy webapp webResources to /home/continuum/continuum-maven/working-directory/61/target/test-classes/unit/warexplodedmojo/test-dir/ExplodedWar_WithContainerConfigXML
[INFO] Assembling webapp maven-war-plugin-test in /home/continuum/continuum-maven/working-directory/61/target/test-classes/unit/warexplodedmojo/test-dir/ExplodedWar_WithContainerConfigXML
[INFO] Exploding webapp...
[INFO] Copy webapp webResources to /home/continuum/continuum-maven/working-directory/61/target/test-classes/unit/warexplodedmojo/test-dir/ExplodedWar_WithSimpleExternalWARFile
[INFO] Assembling webapp maven-war-plugin-test in /home/continuum/continuum-maven/working-directory/61/target/test-classes/unit/warexplodedmojo/test-dir/ExplodedWar_WithSimpleExternalWARFile
[INFO] Expanding: /home/continuum/continuum-maven/working-directory/61/target/test-classes/unit/sample_wars/simple.war
into /home/continuum/continuum-maven/working-directory/61/target/test-classes/unit/warexplodedmojo/test-dir/war/work-ExplodedWar_WithSimpleExternalWARFile/simple
[INFO] Overlaying 1 war(s).
[INFO] Exploding webapp...
[INFO] Copy webapp webResources to /home/continuum/continuum-maven/working-directory/61/target/test-classes/unit/warexplodedmojo/test-dir/ExplodedWar_WithEJB
[INFO] Assembling webapp maven-war-plugin-test in /home/continuum/continuum-maven/working-directory/61/target/test-classes/unit/warexplodedmojo/test-dir/ExplodedWar_WithEJB
[INFO] Exploding webapp...
[INFO] Copy webapp webResources to /home/continuum/continuum-maven/working-directory/61/target/test-classes/unit/warexplodedmojo/test-dir/ExplodedWarWithJar
[INFO] Assembling webapp maven-war-plugin-test in /home/continuum/continuum-maven/working-directory/61/target/test-classes/unit/warexplodedmojo/test-dir/ExplodedWarWithJar
[INFO] Exploding webapp...
[INFO] Copy webapp webResources to /home/continuum/continuum-maven/working-directory/61/target/test-classes/unit/warexplodedmojo/test-dir/ExplodedWar_WithEJB
[INFO] Assembling webapp maven-war-plugin-test in /home/continuum/continuum-maven/working-directory/61/target/test-classes/unit/warexplodedmojo/test-dir/ExplodedWar_WithEJB
[INFO] Exploding webapp...
[INFO] Copy webapp webResources to /home/continuum/continuum-maven/working-directory/61/target/test-classes/unit/warexplodedmojo/test-dir/ExplodedWar_WithTLD
[INFO] Assembling webapp maven-war-plugin-test in /home/continuum/continuum-maven/working-directory/61/target/test-classes/unit/warexplodedmojo/test-dir/ExplodedWar_WithTLD
[INFO] Exploding webapp...
[INFO] Copy webapp webResources to /home/continuum/continuum-maven/working-directory/61/target/test-classes/unit/warexplodedmojo/test-dir/ExplodedWar_WithPAR
[INFO] Assembling webapp maven-war-plugin-test in /home/continuum/continuum-maven/working-directory/61/target/test-classes/unit/warexplodedmojo/test-dir/ExplodedWar_WithPAR
[INFO] Exploding webapp...
[INFO] Copy webapp webResources to /home/continuum/continuum-maven/working-directory/61/target/test-classes/unit/warexplodedmojo/test-dir/ExplodedWar_WithDuplicateDependencies
[INFO] Assembling webapp maven-war-plugin-test in /home/continuum/continuum-maven/working-directory/61/target/test-classes/unit/warexplodedmojo/test-dir/ExplodedWar_WithDuplicateDependencies
[INFO] Exploding webapp...
[INFO] Copy webapp webResources to /home/continuum/continuum-maven/working-directory/61/target/test-classes/unit/warexplodedmojo/test-dir/ExplodedWar_WithClasses
[INFO] Assembling webapp maven-war-plugin-test in /home/continuum/continuum-maven/working-directory/61/target/test-classes/unit/warexplodedmojo/test-dir/ExplodedWar_WithClasses
[INFO] Exploding webapp...
[INFO] Copy webapp webResources to /home/continuum/continuum-maven/working-directory/61/target/test-classes/unit/warexplodedmojo/test-dir/ExplodedWar_WithResourceFiltering
[INFO] Copy webapp webResources to /home/continuum/continuum-maven/working-directory/61/target/test-classes/unit/warexplodedmojo/test-dir/ExplodedWar_WithResourceFiltering
[INFO] Assembling webapp maven-war-plugin-test in /home/continuum/continuum-maven/working-directory/61/target/test-classes/unit/warexplodedmojo/test-dir/ExplodedWar_WithResourceFiltering
[INFO] Exploding webapp...
[INFO] Copy webapp webResources to /home/continuum/continuum-maven/working-directory/61/target/test-classes/unit/warexplodedmojo/test-dir/ExplodedWar_WithSourceIncludeExclude
[INFO] Assembling webapp maven-war-plugin-test in /home/continuum/continuum-maven/working-directory/61/target/test-classes/unit/warexplodedmojo/test-dir/ExplodedWar_WithSourceIncludeExclude
[INFO] Exploding webapp...
[INFO] Copy webapp webResources to /home/continuum/continuum-maven/working-directory/61/target/test-classes/unit/warexplodedmojo/test-dir/ExplodedWar_WithWarDependencyIncludeExclude
[INFO] Assembling webapp maven-war-plugin-test in /home/continuum/continuum-maven/working-directory/61/target/test-classes/unit/warexplodedmojo/test-dir/ExplodedWar_WithWarDependencyIncludeExclude
[INFO] Expanding: /home/continuum/continuum-maven/working-directory/61/target/test-classes/unit/sample_wars/include-exclude.war
into /home/continuum/continuum-maven/working-directory/61/target/test-classes/unit/warexplodedmojo/test-dir/war/work-ExplodedWar_WithWarDependencyIncludeExclude/include-exclude
[INFO] Overlaying 1 war(s).
[INFO] Exploding webapp...
[INFO] Copy webapp webResources to /home/continuum/continuum-maven/working-directory/61/target/test-classes/unit/warexplodedmojo/test-dir/ExplodedWarWithSourceModificationCheck
[INFO] Assembling webapp maven-war-plugin-test in /home/continuum/continuum-maven/working-directory/61/target/test-classes/unit/warexplodedmojo/test-dir/ExplodedWarWithSourceModificationCheck
Tests run: 16, Failures: 0, Errors: 0, Skipped: 0, Time elapsed: 1.189 sec
Running org.apache.maven.plugin.war.WarInPlaceMojoTest
[INFO] Generating webapp in source directory... /home/continuum/continuum-maven/working-directory/61/target/test-classes/unit/warexplodedinplacemojo/test-dir/SimpleExplodedInplaceWar-test-data/source
[INFO] Exploding webapp...
[INFO] Copy webapp webResources to /home/continuum/continuum-maven/working-directory/61/target/test-classes/unit/warexplodedinplacemojo/test-dir/SimpleExplodedInplaceWar-test-data/source
[INFO] Assembling webapp maven-war-plugin-test in /home/continuum/continuum-maven/working-directory/61/target/test-classes/unit/warexplodedinplacemojo/test-dir/SimpleExplodedInplaceWar-test-data/source
Tests run: 2, Failures: 0, Errors: 0, Skipped: 0, Time elapsed: 0.088 sec

Results :
Tests run: 31, Failures: 1, Errors: 0, Skipped: 0

[INFO] ------------------------------------------------------------------------
[ERROR] BUILD FAILURE
[INFO] ------------------------------------------------------------------------
[INFO] There are test failures.
[INFO] ------------------------------------------------------------------------
[INFO] For more information, run Maven with the -e switch
[INFO] ------------------------------------------------------------------------
[INFO] Total time: 18 seconds
[INFO] Finished at: Thu Jun 22 15:05:03 PDT 2006
[INFO] Final Memory: 12M/156M
[INFO] ------------------------------------------------------------------------

****************************************************************************



Mime
View raw message