maven-notifications mailing list archives

Site index · List index
Message view « Date » · « Thread »
Top « Date » · « Thread »
From Continuum Build Server <contin...@ci.codehaus.org>
Subject [continuum] BUILD FAILURE: SureFire API
Date Thu, 15 Jun 2006 16:07:00 GMT
Online report : http://ci.codehaus.org/continuum-maven/servlet/continuum/target/ProjectBuild.vm/view/ProjectBuild/id/147/buildId/5783
Build statistics:
  State: Failed
  Previous State: Ok
  Started at: Thu, 15 Jun 2006 09:06:49 -0700
  Finished at: Thu, 15 Jun 2006 09:07:00 -0700
  Total time: 11s
  Build Trigger: Schedule
  Exit code: 1
  Building machine hostname: cheddar.simulalabs.com
  Operating system : Linux(unknown)
  Java version : 1.5.0_03(Sun Microsystems Inc.)

Changes
         carlos          Refactor ConsoleReporter output
             /maven/surefire/trunk/surefire-api/pom.xml
            /maven/surefire/trunk/surefire-api/src/main/java/org/apache/maven/surefire/report/AbstractConsoleReporter.java
            /maven/surefire/trunk/surefire-api/src/main/java/org/apache/maven/surefire/report/ForkingConsoleReporter.java
            /maven/surefire/trunk/surefire-api/src/main/java/org/apache/maven/surefire/report/ReportEntry.java
            /maven/surefire/trunk/surefire-api/src/test/java/org/apache/maven/surefire/report/AbstractConsoleReporterTest.java
            /maven/surefire/trunk/surefire-api/src/test/java/org/apache/maven/surefire/report/ForkingConsoleReporterTest.java
        
****************************************************************************
Output:
****************************************************************************
[INFO] Scanning for projects...
[INFO] ----------------------------------------------------------------------------
[INFO] Building SureFire API
[INFO]    task-segment: [clean, install]
[INFO] ----------------------------------------------------------------------------
[INFO] [clean:clean]
[INFO] Deleting directory /home/continuum/continuum-maven/working-directory/147/target
[INFO] Deleting directory /home/continuum/continuum-maven/working-directory/147/target/classes
[INFO] Deleting directory /home/continuum/continuum-maven/working-directory/147/target/test-classes
[INFO] [resources:resources]
[INFO] Using default encoding to copy filtered resources.
[INFO] [compiler:compile]
Compiling 31 source files to /home/continuum/continuum-maven/working-directory/147/target/classes
[INFO] [resources:testResources]
[INFO] Using default encoding to copy filtered resources.
[INFO] [compiler:testCompile]
Compiling 15 source files to /home/continuum/continuum-maven/working-directory/147/target/test-classes
[INFO] [surefire:test]
[INFO] Surefire report directory: /home/continuum/continuum-maven/working-directory/147/target/surefire-reports

-------------------------------------------------------
 T E S T S
-------------------------------------------------------
Running org.apache.maven.surefire.SimpleJUnitTest
Tests run: 2, Failures: 0, Errors: 0, Skipped: 0, Time elapsed: 0.04 sec
Running org.apache.maven.surefire.SysUnitTest
No assert available
Tests run: 1, Failures: 0, Errors: 0, Skipped: 0, Time elapsed: 0.009 sec
Running org.apache.maven.surefire.report.ForkingConsoleReporterTest
Tests run: 3, Failures: 0, Errors: 3, Skipped: 0, Time elapsed: 0.029 sec <<< FAILURE!
Running org.apache.maven.surefire.report.XMLReporterTest
Tests run: 2, Failures: 0, Errors: 0, Skipped: 0, Time elapsed: 0.022 sec
Running org.apache.maven.surefire.ReportEntryTest
Tests run: 1, Failures: 0, Errors: 0, Skipped: 0, Time elapsed: 0.016 sec
Running org.apache.maven.surefire.POJOTest
Foo
Bar
Tests run: 2, Failures: 0, Errors: 0, Skipped: 0, Time elapsed: 0.018 sec
Running org.apache.maven.surefire.TestReport
Tests run: 0, Failures: 0, Errors: 0, Skipped: 0, Time elapsed: 0.01 sec

Results :
Tests run: 11, Failures: 0, Errors: 3, Skipped: 0

[INFO] ------------------------------------------------------------------------
[ERROR] BUILD FAILURE
[INFO] ------------------------------------------------------------------------
[INFO] There are test failures.
[INFO] ------------------------------------------------------------------------
[INFO] For more information, run Maven with the -e switch
[INFO] ------------------------------------------------------------------------
[INFO] Total time: 9 seconds
[INFO] Finished at: Thu Jun 15 09:07:00 PDT 2006
[INFO] Final Memory: 9M/143M
[INFO] ------------------------------------------------------------------------

****************************************************************************



Mime
View raw message