maven-notifications mailing list archives

Site index · List index
Message view « Date » · « Thread »
Top « Date » · « Thread »
From Continuum Build Server <contin...@ci.codehaus.org>
Subject [continuum] BUILD FAILURE: Maven Repository Indexer
Date Fri, 17 Mar 2006 08:41:59 GMT
Online report : http://ci.codehaus.org/continuum-maven/servlet/continuum/target/ProjectBuild.vm/view/ProjectBuild/id/7/buildId/294
Build statistics:
  State: Failed
  Previous Build: No previous build.
  Started at: Fri, 17 Mar 2006 00:41:20 -0800
  Finished at: Fri, 17 Mar 2006 00:41:59 -0800
  Total time: 38s
  Build Trigger: Schedule
  Exit code: 1
  Building machine hostname: cheddar.simulalabs.com
  Operating system : Linux(unknown)
  Java version : 1.5.0_03(Sun Microsystems Inc.)

Changes
      No files changed
  
****************************************************************************
Output:
****************************************************************************
[INFO] Scanning for projects...
[INFO] ----------------------------------------------------------------------------
[INFO] Building Maven Repository Indexer
[INFO]    task-segment: [clean, install]
[INFO] ----------------------------------------------------------------------------
[INFO] [clean:clean]
[INFO] Deleting directory /home/nobody/continuum-maven/working-directory/7/target
[INFO] Deleting directory /home/nobody/continuum-maven/working-directory/7/target/classes
[INFO] Deleting directory /home/nobody/continuum-maven/working-directory/7/target/test-classes
[INFO] [plexus:descriptor {execution: default}]
[INFO] [resources:resources]
[INFO] Using default encoding to copy filtered resources.
[WARNING] 
	Artifact junit:junit:jar:3.8.1:test retains local scope 'test' overriding broader scope 'compile'
	given by a dependency. If this is not intended, modify or remove the local scope.

Downloading: http://repo1.maven.org/maven2/lucene/lucene/1.4.3/lucene-1.4.3.pom
146b downloaded
Downloading: http://repo1.maven.org/maven2/lucene/lucene/1.4.3/lucene-1.4.3.jar
316K downloaded
[INFO] [compiler:compile]
Compiling 24 source files to /home/nobody/continuum-maven/working-directory/7/target/classes
[INFO] [resources:testResources]
[INFO] Using default encoding to copy filtered resources.
[INFO] [compiler:testCompile]
Compiling 6 source files to /home/nobody/continuum-maven/working-directory/7/target/test-classes
[INFO] [surefire:test]
[INFO] Setting reports dir: /home/nobody/continuum-maven/working-directory/7/target/surefire-reports

-------------------------------------------------------
 T E S T S
-------------------------------------------------------
[surefire] Running org.apache.maven.repository.indexing.ArtifactRepositoryIndexingTest
[surefire] Tests run: 5, Failures: 0, Errors: 0, Time elapsed: 0.249 sec
[surefire] Running org.apache.maven.repository.indexing.EclipseRepositoryIndexTest
[surefire] Tests run: 2, Failures: 1, Errors: 0, Time elapsed: 0.114 sec <<<<<<<<
FAILURE !! 
[surefire] Running org.apache.maven.repository.indexing.PomRepositoryIndexingTest
[surefire] Tests run: 4, Failures: 0, Errors: 0, Time elapsed: 0.121 sec
[surefire] Running org.apache.maven.repository.indexing.query.QueryTest
[surefire] Tests run: 2, Failures: 0, Errors: 0, Time elapsed: 0 sec
[surefire] Running org.apache.maven.repository.indexing.RepositoryIndexSearchLayerTest
[surefire] Tests run: 1, Failures: 0, Errors: 0, Time elapsed: 0.713 sec
[surefire] Running org.apache.maven.repository.indexing.MetadataRepositoryIndexingTest
[surefire] Tests run: 3, Failures: 0, Errors: 0, Time elapsed: 0.07 sec

Results :
[surefire] Tests run: 17, Failures: 1, Errors: 0

[INFO] ----------------------------------------------------------------------------
[ERROR] BUILD ERROR
[INFO] ----------------------------------------------------------------------------
[INFO] There are some test failure.
[INFO] ----------------------------------------------------------------------------
[INFO] For more information, run Maven with the -e switch
[INFO] ----------------------------------------------------------------------------
[INFO] Total time: 36 seconds
[INFO] Finished at: Fri Mar 17 00:41:58 PST 2006
[INFO] Final Memory: 20M/158M
[INFO] ----------------------------------------------------------------------------

****************************************************************************



Mime
View raw message