maven-notifications mailing list archives

Site index · List index
Message view « Date » · « Thread »
Top « Date » · « Thread »
From Continuum Build Server <contin...@ci.codehaus.org>
Subject [continuum] BUILD FAILURE: Maven Compiler Plugin
Date Fri, 31 Mar 2006 06:03:30 GMT
Online report : http://ci.codehaus.org/continuum-maven/servlet/continuum/target/ProjectBuild.vm/view/ProjectBuild/id/39/buildId/592
Build statistics:
  State: Failed
  Previous State: Ok
  Started at: Thu, 30 Mar 2006 22:03:23 -0800
  Finished at: Thu, 30 Mar 2006 22:03:29 -0800
  Total time: 6s
  Build Trigger: Schedule
  Exit code: 1
  Building machine hostname: cheddar.simulalabs.com
  Operating system : Linux(unknown)
  Java version : 1.5.0_03(Sun Microsystems Inc.)

Changes
         epunzalan          Updated plugin tests that use the plugin harness with the new
package name
             /maven/plugins/trunk/maven-compiler-plugin/src/test/java/org/apache/maven/plugin/CompilerMojoTest.java
            /maven/plugins/trunk/maven-compiler-plugin/src/test/resources/unit/compiler-basic-test/plugin-config.xml
            /maven/plugins/trunk/maven-compiler-plugin/src/test/resources/unit/compiler-empty-source-test/plugin-config.xml
            /maven/plugins/trunk/maven-compiler-plugin/src/test/resources/unit/compiler-fork-test/plugin-config.xml
            /maven/plugins/trunk/maven-compiler-plugin/src/test/resources/unit/compiler-includes-excludes-test/plugin-config.xml
            /maven/plugins/trunk/maven-idea-plugin/src/test/java/org/apache/maven/plugin/idea/IdeaProjectTest.java
            /maven/plugins/trunk/maven-idea-plugin/src/test/java/org/apache/maven/plugin/idea/stubs/IdeaArtifactStub.java
            /maven/plugins/trunk/maven-idea-plugin/src/test/java/org/apache/maven/plugin/idea/stubs/SimpleMavenProjectStub.java
        
****************************************************************************
Output:
****************************************************************************
[INFO] Scanning for projects...
[INFO] ----------------------------------------------------------------------------
[INFO] Building Maven Compiler Plugin
[INFO]    task-segment: [clean, install]
[INFO] ----------------------------------------------------------------------------
[INFO] [clean:clean]
[INFO] Deleting directory /home/continuum/continuum-maven/working-directory/39/target
[INFO] Deleting directory /home/continuum/continuum-maven/working-directory/39/target/classes
[INFO] Deleting directory /home/continuum/continuum-maven/working-directory/39/target/test-classes
[INFO] [plugin:descriptor]
[INFO] Using 2 extractors.
[INFO] Applying extractor for language: java
[INFO] Extractor for language: java found 2 mojo descriptors.
[INFO] Applying extractor for language: bsh
[INFO] Extractor for language: bsh found 0 mojo descriptors.
[INFO] [resources:resources]
[INFO] Using default encoding to copy filtered resources.
[INFO] [compiler:compile]
Compiling 4 source files to /home/continuum/continuum-maven/working-directory/39/target/classes
[INFO] [resources:testResources]
[INFO] Using default encoding to copy filtered resources.
[INFO] [compiler:testCompile]
Compiling 1 source file to /home/continuum/continuum-maven/working-directory/39/target/test-classes
[INFO] ----------------------------------------------------------------------------
[ERROR] BUILD FAILURE
[INFO] ----------------------------------------------------------------------------
[INFO] Compilation failure

/home/continuum/continuum-maven/working-directory/39/src/test/java/org/apache/maven/plugin/CompilerMojoTest.java:[20,39]
package org.apache.maven.plugin.testing does not exist

/home/continuum/continuum-maven/working-directory/39/src/test/java/org/apache/maven/plugin/CompilerMojoTest.java:[26,12]
cannot find symbol
symbol: class AbstractMojoTestCase
    extends AbstractMojoTestCase

/home/continuum/continuum-maven/working-directory/39/src/test/java/org/apache/maven/plugin/CompilerMojoTest.java:[33,8]
cannot find symbol
symbol  : variable super
location: class org.apache.maven.plugin.CompilerMojoTest

/home/continuum/continuum-maven/working-directory/39/src/test/java/org/apache/maven/plugin/CompilerMojoTest.java:[35,45]
cannot find symbol
symbol  : method getBasedir()
location: class org.apache.maven.plugin.CompilerMojoTest

/home/continuum/continuum-maven/working-directory/39/src/test/java/org/apache/maven/plugin/CompilerMojoTest.java:[47,33]
cannot find symbol
symbol  : method getBasedir()
location: class org.apache.maven.plugin.CompilerMojoTest

/home/continuum/continuum-maven/working-directory/39/src/test/java/org/apache/maven/plugin/CompilerMojoTest.java:[49,43]
cannot find symbol
symbol  : method lookupMojo(java.lang.String,java.io.File)
location: class org.apache.maven.plugin.CompilerMojoTest

/home/continuum/continuum-maven/working-directory/39/src/test/java/org/apache/maven/plugin/CompilerMojoTest.java:[51,8]
cannot find symbol
symbol  : method assertNotNull(org.apache.maven.plugin.CompilerMojo)
location: class org.apache.maven.plugin.CompilerMojoTest

/home/continuum/continuum-maven/working-directory/39/src/test/java/org/apache/maven/plugin/CompilerMojoTest.java:[62,33]
cannot find symbol
symbol  : method getBasedir()
location: class org.apache.maven.plugin.CompilerMojoTest

/home/continuum/continuum-maven/working-directory/39/src/test/java/org/apache/maven/plugin/CompilerMojoTest.java:[64,43]
cannot find symbol
symbol  : method lookupMojo(java.lang.String,java.io.File)
location: class org.apache.maven.plugin.CompilerMojoTest

/home/continuum/continuum-maven/working-directory/39/src/test/java/org/apache/maven/plugin/CompilerMojoTest.java:[66,8]
cannot find symbol
symbol  : method assertNotNull(org.apache.maven.plugin.CompilerMojo)
location: class org.apache.maven.plugin.CompilerMojoTest

/home/continuum/continuum-maven/working-directory/39/src/test/java/org/apache/maven/plugin/CompilerMojoTest.java:[71,22]
cannot find symbol
symbol  : method getBasedir()
location: class org.apache.maven.plugin.CompilerMojoTest

/home/continuum/continuum-maven/working-directory/39/src/test/java/org/apache/maven/plugin/CompilerMojoTest.java:[72,8]
cannot find symbol
symbol  : method assertTrue(boolean)
location: class org.apache.maven.plugin.CompilerMojoTest

/home/continuum/continuum-maven/working-directory/39/src/test/java/org/apache/maven/plugin/CompilerMojoTest.java:[85,22]
cannot find symbol
symbol  : method getBasedir()
location: class org.apache.maven.plugin.CompilerMojoTest

/home/continuum/continuum-maven/working-directory/39/src/test/java/org/apache/maven/plugin/CompilerMojoTest.java:[87,43]
cannot find symbol
symbol  : method lookupMojo(java.lang.String,java.io.File)
location: class org.apache.maven.plugin.CompilerMojoTest

/home/continuum/continuum-maven/working-directory/39/src/test/java/org/apache/maven/plugin/CompilerMojoTest.java:[89,8]
cannot find symbol
symbol  : method assertNotNull(org.apache.maven.plugin.CompilerMojo)
location: class org.apache.maven.plugin.CompilerMojoTest

/home/continuum/continuum-maven/working-directory/39/src/test/java/org/apache/maven/plugin/CompilerMojoTest.java:[94,22]
cannot find symbol
symbol  : method getBasedir()
location: class org.apache.maven.plugin.CompilerMojoTest

/home/continuum/continuum-maven/working-directory/39/src/test/java/org/apache/maven/plugin/CompilerMojoTest.java:[95,8]
cannot find symbol
symbol  : method assertFalse(boolean)
location: class org.apache.maven.plugin.CompilerMojoTest

/home/continuum/continuum-maven/working-directory/39/src/test/java/org/apache/maven/plugin/CompilerMojoTest.java:[108,22]
cannot find symbol
symbol  : method getBasedir()
location: class org.apache.maven.plugin.CompilerMojoTest

/home/continuum/continuum-maven/working-directory/39/src/test/java/org/apache/maven/plugin/CompilerMojoTest.java:[110,43]
cannot find symbol
symbol  : method lookupMojo(java.lang.String,java.io.File)
location: class org.apache.maven.plugin.CompilerMojoTest

/home/continuum/continuum-maven/working-directory/39/src/test/java/org/apache/maven/plugin/CompilerMojoTest.java:[112,8]
cannot find symbol
symbol  : method assertNotNull(org.apache.maven.plugin.CompilerMojo)
location: class org.apache.maven.plugin.CompilerMojoTest

/home/continuum/continuum-maven/working-directory/39/src/test/java/org/apache/maven/plugin/CompilerMojoTest.java:[116,35]
cannot find symbol
symbol  : method getBasedir()
location: class org.apache.maven.plugin.CompilerMojoTest

/home/continuum/continuum-maven/working-directory/39/src/test/java/org/apache/maven/plugin/CompilerMojoTest.java:[118,8]
cannot find symbol
symbol  : method assertTrue(boolean)
location: class org.apache.maven.plugin.CompilerMojoTest

/home/continuum/continuum-maven/working-directory/39/src/test/java/org/apache/maven/plugin/CompilerMojoTest.java:[119,36]
cannot find symbol
symbol  : method getBasedir()
location: class org.apache.maven.plugin.CompilerMojoTest

/home/continuum/continuum-maven/working-directory/39/src/test/java/org/apache/maven/plugin/CompilerMojoTest.java:[121,8]
cannot find symbol
symbol  : method assertFalse(boolean)
location: class org.apache.maven.plugin.CompilerMojoTest

/home/continuum/continuum-maven/working-directory/39/src/test/java/org/apache/maven/plugin/CompilerMojoTest.java:[122,36]
cannot find symbol
symbol  : method getBasedir()
location: class org.apache.maven.plugin.CompilerMojoTest

/home/continuum/continuum-maven/working-directory/39/src/test/java/org/apache/maven/plugin/CompilerMojoTest.java:[124,8]
cannot find symbol
symbol  : method assertFalse(boolean)
location: class org.apache.maven.plugin.CompilerMojoTest

/home/continuum/continuum-maven/working-directory/39/src/test/java/org/apache/maven/plugin/CompilerMojoTest.java:[136,33]
cannot find symbol
symbol  : method getBasedir()
location: class org.apache.maven.plugin.CompilerMojoTest

/home/continuum/continuum-maven/working-directory/39/src/test/java/org/apache/maven/plugin/CompilerMojoTest.java:[138,43]
cannot find symbol
symbol  : method lookupMojo(java.lang.String,java.io.File)
location: class org.apache.maven.plugin.CompilerMojoTest

/home/continuum/continuum-maven/working-directory/39/src/test/java/org/apache/maven/plugin/CompilerMojoTest.java:[140,8]
cannot find symbol
symbol  : method assertNotNull(org.apache.maven.plugin.CompilerMojo)
location: class org.apache.maven.plugin.CompilerMojoTest

/home/continuum/continuum-maven/working-directory/39/src/test/java/org/apache/maven/plugin/CompilerMojoTest.java:[144,52]
cannot find symbol
symbol  : method getBasedir()
location: class org.apache.maven.plugin.CompilerMojoTest

/home/continuum/continuum-maven/working-directory/39/src/test/java/org/apache/maven/plugin/CompilerMojoTest.java:[144,8]
cannot find symbol
symbol  : method assertTrue(boolean)
location: class org.apache.maven.plugin.CompilerMojoTest


[INFO] ----------------------------------------------------------------------------
[INFO] For more information, run Maven with the -e switch
[INFO] ----------------------------------------------------------------------------
[INFO] Total time: 5 seconds
[INFO] Finished at: Thu Mar 30 22:03:29 PST 2006
[INFO] Final Memory: 10M/124M
[INFO] ----------------------------------------------------------------------------

****************************************************************************



Mime
View raw message