maven-notifications mailing list archives

Site index · List index
Message view « Date » · « Thread »
Top « Date » · « Thread »
From Continuum Build Server <contin...@ci.codehaus.org>
Subject [continuum] BUILD FAILURE: Maven SCM Bazaar Provider
Date Fri, 17 Mar 2006 06:17:34 GMT
Online report : http://ci.codehaus.org/continuum-maven/servlet/continuum/target/ProjectBuild.vm/view/ProjectBuild/id/66/buildId/175
Build statistics:
  State: Failed
  Previous State: Failed
  Started at: Thu, 16 Mar 2006 22:17:22 -0800
  Finished at: Thu, 16 Mar 2006 22:17:31 -0800
  Total time: 8s
  Build Trigger: Forced
  Exit code: 1
  Building machine hostname: cheddar.simulalabs.com
  Operating system : Linux(unknown)
  Java version : 1.5.0_03(Sun Microsystems Inc.)

Changes
      No files changed
  
****************************************************************************
Output:
****************************************************************************
[INFO] Scanning for projects...
[INFO] ----------------------------------------------------------------------------
[INFO] Building Maven SCM Bazaar Provider
[INFO]    task-segment: [clean, install]
[INFO] ----------------------------------------------------------------------------
[INFO] [clean:clean]
[INFO] Deleting directory /home/nobody/continuum-maven/working-directory/66/target
[INFO] [resources:resources]
[INFO] Using default encoding to copy filtered resources.
[INFO] [compiler:compile]
Compiling 19 source files to /home/nobody/continuum-maven/working-directory/66/target/classes
[INFO] [resources:testResources]
[INFO] Using default encoding to copy filtered resources.
[INFO] [compiler:testCompile]
Compiling 7 source files to /home/nobody/continuum-maven/working-directory/66/target/test-classes
[INFO] [surefire:test]
[INFO] Setting reports dir: /home/nobody/continuum-maven/working-directory/66/target/surefire-reports

-------------------------------------------------------
 T E S T S
-------------------------------------------------------
Executing: bzr init
Working directory: /home/nobody/continuum-maven/working-directory/66/target/test-branch
Executing: bzr init
Working directory: /home/nobody/continuum-maven/working-directory/66/target/test-branch
[surefire] Running org.apache.maven.scm.provider.bazaar.command.checkin.BazaarCheckInCommandTest
[surefire] Tests run: 2, Failures: 0, Errors: 2, Time elapsed: 0.029 sec <<<<<<<<
FAILURE !! 
Executing: bzr init
Working directory: /home/nobody/continuum-maven/working-directory/66/target/test-branch
[surefire] Running org.apache.maven.scm.provider.bazaar.command.checkout.BazaarCheckOutCommandTest
[surefire] Tests run: 1, Failures: 0, Errors: 1, Time elapsed: 0.029 sec <<<<<<<<
FAILURE !! 
Executing: bzr init
Working directory: /home/nobody/continuum-maven/working-directory/66/target/test-branch
[surefire] Running org.apache.maven.scm.provider.bazaar.command.status.BazaarStatusCommandTest
[surefire] Tests run: 1, Failures: 0, Errors: 1, Time elapsed: 0.028 sec <<<<<<<<
FAILURE !! 
Executing: bzr init
Working directory: /home/nobody/continuum-maven/working-directory/66/target/test-branch
[surefire] Running org.apache.maven.scm.provider.bazaar.command.diff.BazaarDiffCommandTest
[surefire] Tests run: 1, Failures: 0, Errors: 1, Time elapsed: 0.027 sec <<<<<<<<
FAILURE !! 
Executing: bzr init
Working directory: /home/nobody/continuum-maven/working-directory/66/target/test-branch
[surefire] Running org.apache.maven.scm.provider.bazaar.command.update.BazaarUpdateCommandTest
[surefire] Tests run: 1, Failures: 0, Errors: 1, Time elapsed: 0.032 sec <<<<<<<<
FAILURE !! 
Executing: bzr init
Working directory: /home/nobody/continuum-maven/working-directory/66/target/test-branch
[surefire] Running org.apache.maven.scm.provider.bazaar.command.changelog.BazaarChangeLogCommandTckTest
[surefire] Tests run: 1, Failures: 0, Errors: 1, Time elapsed: 0.029 sec <<<<<<<<
FAILURE !! 

Results :
[surefire] Tests run: 7, Failures: 0, Errors: 7

[INFO] ----------------------------------------------------------------------------
[ERROR] BUILD ERROR
[INFO] ----------------------------------------------------------------------------
[INFO] There are some test failure.
[INFO] ----------------------------------------------------------------------------
[INFO] For more information, run Maven with the -e switch
[INFO] ----------------------------------------------------------------------------
[INFO] Total time: 5 seconds
[INFO] Finished at: Thu Mar 16 22:17:30 PST 2006
[INFO] Final Memory: 8M/142M
[INFO] ----------------------------------------------------------------------------

****************************************************************************



Mime
View raw message