maven-notifications mailing list archives

Site index · List index
Message view « Date » · « Thread »
Top « Date » · « Thread »
From Continuum Build Server <contin...@ci.codehaus.org>
Subject [continuum] BUILD FAILURE: Maven Release plugin
Date Thu, 30 Mar 2006 08:07:53 GMT
Online report : http://ci.codehaus.org/continuum-maven/servlet/continuum/target/ProjectBuild.vm/view/ProjectBuild/id/54/buildId/555
Build statistics:
  State: Failed
  Previous State: Ok
  Started at: Thu, 30 Mar 2006 00:04:20 -0800
  Finished at: Thu, 30 Mar 2006 00:07:53 -0800
  Total time: 3m 32s
  Build Trigger: Schedule
  Exit code: 1
  Building machine hostname: cheddar.simulalabs.com
  Operating system : Linux(unknown)
  Java version : 1.5.0_03(Sun Microsystems Inc.)

Changes
         carlos          Add methods to set the scm manager and helper
             /maven/plugins/trunk/maven-release-plugin/src/main/java/org/apache/maven/plugins/release/AbstractReleaseMojo.java
           carlos          Add tests for PrepareReleaseMojo.writePom
             /maven/plugins/trunk/maven-release-plugin/src/main/java/org/apache/maven/plugins/release/PrepareReleaseMojo.java
           carlos          Add tests for PrepareReleaseMojo.writePom
             /maven/plugins/trunk/maven-release-plugin/pom.xml
            /maven/plugins/trunk/maven-release-plugin/src/test/java/org/apache/maven/plugins/release/PrepareReleaseMojoTest.java
        
****************************************************************************
Output:
****************************************************************************
[INFO] Scanning for projects...
[INFO] ----------------------------------------------------------------------------
[INFO] Building Maven Release plugin
[INFO]    task-segment: [clean, install]
[INFO] ----------------------------------------------------------------------------
[INFO] [clean:clean]
[INFO] Deleting directory /home/continuum/continuum-maven/working-directory/54/target
[INFO] Deleting directory /home/continuum/continuum-maven/working-directory/54/target/classes
[INFO] Deleting directory /home/continuum/continuum-maven/working-directory/54/target/test-classes
[INFO] snapshot org.apache.maven:maven-plugin-tools-api:2.0.3-SNAPSHOT: checking for updates
from snapshots
[INFO] snapshot org.apache.maven:maven-plugin-tools-api:2.0.3-SNAPSHOT: checking for updates
from apache.snapshots
[INFO] snapshot org.apache.maven:maven-plugin-tools:2.0.3-SNAPSHOT: checking for updates from
snapshots
[INFO] snapshot org.apache.maven:maven-plugin-tools:2.0.3-SNAPSHOT: checking for updates from
apache.snapshots
[INFO] snapshot org.apache.maven:maven:2.0.3-SNAPSHOT: checking for updates from snapshots
[INFO] snapshot org.apache.maven:maven:2.0.3-SNAPSHOT: checking for updates from apache.snapshots
[INFO] snapshot org.apache.maven:maven-plugin-descriptor:2.0.3-SNAPSHOT: checking for updates
from snapshots
[INFO] snapshot org.apache.maven:maven-plugin-descriptor:2.0.3-SNAPSHOT: checking for updates
from apache.snapshots
[INFO] snapshot org.apache.maven:maven-plugin-api:2.0.3-SNAPSHOT: checking for updates from
snapshots
[INFO] snapshot org.apache.maven:maven-plugin-api:2.0.3-SNAPSHOT: checking for updates from
apache.snapshots
[INFO] snapshot org.apache.maven:maven-artifact:2.0.3-SNAPSHOT: checking for updates from
snapshots
[INFO] snapshot org.apache.maven:maven-artifact:2.0.3-SNAPSHOT: checking for updates from
apache.snapshots
[INFO] snapshot org.apache.maven:maven-project:2.0.3-SNAPSHOT: checking for updates from snapshots
[INFO] snapshot org.apache.maven:maven-project:2.0.3-SNAPSHOT: checking for updates from apache.snapshots
[INFO] snapshot org.apache.maven:maven-profile:2.0.3-SNAPSHOT: checking for updates from snapshots
[INFO] snapshot org.apache.maven:maven-profile:2.0.3-SNAPSHOT: checking for updates from apache.snapshots
[INFO] snapshot org.apache.maven:maven-model:2.0.3-SNAPSHOT: checking for updates from snapshots
[INFO] snapshot org.apache.maven:maven-model:2.0.3-SNAPSHOT: checking for updates from apache.snapshots
[INFO] snapshot org.apache.maven:maven-artifact-manager:2.0.3-SNAPSHOT: checking for updates
from snapshots
[INFO] snapshot org.apache.maven:maven-artifact-manager:2.0.3-SNAPSHOT: checking for updates
from apache.snapshots
[INFO] snapshot org.apache.maven:maven-repository-metadata:2.0.3-SNAPSHOT: checking for updates
from snapshots
[INFO] snapshot org.apache.maven:maven-repository-metadata:2.0.3-SNAPSHOT: checking for updates
from apache.snapshots
[INFO] snapshot org.apache.maven:maven-settings:2.0.3-SNAPSHOT: checking for updates from
snapshots
[INFO] snapshot org.apache.maven:maven-settings:2.0.3-SNAPSHOT: checking for updates from
apache.snapshots
[INFO] snapshot org.apache.maven:maven-plugin-tools-java:2.0.3-SNAPSHOT: checking for updates
from snapshots
[INFO] snapshot org.apache.maven:maven-plugin-tools-java:2.0.3-SNAPSHOT: checking for updates
from apache.snapshots
[INFO] snapshot org.apache.maven:maven-plugin-tools-beanshell:2.0.3-SNAPSHOT: checking for
updates from snapshots
[INFO] snapshot org.apache.maven:maven-plugin-tools-beanshell:2.0.3-SNAPSHOT: checking for
updates from apache.snapshots
[INFO] [plugin:descriptor]
[INFO] Using 2 extractors.
[INFO] Applying extractor for language: java
[INFO] Extractor for language: java found 2 mojo descriptors.
[INFO] Applying extractor for language: bsh
[INFO] Extractor for language: bsh found 0 mojo descriptors.
[INFO] [resources:resources]
[INFO] Using default encoding to copy filtered resources.
[INFO] snapshot org.apache.maven.scm:maven-scm-provider-starteam:1.0-beta-3-SNAPSHOT: checking
for updates from snapshots
[INFO] snapshot org.apache.maven.scm:maven-scm-provider-starteam:1.0-beta-3-SNAPSHOT: checking
for updates from apache.snapshots
[INFO] snapshot org.apache.maven.scm:maven-scm-providers:1.0-beta-3-SNAPSHOT: checking for
updates from snapshots
[INFO] snapshot org.apache.maven.scm:maven-scm-providers:1.0-beta-3-SNAPSHOT: checking for
updates from apache.snapshots
[INFO] snapshot org.apache.maven.scm:maven-scm:1.0-beta-3-SNAPSHOT: checking for updates from
snapshots
[INFO] snapshot org.apache.maven.scm:maven-scm:1.0-beta-3-SNAPSHOT: checking for updates from
apache.snapshots
[INFO] snapshot org.apache.maven.scm:maven-scm-api:1.0-beta-3-SNAPSHOT: checking for updates
from snapshots
[INFO] snapshot org.apache.maven.scm:maven-scm-api:1.0-beta-3-SNAPSHOT: checking for updates
from apache.snapshots
[INFO] snapshot org.apache.maven.scm:maven-scm-provider-svnexe:1.0-beta-3-SNAPSHOT: checking
for updates from snapshots
[INFO] snapshot org.apache.maven.scm:maven-scm-provider-svnexe:1.0-beta-3-SNAPSHOT: checking
for updates from apache.snapshots
[INFO] snapshot org.apache.maven.scm:maven-scm-providers-svn:1.0-beta-3-SNAPSHOT: checking
for updates from snapshots
[INFO] snapshot org.apache.maven.scm:maven-scm-providers-svn:1.0-beta-3-SNAPSHOT: checking
for updates from apache.snapshots
[INFO] snapshot org.apache.maven.scm:maven-scm-provider-svn-commons:1.0-beta-3-SNAPSHOT: checking
for updates from snapshots
[INFO] snapshot org.apache.maven.scm:maven-scm-provider-svn-commons:1.0-beta-3-SNAPSHOT: checking
for updates from apache.snapshots
[INFO] snapshot org.apache.maven.scm:maven-scm-test:1.0-beta-3-SNAPSHOT: checking for updates
from snapshots
[INFO] snapshot org.apache.maven.scm:maven-scm-test:1.0-beta-3-SNAPSHOT: checking for updates
from apache.snapshots
[INFO] snapshot org.apache.maven.scm:maven-scm-manager-plexus:1.0-beta-3-SNAPSHOT: checking
for updates from snapshots
[INFO] snapshot org.apache.maven.scm:maven-scm-manager-plexus:1.0-beta-3-SNAPSHOT: checking
for updates from apache.snapshots
[INFO] snapshot org.apache.maven.scm:maven-scm-managers:1.0-beta-3-SNAPSHOT: checking for
updates from snapshots
[INFO] snapshot org.apache.maven.scm:maven-scm-managers:1.0-beta-3-SNAPSHOT: checking for
updates from apache.snapshots
[INFO] snapshot org.apache.maven.scm:maven-scm-provider-clearcase:1.0-beta-3-SNAPSHOT: checking
for updates from snapshots
[INFO] snapshot org.apache.maven.scm:maven-scm-provider-clearcase:1.0-beta-3-SNAPSHOT: checking
for updates from apache.snapshots
Downloading: http://repo1.maven.org/maven2/jmock/jmock-cglib/1.0.1/jmock-cglib-1.0.1.pom
456b downloaded
Downloading: http://repo1.maven.org/maven2/cglib/cglib-full/2.0/cglib-full-2.0.pom
147b downloaded
[INFO] snapshot org.apache.maven.scm:maven-scm-provider-cvsexe:1.0-beta-3-SNAPSHOT: checking
for updates from snapshots
[INFO] snapshot org.apache.maven.scm:maven-scm-provider-cvsexe:1.0-beta-3-SNAPSHOT: checking
for updates from apache.snapshots
[INFO] snapshot org.apache.maven.scm:maven-scm-providers-cvs:1.0-beta-3-SNAPSHOT: checking
for updates from snapshots
[INFO] snapshot org.apache.maven.scm:maven-scm-providers-cvs:1.0-beta-3-SNAPSHOT: checking
for updates from apache.snapshots
[INFO] snapshot org.apache.maven.scm:maven-scm-provider-cvs-commons:1.0-beta-3-SNAPSHOT: checking
for updates from snapshots
[INFO] snapshot org.apache.maven.scm:maven-scm-provider-cvs-commons:1.0-beta-3-SNAPSHOT: checking
for updates from apache.snapshots
[WARNING] repository metadata for: 'snapshot org.apache.maven.scm:maven-scm-provider-cvs-commons:1.0-beta-3-SNAPSHOT'
could not be retrieved from repository: apache.snapshots due to an error: Error transferring
file
[INFO] Repository 'apache.snapshots' will be blacklisted
[INFO] snapshot org.apache.maven.scm:maven-scm-provider-perforce:1.0-beta-3-SNAPSHOT: checking
for updates from snapshots
[INFO] snapshot org.apache.maven.scm:maven-scm-provider-bazaar:1.0-beta-3-SNAPSHOT: checking
for updates from snapshots
[INFO] [compiler:compile]
Compiling 10 source files to /home/continuum/continuum-maven/working-directory/54/target/classes
[INFO] [resources:testResources]
[INFO] Using default encoding to copy filtered resources.
Downloading: http://repo1.maven.org/maven2/cglib/cglib-full/2.0/cglib-full-2.0.jar
280K downloaded
Downloading: http://repo1.maven.org/maven2/jmock/jmock-cglib/1.0.1/jmock-cglib-1.0.1.jar
2K downloaded
[INFO] [compiler:testCompile]
Compiling 2 source files to /home/continuum/continuum-maven/working-directory/54/target/test-classes
[INFO] ----------------------------------------------------------------------------
[ERROR] BUILD FAILURE
[INFO] ----------------------------------------------------------------------------
[INFO] Compilation failure

/home/continuum/continuum-maven/working-directory/54/src/test/java/org/apache/maven/plugins/release/PrepareReleaseMojoTest.java:[30,36]
cannot find symbol
symbol  : class ScmManagerStub
location: package org.apache.maven.scm.manager

/home/continuum/continuum-maven/working-directory/54/src/test/java/org/apache/maven/plugins/release/PrepareReleaseMojoTest.java:[62,25]
cannot find symbol
symbol  : class ScmManagerStub
location: class org.apache.maven.plugins.release.PrepareReleaseMojoTest


[INFO] ----------------------------------------------------------------------------
[INFO] For more information, run Maven with the -e switch
[INFO] ----------------------------------------------------------------------------
[INFO] Total time: 3 minutes 31 seconds
[INFO] Finished at: Thu Mar 30 00:07:52 PST 2006
[INFO] Final Memory: 12M/156M
[INFO] ----------------------------------------------------------------------------

****************************************************************************



Mime
View raw message