maven-notifications mailing list archives

Site index · List index
Message view « Date » · « Thread »
Top « Date » · « Thread »
From Continuum Build Server <contin...@ci.codehaus.org>
Subject [continuum] BUILD FAILURE: Maven SCM Starteam Provider
Date Fri, 17 Mar 2006 06:16:29 GMT
Online report : http://ci.codehaus.org/continuum-maven/servlet/continuum/target/ProjectBuild.vm/view/ProjectBuild/id/70/buildId/172
Build statistics:
  State: Failed
  Previous State: Failed
  Started at: Thu, 16 Mar 2006 22:16:17 -0800
  Finished at: Thu, 16 Mar 2006 22:16:26 -0800
  Total time: 9s
  Build Trigger: Forced
  Exit code: 1
  Building machine hostname: cheddar.simulalabs.com
  Operating system : Linux(unknown)
  Java version : 1.5.0_03(Sun Microsystems Inc.)

Changes
      No files changed
  
****************************************************************************
Output:
****************************************************************************
[INFO] Scanning for projects...
[INFO] ----------------------------------------------------------------------------
[INFO] Building Maven SCM Starteam Provider
[INFO]    task-segment: [clean, install]
[INFO] ----------------------------------------------------------------------------
[INFO] [clean:clean]
[INFO] Deleting directory /home/nobody/continuum-maven/working-directory/70/target
[INFO] [resources:resources]
[INFO] Using default encoding to copy filtered resources.
[INFO] [compiler:compile]
Compiling 25 source files to /home/nobody/continuum-maven/working-directory/70/target/classes
[INFO] [resources:testResources]
[INFO] Using default encoding to copy filtered resources.
[INFO] [compiler:testCompile]
Compiling 22 source files to /home/nobody/continuum-maven/working-directory/70/target/test-classes
[INFO] [surefire:test]
[INFO] Setting reports dir: /home/nobody/continuum-maven/working-directory/70/target/surefire-reports

-------------------------------------------------------
 T E S T S
-------------------------------------------------------
[surefire] Running org.apache.maven.scm.provider.starteam.StarteamScmProviderTest
[surefire] Tests run: 2, Failures: 0, Errors: 0, Time elapsed: 0.026 sec
[WARNING] Your scm URL use a deprecated format. The new format is :[username[:password]@]hostname:port:/projectName/[viewName/][folderHiearchy/]
[WARNING] Your scm URL use a deprecated format. The new format is :[username[:password]@]hostname:port:/projectName/[viewName/][folderHiearchy/]
[WARNING] Your scm URL use a deprecated format. The new format is :[username[:password]@]hostname:port:/projectName/[viewName/][folderHiearchy/]
[surefire] Running org.apache.maven.scm.provider.starteam.repository.StarteamScmProviderRepositoryTest
[surefire] Tests run: 7, Failures: 0, Errors: 0, Time elapsed: 0.023 sec
Checked in: ./maven.xml
Checked in: ./target/checkout/maven.xml
Skipped: ./target/checkout/project.properties
Checked in: ./target/checkout/project.xml
Unknown checkin ouput: maven.xml:skipped
Skipped: ./target/checkout/dev/project.properties
Checked in: ./target/checkout/dev/project.xml
[surefire] Running org.apache.maven.scm.provider.starteam.command.checkin.StarteamCheckInConsumerTest
[surefire] Tests run: 1, Failures: 0, Errors: 0, Time elapsed: 0.029 sec
[WARNING] Your scm URL use a deprecated format. The new format is :[username[:password]@]hostname:port:/projectName/[viewName/][folderHiearchy/]
[WARNING] Your scm URL use a deprecated format. The new format is :[username[:password]@]hostname:port:/projectName/[viewName/][folderHiearchy/]
[WARNING] Your scm URL use a deprecated format. The new format is :[username[:password]@]hostname:port:/projectName/[viewName/][folderHiearchy/]
[surefire] Running org.apache.maven.scm.provider.starteam.command.checkin.StarteamCheckInCommandTest
[surefire] Tests run: 3, Failures: 0, Errors: 0, Time elapsed: 0.023 sec
Checked out: ./target/checkout/maven.xml
Checked out: ./target/checkout/project.properties
Checked out: ./target/checkout/project.xml
Checked out: ./target/checkout/dev/maven.xml
Checked out: ./target/checkout/dev/project.properties
Checked out: ./target/checkout/dev/project.xml
Checked out: ./maven.xml
Checked out: ./project.properties
Checked out: ./project.xml
Checked out: ./target/checkout/maven.xml
Checked out: ./target/checkout/project.properties
Checked out: ./target/checkout/project.xml
Checked out: ./target/checkout/dev/maven.xml
Checked out: ./target/checkout/dev/project.properties
Checked out: ./target/checkout/dev/project.xml
Checked out: ./maven.xml
Checked out: ./project.properties
Checked out: ./project.xml
[surefire] Running org.apache.maven.scm.provider.starteam.command.checkout.StarteamCheckOutConsumerTest
[surefire] Tests run: 2, Failures: 0, Errors: 0, Time elapsed: 0.024 sec
[WARNING] Your scm URL use a deprecated format. The new format is :[username[:password]@]hostname:port:/projectName/[viewName/][folderHiearchy/]
[WARNING] Your scm URL use a deprecated format. The new format is :[username[:password]@]hostname:port:/projectName/[viewName/][folderHiearchy/]
[surefire] Running org.apache.maven.scm.provider.starteam.command.checkout.StarteamCheckOutCommandTest
[surefire] Tests run: 2, Failures: 0, Errors: 0, Time elapsed: 0.023 sec
[WARNING] Your scm URL use a deprecated format. The new format is :[username[:password]@]hostname:port:/projectName/[viewName/][folderHiearchy/]
[surefire] Running org.apache.maven.scm.provider.starteam.command.tag.StarteamTagCommandTest
[surefire] Tests run: 1, Failures: 0, Errors: 0, Time elapsed: 0.023 sec
Out of Date file: ./maven.xml
Conflict file: ./project.properties
Missing file: ./bootstrap/xdocs/index.xml
Modified file: ./dev/project.properties
[surefire] Running org.apache.maven.scm.provider.starteam.command.status.StarteamStatusConsumerTest
[surefire] Tests run: 1, Failures: 0, Errors: 0, Time elapsed: 0.06 sec
[WARNING] Your scm URL use a deprecated format. The new format is :[username[:password]@]hostname:port:/projectName/[viewName/][folderHiearchy/]
[surefire] Running org.apache.maven.scm.provider.starteam.command.status.StarteamStatusCommandTest
[surefire] Tests run: 1, Failures: 0, Errors: 0, Time elapsed: 0.023 sec
[surefire] Running org.apache.maven.scm.provider.starteam.command.diff.StarteamDiffConsumerTest
[surefire] Tests run: 1, Failures: 0, Errors: 0, Time elapsed: 0.023 sec
[WARNING] Your scm URL use a deprecated format. The new format is :[username[:password]@]hostname:port:/projectName/[viewName/][folderHiearchy/]
[WARNING] Your scm URL use a deprecated format. The new format is :[username[:password]@]hostname:port:/projectName/[viewName/][folderHiearchy/]
[surefire] Running org.apache.maven.scm.provider.starteam.command.diff.StarteamDiffCommandTest
[surefire] Tests run: 2, Failures: 0, Errors: 0, Time elapsed: 0.022 sec
[WARNING] Your scm URL use a deprecated format. The new format is :[username[:password]@]hostname:port:/projectName/[viewName/][folderHiearchy/]
[WARNING] Your scm URL use a deprecated format. The new format is :[username[:password]@]hostname:port:/projectName/[viewName/][folderHiearchy/]
[surefire] Running org.apache.maven.scm.provider.starteam.command.remove.StarteamRemoveCommandTest
[surefire] Tests run: 2, Failures: 0, Errors: 0, Time elapsed: 0.023 sec
Removed: ./maven.xml
Removed: ./target/checkout/maven.xml
Removed: ./target/checkout/project.properties
Removed: ./target/checkout/project.xml
Removed: ./target/checkout/bootstrap/maven.xml
Removed: ./target/checkout/bootstrap/project.properties
Removed: ./target/checkout/bootstrap/project.xml
[surefire] Running org.apache.maven.scm.provider.starteam.command.remove.StarteamRemoveConsumerTest
[surefire] Tests run: 1, Failures: 0, Errors: 0, Time elapsed: 0.024 sec
[WARNING] Your scm URL use a deprecated format. The new format is :[username[:password]@]hostname:port:/projectName/[viewName/][folderHiearchy/]
stcmd co -x -nologo -stop -p myusername:mypassword@myhost:1234/projecturl -fp /home/nobody/continuum-maven/working-directory/70/target
-merge -neverprompt -vl myTag -is
stcmd co -x -nologo -stop -p myusername:mypassword@myhost:1234/projecturl -fp /home/nobody/continuum-maven/working-directory/70/target
-merge -neverprompt -vl myTag -is
testGetCommandLineWithFileOnRoot
[WARNING] Your scm URL use a deprecated format. The new format is :[username[:password]@]hostname:port:/projectName/[viewName/][folderHiearchy/]
stcmd co -x -nologo -stop -p myusername:mypassword@myhost:1234/projecturl -fp /home/nobody/continuum-maven/working-directory/70
-merge -neverprompt -vl myTag testfile
stcmd co -x -nologo -stop -p myusername:mypassword@myhost:1234/projecturl -fp /home/nobody/continuum-maven/working-directory/70
-merge -neverprompt -vl myTag testfile
[WARNING] Your scm URL use a deprecated format. The new format is :[username[:password]@]hostname:port:/projectName/[viewName/][folderHiearchy/]
stcmd co -x -nologo -stop -p myusername:mypassword@myhost:1234/projecturl/src/test/java/org/apache/maven/scm/provider/starteam/repository
-fp /home/nobody/continuum-maven/working-directory/70/src/test/java/org/apache/maven/scm/provider/starteam/repository
-merge -neverprompt -vl myTag StarteamScmProviderRepositoryTest.java
stcmd co -x -nologo -stop -p myusername:mypassword@myhost:1234/projecturl/src/test/java/org/apache/maven/scm/provider/starteam/repository
-fp /home/nobody/continuum-maven/working-directory/70/src/test/java/org/apache/maven/scm/provider/starteam/repository
-merge -neverprompt -vl myTag StarteamScmProviderRepositoryTest.java
[surefire] Running org.apache.maven.scm.provider.starteam.command.update.StarteamUpdateCommandTest
[surefire] Tests run: 3, Failures: 0, Errors: 0, Time elapsed: 0.21 sec
[WARNING] Your scm URL use a deprecated format. The new format is :[username[:password]@]hostname:port:/projectName/[viewName/][folderHiearchy/]
[WARNING] Your scm URL use a deprecated format. The new format is :[username[:password]@]hostname:port:/projectName/[viewName/][folderHiearchy/]
[WARNING] Your scm URL use a deprecated format. The new format is :[username[:password]@]hostname:port:/projectName/[viewName/][folderHiearchy/]
[surefire] Running org.apache.maven.scm.provider.starteam.command.add.StarteamAddCommandTest
[surefire] Tests run: 3, Failures: 0, Errors: 0, Time elapsed: 0.023 sec
Added: ./maven.xml
Added: ./target/checkout/maven.xml
Added: ./target/checkout/project.properties
Added: ./target/checkout/project.xml
Added: ./target/checkout/bootstrap/maven.xml
Added: ./target/checkout/bootstrap/project.properties
Added: ./target/checkout/bootstrap/project.xml
[surefire] Running org.apache.maven.scm.provider.starteam.command.add.StarteamAddConsumerTest
[surefire] Tests run: 1, Failures: 0, Errors: 0, Time elapsed: 0.026 sec
[WARNING] Your scm URL use a deprecated format. The new format is :[username[:password]@]hostname:port:/projectName/[viewName/][folderHiearchy/]
[WARNING] Your scm URL use a deprecated format. The new format is :[username[:password]@]hostname:port:/projectName/[viewName/][folderHiearchy/]
[surefire] Running org.apache.maven.scm.provider.starteam.command.edit.StarteamEditCommandTest
[surefire] Tests run: 2, Failures: 0, Errors: 0, Time elapsed: 0.023 sec
Locked: ./maven.xml
Locked: ./target/checkout/maven.xml
Locked: ./target/checkout/project.properties
Locked: ./target/checkout/project.xml
Locked: ./target/checkout/bootstrap/maven.xml
Locked: ./target/checkout/bootstrap/project.properties
Locked: ./target/checkout/bootstrap/project.xml
[surefire] Running org.apache.maven.scm.provider.starteam.command.edit.StarteamEditConsumerTest
[surefire] Tests run: 1, Failures: 0, Errors: 0, Time elapsed: 0.025 sec
[WARNING] Your scm URL use a deprecated format. The new format is :[username[:password]@]hostname:port:/projectName/[viewName/][folderHiearchy/]
[WARNING] Your scm URL use a deprecated format. The new format is :[username[:password]@]hostname:port:/projectName/[viewName/][folderHiearchy/]
[surefire] Running org.apache.maven.scm.provider.starteam.command.changelog.StarteamChangeLogCommandTest
[surefire] Tests run: 2, Failures: 0, Errors: 0, Time elapsed: 0.025 sec
[surefire] Running org.apache.maven.scm.provider.starteam.command.changelog.StarteamChangeLogConsumerTest
[surefire] Tests run: 2, Failures: 1, Errors: 0, Time elapsed: 0.029 sec <<<<<<<<
FAILURE !! 
Unlocked: ./maven.xml
Unlocked: ./target/checkout/maven.xml
Unlocked: ./target/checkout/project.properties
Unlocked: ./target/checkout/project.xml
Unlocked: ./target/checkout/bootstrap/maven.xml
Unlocked: ./target/checkout/bootstrap/project.properties
Unlocked: ./target/checkout/bootstrap/project.xml
[surefire] Running org.apache.maven.scm.provider.starteam.command.unedit.StarteamUnEditConsumerTest
[surefire] Tests run: 1, Failures: 0, Errors: 0, Time elapsed: 0.026 sec
[WARNING] Your scm URL use a deprecated format. The new format is :[username[:password]@]hostname:port:/projectName/[viewName/][folderHiearchy/]
[WARNING] Your scm URL use a deprecated format. The new format is :[username[:password]@]hostname:port:/projectName/[viewName/][folderHiearchy/]
[surefire] Running org.apache.maven.scm.provider.starteam.command.unedit.StarteamUnEditCommandTest
[surefire] Tests run: 2, Failures: 0, Errors: 0, Time elapsed: 0.022 sec

Results :
[surefire] Tests run: 43, Failures: 1, Errors: 0

[INFO] ----------------------------------------------------------------------------
[ERROR] BUILD ERROR
[INFO] ----------------------------------------------------------------------------
[INFO] There are some test failure.
[INFO] ----------------------------------------------------------------------------
[INFO] For more information, run Maven with the -e switch
[INFO] ----------------------------------------------------------------------------
[INFO] Total time: 7 seconds
[INFO] Finished at: Thu Mar 16 22:16:26 PST 2006
[INFO] Final Memory: 8M/141M
[INFO] ----------------------------------------------------------------------------

****************************************************************************



Mime
View raw message