maven-notifications mailing list archives

Site index · List index
Message view « Date » · « Thread »
Top « Date » · « Thread »
From Continuum Build Server <contin...@ci.codehaus.org>
Subject [continuum] BUILD FAILURE: Maven SCM Bazaar Provider
Date Tue, 28 Mar 2006 13:05:42 GMT
Online report : http://ci.codehaus.org/continuum-maven/servlet/continuum/target/ProjectBuild.vm/view/ProjectBuild/id/80/buildId/490
Build statistics:
  State: Failed
  Previous State: Failed
  Started at: Tue, 28 Mar 2006 05:05:12 -0800
  Finished at: Tue, 28 Mar 2006 05:05:42 -0800
  Total time: 29s
  Build Trigger: Schedule
  Exit code: 1
  Building machine hostname: cheddar.simulalabs.com
  Operating system : Linux(unknown)
  Java version : 1.5.0_03(Sun Microsystems Inc.)

Changes
         evenisse          Formatting
             /maven/scm/trunk/maven-scm-api/src/main/java/org/apache/maven/scm/command/add/AddScmResult.java
            /maven/scm/trunk/maven-scm-plugin/src/main/java/org/apache/maven/scm/plugin/AbstractScmMojo.java
            /maven/scm/trunk/maven-scm-providers/maven-scm-provider-bazaar/src/main/java/org/apache/maven/scm/provider/bazaar/BazaarConfig.java
            /maven/scm/trunk/maven-scm-providers/maven-scm-provider-bazaar/src/main/java/org/apache/maven/scm/provider/bazaar/BazaarUtils.java
            /maven/scm/trunk/maven-scm-providers/maven-scm-provider-bazaar/src/main/java/org/apache/maven/scm/provider/bazaar/command/changelog/BazaarChangeLogCommand.java
            /maven/scm/trunk/maven-scm-providers/maven-scm-provider-bazaar/src/main/java/org/apache/maven/scm/provider/bazaar/command/changelog/BazaarChangeLogConsumer.java
            /maven/scm/trunk/maven-scm-providers/maven-scm-provider-bazaar/src/main/java/org/apache/maven/scm/provider/bazaar/command/diff/BazaarDiffConsumer.java
            /maven/scm/trunk/maven-scm-providers/maven-scm-provider-bazaar/src/test/java/org/apache/maven/scm/provider/bazaar/BazaarTestUtils.java
            /maven/scm/trunk/maven-scm-providers/maven-scm-provider-bazaar/src/test/java/org/apache/maven/scm/provider/bazaar/command/changelog/BazaarChangeLogConsumerTest.java
            /maven/scm/trunk/maven-scm-providers/maven-scm-provider-clearcase/src/test/java/org/apache/maven/scm/provider/clearcase/command/checkout/ClearCaseCheckOutCommandTest.java
            /maven/scm/trunk/maven-scm-providers/maven-scm-provider-starteam/src/main/java/org/apache/maven/scm/provider/starteam/command/changelog/StarteamChangeLogConsumer.java
            /maven/scm/trunk/maven-scm-providers/maven-scm-provider-starteam/src/test/java/org/apache/maven/scm/provider/starteam/command/changelog/StarteamChangeLogConsumerTest.java
            /maven/scm/trunk/maven-scm-providers/maven-scm-providers-cvs/maven-scm-provider-cvs-commons/src/main/java/org/apache/maven/scm/provider/cvslib/AbstractCvsScmProvider.java
            /maven/scm/trunk/maven-scm-providers/maven-scm-providers-cvs/maven-scm-provider-cvs-commons/src/main/java/org/apache/maven/scm/provider/cvslib/repository/CvsScmProviderRepository.java
            /maven/scm/trunk/maven-scm-providers/maven-scm-providers-cvs/maven-scm-provider-cvs-commons/src/test/java/org/apache/maven/scm/provider/cvslib/repository/CvsScmProviderRepositoryTest.java
            /maven/scm/trunk/maven-scm-providers/maven-scm-providers-svn/maven-scm-provider-svnexe/src/test/java/org/apache/maven/scm/provider/svn/svnexe/command/SvnCommandLineUtilsTest.java
        
****************************************************************************
Output:
****************************************************************************
[INFO] Scanning for projects...
[INFO] ----------------------------------------------------------------------------
[INFO] Building Maven SCM Bazaar Provider
[INFO]    task-segment: [clean, install]
[INFO] ----------------------------------------------------------------------------
[INFO] [clean:clean]
[INFO] Deleting directory /home/continuum/continuum-maven/working-directory/80/target
[INFO] Deleting directory /home/continuum/continuum-maven/working-directory/80/target/classes
[INFO] Deleting directory /home/continuum/continuum-maven/working-directory/80/target/test-classes
[INFO] [resources:resources]
[INFO] Using default encoding to copy filtered resources.
[INFO] [compiler:compile]
Compiling 20 source files to /home/continuum/continuum-maven/working-directory/80/target/classes
[INFO] [resources:testResources]
[INFO] Using default encoding to copy filtered resources.
[INFO] [compiler:testCompile]
Compiling 8 source files to /home/continuum/continuum-maven/working-directory/80/target/test-classes
[INFO] [surefire:test]
[INFO] Setting reports dir: /home/continuum/continuum-maven/working-directory/80/target/surefire-reports

-------------------------------------------------------
 T E S T S
-------------------------------------------------------
[surefire] Running org.apache.maven.scm.provider.bazaar.command.checkin.BazaarCheckInCommandTest
EXECUTING: bzr init
EXECUTING: bzr add /home/continuum/continuum-maven/working-directory/80/target/test-branch/pom.xml
/home/continuum/continuum-maven/working-directory/80/target/test-branch/readme.txt /home/continuum/continuum-maven/working-directory/80/target/test-branch/src/main/java/Application.java
/home/continuum/continuum-maven/working-directory/80/target/test-branch/src/test/java/Test.java
EXECUTING: bzr commit --message "Add files to test branch"
[INFO] Removing /home/continuum/continuum-maven/working-directory/80/target/scm-test/working-copy
[INFO] EXECUTING: bzr branch /home/continuum/continuum-maven/working-directory/80/target/test-branch
/home/continuum/continuum-maven/working-directory/80/target/scm-test/working-copy
[INFO] EXECUTING: bzr inventory
[INFO] EXECUTING: bzr add --no-recurse src/main/java/Foo.java
[INFO] [src/main/java/Foo.java:added]
[INFO] EXECUTING: bzr status
[INFO] [src/main/java/Foo.java:added]
[INFO] [readme.txt:modified]
[INFO] [src/main/java/Bar.java:unknown]
[INFO] EXECUTING: bzr commit --message "Commit message"
[INFO] EXECUTING: bzr push /home/continuum/continuum-maven/working-directory/80/target/test-branch
[INFO] Removing /home/continuum/continuum-maven/working-directory/80/target/scm-test/assertion-copy
[INFO] EXECUTING: bzr branch /home/continuum/continuum-maven/working-directory/80/target/test-branch
/home/continuum/continuum-maven/working-directory/80/target/scm-test/assertion-copy
[INFO] EXECUTING: bzr inventory
EXECUTING: bzr init
EXECUTING: bzr add /home/continuum/continuum-maven/working-directory/80/target/test-branch/pom.xml
/home/continuum/continuum-maven/working-directory/80/target/test-branch/readme.txt /home/continuum/continuum-maven/working-directory/80/target/test-branch/src/main/java/Application.java
/home/continuum/continuum-maven/working-directory/80/target/test-branch/src/test/java/Test.java
EXECUTING: bzr commit --message "Add files to test branch"
[INFO] Removing /home/continuum/continuum-maven/working-directory/80/target/scm-test/working-copy
[INFO] EXECUTING: bzr branch /home/continuum/continuum-maven/working-directory/80/target/test-branch
/home/continuum/continuum-maven/working-directory/80/target/scm-test/working-copy
[INFO] EXECUTING: bzr inventory
[INFO] EXECUTING: bzr add --no-recurse src/main/java/Foo.java
[INFO] [src/main/java/Foo.java:added]
[INFO] EXECUTING: bzr commit --message "Commit message" src/main/java/Foo.java
[INFO] EXECUTING: bzr push /home/continuum/continuum-maven/working-directory/80/target/test-branch
[INFO] Removing /home/continuum/continuum-maven/working-directory/80/target/scm-test/assertion-copy
[INFO] EXECUTING: bzr branch /home/continuum/continuum-maven/working-directory/80/target/test-branch
/home/continuum/continuum-maven/working-directory/80/target/scm-test/assertion-copy
[INFO] EXECUTING: bzr inventory
[surefire] Tests run: 2, Failures: 0, Errors: 0, Time elapsed: 8.089 sec
[surefire] Running org.apache.maven.scm.provider.bazaar.command.checkout.BazaarCheckOutCommandTest
EXECUTING: bzr init
EXECUTING: bzr add /home/continuum/continuum-maven/working-directory/80/target/test-branch/pom.xml
/home/continuum/continuum-maven/working-directory/80/target/test-branch/readme.txt /home/continuum/continuum-maven/working-directory/80/target/test-branch/src/main/java/Application.java
/home/continuum/continuum-maven/working-directory/80/target/test-branch/src/test/java/Test.java
EXECUTING: bzr commit --message "Add files to test branch"
[INFO] Removing /home/continuum/continuum-maven/working-directory/80/target/scm-test/working-copy
[INFO] EXECUTING: bzr branch /home/continuum/continuum-maven/working-directory/80/target/test-branch
/home/continuum/continuum-maven/working-directory/80/target/scm-test/working-copy
[INFO] EXECUTING: bzr inventory
[INFO] Removing /home/continuum/continuum-maven/working-directory/80/target/scm-test/working-copy
[INFO] EXECUTING: bzr branch /home/continuum/continuum-maven/working-directory/80/target/test-branch
/home/continuum/continuum-maven/working-directory/80/target/scm-test/working-copy
[INFO] EXECUTING: bzr inventory
[surefire] Tests run: 1, Failures: 0, Errors: 0, Time elapsed: 1.289 sec
[surefire] Running org.apache.maven.scm.provider.bazaar.command.status.BazaarStatusCommandTest
EXECUTING: bzr init
EXECUTING: bzr add /home/continuum/continuum-maven/working-directory/80/target/test-branch/pom.xml
/home/continuum/continuum-maven/working-directory/80/target/test-branch/readme.txt /home/continuum/continuum-maven/working-directory/80/target/test-branch/src/main/java/Application.java
/home/continuum/continuum-maven/working-directory/80/target/test-branch/src/test/java/Test.java
EXECUTING: bzr commit --message "Add files to test branch"
[INFO] Removing /home/continuum/continuum-maven/working-directory/80/target/scm-test/working-copy
[INFO] EXECUTING: bzr branch /home/continuum/continuum-maven/working-directory/80/target/test-branch
/home/continuum/continuum-maven/working-directory/80/target/scm-test/working-copy
[INFO] EXECUTING: bzr inventory
[INFO] Removing /home/continuum/continuum-maven/working-directory/80/target/scm-test/updating-copy
[INFO] EXECUTING: bzr branch /home/continuum/continuum-maven/working-directory/80/target/test-branch
/home/continuum/continuum-maven/working-directory/80/target/scm-test/updating-copy
[INFO] EXECUTING: bzr inventory
[INFO] EXECUTING: bzr add --no-recurse project.xml
[INFO] [project.xml:added]
[INFO] EXECUTING: bzr status
[INFO] [project.xml:added]
[INFO] [readme.txt:modified]
[INFO] EXECUTING: bzr commit --message "No msg"
[INFO] EXECUTING: bzr push /home/continuum/continuum-maven/working-directory/80/target/test-branch
[INFO] EXECUTING: bzr add --no-recurse src/test/java/org
[INFO] [src/test/java/org:added]
[INFO] EXECUTING: bzr add --no-recurse src/main/java/org
[INFO] [src/main/java/org:added]
[INFO] EXECUTING: bzr add --no-recurse src/main/java/org/Foo.java
[INFO] [src/main/java/org/Foo.java:added]
[INFO] EXECUTING: bzr status
[INFO] New directory added: /home/continuum/continuum-maven/working-directory/80/target/scm-test/updating-copy/src/main/java/org
[INFO] [src/main/java/org/Foo.java:added]
[INFO] New directory added: /home/continuum/continuum-maven/working-directory/80/target/scm-test/updating-copy/src/test/java/org
[INFO] [pom.xml:modified]
[surefire] Tests run: 1, Failures: 0, Errors: 0, Time elapsed: 2.921 sec
[surefire] Running org.apache.maven.scm.provider.bazaar.command.diff.BazaarDiffCommandTest
EXECUTING: bzr init
EXECUTING: bzr add /home/continuum/continuum-maven/working-directory/80/target/test-branch/pom.xml
/home/continuum/continuum-maven/working-directory/80/target/test-branch/readme.txt /home/continuum/continuum-maven/working-directory/80/target/test-branch/src/main/java/Application.java
/home/continuum/continuum-maven/working-directory/80/target/test-branch/src/test/java/Test.java
EXECUTING: bzr commit --message "Add files to test branch"
[INFO] Removing /home/continuum/continuum-maven/working-directory/80/target/scm-test/working-copy
[INFO] EXECUTING: bzr branch /home/continuum/continuum-maven/working-directory/80/target/test-branch
/home/continuum/continuum-maven/working-directory/80/target/scm-test/working-copy
[INFO] EXECUTING: bzr inventory
[INFO] EXECUTING: bzr add --no-recurse project.xml
[INFO] [project.xml:added]
[INFO] EXECUTING: bzr add --no-recurse src/test/java/org
[INFO] [src/test/java/org:added]
[INFO] EXECUTING: bzr add --no-recurse src/main/java/org
[INFO] [src/main/java/org:added]
[INFO] EXECUTING: bzr add --no-recurse src/main/java/org/Foo.java
[INFO] [src/main/java/org/Foo.java:added]
[INFO] EXECUTING: bzr diff
[surefire] Tests run: 1, Failures: 0, Errors: 0, Time elapsed: 1.761 sec
[surefire] Running org.apache.maven.scm.provider.bazaar.command.update.BazaarUpdateCommandTest
EXECUTING: bzr init
EXECUTING: bzr add /home/continuum/continuum-maven/working-directory/80/target/test-branch/pom.xml
/home/continuum/continuum-maven/working-directory/80/target/test-branch/readme.txt /home/continuum/continuum-maven/working-directory/80/target/test-branch/src/main/java/Application.java
/home/continuum/continuum-maven/working-directory/80/target/test-branch/src/test/java/Test.java
EXECUTING: bzr commit --message "Add files to test branch"
[INFO] Removing /home/continuum/continuum-maven/working-directory/80/target/scm-test/working-copy
[INFO] EXECUTING: bzr branch /home/continuum/continuum-maven/working-directory/80/target/test-branch
/home/continuum/continuum-maven/working-directory/80/target/scm-test/working-copy
[INFO] EXECUTING: bzr inventory
[INFO] Removing /home/continuum/continuum-maven/working-directory/80/target/scm-test/updating-copy
[INFO] EXECUTING: bzr branch /home/continuum/continuum-maven/working-directory/80/target/test-branch
/home/continuum/continuum-maven/working-directory/80/target/scm-test/updating-copy
[INFO] EXECUTING: bzr inventory
[INFO] EXECUTING: bzr add --no-recurse project.xml
[INFO] [project.xml:added]
[INFO] EXECUTING: bzr add --no-recurse src/test/java/org
[INFO] [src/test/java/org:added]
[INFO] EXECUTING: bzr add --no-recurse src/main/java/org
[INFO] [src/main/java/org:added]
[INFO] EXECUTING: bzr add --no-recurse src/main/java/org/Foo.java
[INFO] [src/main/java/org/Foo.java:added]
[INFO] EXECUTING: bzr status
[INFO] [project.xml:added]
[INFO] New directory added: /home/continuum/continuum-maven/working-directory/80/target/scm-test/working-copy/src/main/java/org
[INFO] [src/main/java/org/Foo.java:added]
[INFO] New directory added: /home/continuum/continuum-maven/working-directory/80/target/scm-test/working-copy/src/test/java/org
[INFO] [readme.txt:modified]
[INFO] EXECUTING: bzr commit --message "No msg"
[INFO] EXECUTING: bzr push /home/continuum/continuum-maven/working-directory/80/target/test-branch
[INFO] EXECUTING: bzr pull
[INFO] EXECUTING: bzr revno
[INFO] EXECUTING: bzr diff --revision 1
[INFO] EXECUTING: bzr log --verbose
	<changelog-entry>
		<date pattern="yyyy-MM-dd">2006-03-28</date>
		<time pattern="HH:mm:ss">05:05:38</time>
		<author><![CDATA[continuum <continuum@cheddar.simulalabs.com>]]></author>
		<file>
			<name>project.xml</name>
			<revision>2</revision>
		</file>
		<file>
			<name>src/main/java/org/</name>
			<revision>2</revision>
		</file>
		<file>
			<name>src/main/java/org/Foo.java</name>
			<revision>2</revision>
		</file>
		<file>
			<name>src/test/java/org/</name>
			<revision>2</revision>
		</file>
		<file>
			<name>readme.txt</name>
			<revision>2</revision>
		</file>
		<msg><![CDATA[No msg]]></msg>
	</changelog-entry>

[surefire] Tests run: 1, Failures: 0, Errors: 0, Time elapsed: 4.862 sec
[surefire] Running org.apache.maven.scm.provider.bazaar.command.changelog.BazaarChangeLogCommandTckTest
EXECUTING: bzr init
EXECUTING: bzr add /home/continuum/continuum-maven/working-directory/80/target/test-branch/pom.xml
/home/continuum/continuum-maven/working-directory/80/target/test-branch/readme.txt /home/continuum/continuum-maven/working-directory/80/target/test-branch/src/main/java/Application.java
/home/continuum/continuum-maven/working-directory/80/target/test-branch/src/test/java/Test.java
EXECUTING: bzr commit --message "Add files to test branch"
[INFO] Removing /home/continuum/continuum-maven/working-directory/80/target/scm-test/working-copy
[INFO] EXECUTING: bzr branch /home/continuum/continuum-maven/working-directory/80/target/test-branch
/home/continuum/continuum-maven/working-directory/80/target/scm-test/working-copy
[INFO] EXECUTING: bzr inventory
[INFO] EXECUTING: bzr log --verbose
[INFO] EXECUTING: bzr status
[INFO] [readme.txt:modified]
[INFO] EXECUTING: bzr commit --message "Second changelog"
[INFO] EXECUTING: bzr push /home/continuum/continuum-maven/working-directory/80/target/test-branch
[INFO] EXECUTING: bzr log --verbose
[INFO] EXECUTING: bzr log --verbose
[surefire] Tests run: 1, Failures: 1, Errors: 0, Time elapsed: 3.115 sec <<<<<<<<
FAILURE !! 
[surefire] Running org.apache.maven.scm.provider.bazaar.command.changelog.BazaarChangeLogConsumerTest
[surefire] Tests run: 1, Failures: 0, Errors: 0, Time elapsed: 0.031 sec
[INFO] ----------------------------------------------------------------------------
[ERROR] BUILD ERROR
[INFO] ----------------------------------------------------------------------------
[INFO] There are test failures.
[INFO] ----------------------------------------------------------------------------
[INFO] For more information, run Maven with the -e switch
[INFO] ----------------------------------------------------------------------------
[INFO] Total time: 28 seconds
[INFO] Finished at: Tue Mar 28 05:05:42 PST 2006
[INFO] Final Memory: 7M/159M
[INFO] ----------------------------------------------------------------------------

****************************************************************************



Mime
View raw message