maven-notifications mailing list archives

Site index · List index
Message view « Date » · « Thread »
Top « Date » · « Thread »
From Continuum Build Server <contin...@ci.codehaus.org>
Subject [continuum] BUILD FAILURE: Maven Archetype Plugin
Date Fri, 17 Mar 2006 07:19:01 GMT
Online report : http://ci.codehaus.org/continuum-maven/servlet/continuum/target/ProjectBuild.vm/view/ProjectBuild/id/169/buildId/254
Build statistics:
  State: Failed
  Previous State: Error
  Started at: Thu, 16 Mar 2006 23:18:55 -0800
  Finished at: Thu, 16 Mar 2006 23:19:00 -0800
  Total time: 5s
  Build Trigger: Forced
  Exit code: 1
  Building machine hostname: cheddar.simulalabs.com
  Operating system : Linux(unknown)
  Java version : 1.5.0_03(Sun Microsystems Inc.)

Changes
                            169/src/main/java/org/apache/maven/plugin/archetype/MavenArchetypeMojo.java
            169/src/main/java/org/apache/maven/plugin/archetype/CreateArchetypeFromProjectMojo.java
            169/src/main/resources/plexus.xml
            169/pom.xml
        
****************************************************************************
Output:
****************************************************************************
[INFO] Scanning for projects...
[INFO] ----------------------------------------------------------------------------
[INFO] Building Maven Archetype Plugin
[INFO]    task-segment: [clean, install]
[INFO] ----------------------------------------------------------------------------
[INFO] [clean:clean]
[INFO] Deleting directory /home/nobody/continuum-maven/working-directory/169/target
[INFO] Deleting directory /home/nobody/continuum-maven/working-directory/169/target/classes
[INFO] Deleting directory /home/nobody/continuum-maven/working-directory/169/target/test-classes
[INFO] [plugin:descriptor]
[INFO] [resources:resources]
[INFO] Using default encoding to copy filtered resources.
[INFO] snapshot org.apache.maven.archetype:maven-archetype-creator:0.7-SNAPSHOT: checking
for updates from snapshots
[INFO] snapshot org.apache.maven.archetype:maven-archetype-creator:0.7-SNAPSHOT: checking
for updates from apache.snapshots
[INFO] snapshot org.apache.maven.archetype:maven-archetype:0.7-SNAPSHOT: checking for updates
from snapshots
[INFO] snapshot org.apache.maven.archetype:maven-archetype:0.7-SNAPSHOT: checking for updates
from apache.snapshots
[INFO] snapshot org.apache.maven.archetype:maven-archetype-model:0.7-SNAPSHOT: checking for
updates from snapshots
[INFO] snapshot org.apache.maven.archetype:maven-archetype-core:0.7-SNAPSHOT: checking for
updates from snapshots
[INFO] snapshot org.apache.maven.archetype:maven-archetype-core:0.7-SNAPSHOT: checking for
updates from apache.snapshots
[INFO] [compiler:compile]
Compiling 2 source files to /home/nobody/continuum-maven/working-directory/169/target/classes
[INFO] ----------------------------------------------------------------------------
[ERROR] BUILD FAILURE
[INFO] ----------------------------------------------------------------------------
[INFO] Compilation failure

/home/nobody/continuum-maven/working-directory/169/src/main/java/org/apache/maven/plugin/archetype/MavenArchetypeMojo.java:[27,31]
cannot find symbol
symbol  : class AbstractMojo
location: package org.apache.maven.plugin

/home/nobody/continuum-maven/working-directory/169/src/main/java/org/apache/maven/plugin/archetype/MavenArchetypeMojo.java:[28,31]
cannot find symbol
symbol  : class MojoExecutionException
location: package org.apache.maven.plugin

/home/nobody/continuum-maven/working-directory/169/src/main/java/org/apache/maven/plugin/archetype/MavenArchetypeMojo.java:[47,12]
cannot find symbol
symbol: class AbstractMojo
    extends AbstractMojo

/home/nobody/continuum-maven/working-directory/169/src/main/java/org/apache/maven/plugin/archetype/MavenArchetypeMojo.java:[124,15]
cannot find symbol
symbol  : class MojoExecutionException
location: class org.apache.maven.plugin.archetype.MavenArchetypeMojo

/home/nobody/continuum-maven/working-directory/169/src/main/java/org/apache/maven/plugin/archetype/CreateArchetypeFromProjectMojo.java:[6,31]
cannot find symbol
symbol  : class AbstractMojo
location: package org.apache.maven.plugin

/home/nobody/continuum-maven/working-directory/169/src/main/java/org/apache/maven/plugin/archetype/CreateArchetypeFromProjectMojo.java:[7,31]
cannot find symbol
symbol  : class MojoExecutionException
location: package org.apache.maven.plugin

/home/nobody/continuum-maven/working-directory/169/src/main/java/org/apache/maven/plugin/archetype/CreateArchetypeFromProjectMojo.java:[37,12]
cannot find symbol
symbol: class AbstractMojo
    extends AbstractMojo

/home/nobody/continuum-maven/working-directory/169/src/main/java/org/apache/maven/plugin/archetype/CreateArchetypeFromProjectMojo.java:[77,15]
cannot find symbol
symbol  : class MojoExecutionException
location: class org.apache.maven.plugin.archetype.CreateArchetypeFromProjectMojo

/home/nobody/continuum-maven/working-directory/169/src/main/java/org/apache/maven/plugin/archetype/MavenArchetypeMojo.java:[143,12]
cannot find symbol
symbol  : method getLog()
location: class org.apache.maven.plugin.archetype.MavenArchetypeMojo

/home/nobody/continuum-maven/working-directory/169/src/main/java/org/apache/maven/plugin/archetype/MavenArchetypeMojo.java:[167,12]
cannot find symbol
symbol  : method getLog()
location: class org.apache.maven.plugin.archetype.MavenArchetypeMojo

/home/nobody/continuum-maven/working-directory/169/src/main/java/org/apache/maven/plugin/archetype/MavenArchetypeMojo.java:[185,22]
cannot find symbol
symbol  : class MojoExecutionException
location: class org.apache.maven.plugin.archetype.MavenArchetypeMojo

/home/nobody/continuum-maven/working-directory/169/src/main/java/org/apache/maven/plugin/archetype/MavenArchetypeMojo.java:[189,22]
cannot find symbol
symbol  : class MojoExecutionException
location: class org.apache.maven.plugin.archetype.MavenArchetypeMojo

/home/nobody/continuum-maven/working-directory/169/src/main/java/org/apache/maven/plugin/archetype/MavenArchetypeMojo.java:[193,22]
cannot find symbol
symbol  : class MojoExecutionException
location: class org.apache.maven.plugin.archetype.MavenArchetypeMojo

/home/nobody/continuum-maven/working-directory/169/src/main/java/org/apache/maven/plugin/archetype/CreateArchetypeFromProjectMojo.java:[91,22]
cannot find symbol
symbol  : class MojoExecutionException
location: class org.apache.maven.plugin.archetype.CreateArchetypeFromProjectMojo


[INFO] ----------------------------------------------------------------------------
[INFO] For more information, run Maven with the -e switch
[INFO] ----------------------------------------------------------------------------
[INFO] Total time: 4 seconds
[INFO] Finished at: Thu Mar 16 23:19:00 PST 2006
[INFO] Final Memory: 9M/123M
[INFO] ----------------------------------------------------------------------------

****************************************************************************



Mime
View raw message